Build failed in Jenkins: maven-plugin-tools-jdk-1.7 #159

Previous Topic Next Topic
 
classic Classic list List threaded Threaded
2 messages Options
Reply | Threaded
Open this post in threaded view
|

Build failed in Jenkins: maven-plugin-tools-jdk-1.7 #159

Apache Jenkins Server-2
See <https://builds.apache.org/job/maven-plugin-tools-jdk-1.7/159/display/redirect?page=changes>

Changes:

[Robert Scholte] [MPLUGIN-324] javadoc generated by helpmojo goal of maven-plugin-plugin produces build failures

------------------------------------------
[...truncated 132.89 KB...]
[INFO]
[INFO] --- maven-compiler-plugin:3.5.1:compile (default-compile) @ maven-plugin-tools-annotations ---
[INFO] Changes detected - recompiling the module!
[INFO] Compiling 14 source files to <https://builds.apache.org/job/maven-plugin-tools-jdk-1.7/ws/maven-plugin-tools-annotations/target/classes>
[INFO]
[INFO] --- plexus-component-metadata:1.7:generate-metadata (default) @ maven-plugin-tools-annotations ---
[INFO] Discovered 2 component descriptors(s)
[INFO]
[INFO] --- maven-resources-plugin:2.7:testResources (default-testResources) @ maven-plugin-tools-annotations ---
[INFO] Using 'UTF-8' encoding to copy filtered resources.
[INFO] Copying 2 resources
[INFO] Copying 3 resources
[INFO]
[INFO] --- maven-compiler-plugin:3.5.1:testCompile (default-testCompile) @ maven-plugin-tools-annotations ---
[INFO] Changes detected - recompiling the module!
[INFO] Compiling 3 source files to <https://builds.apache.org/job/maven-plugin-tools-jdk-1.7/ws/maven-plugin-tools-annotations/target/test-classes>
[INFO]
[INFO] --- plexus-component-metadata:1.7:generate-test-metadata (default) @ maven-plugin-tools-annotations ---
[INFO]
[INFO] --- maven-surefire-plugin:2.19.1:test (default-test) @ maven-plugin-tools-annotations ---
[INFO] Surefire report directory: <https://builds.apache.org/job/maven-plugin-tools-jdk-1.7/ws/maven-plugin-tools-annotations/target/surefire-reports>

-------------------------------------------------------
 T E S T S
-------------------------------------------------------
Running org.apache.maven.tools.plugin.extractor.annotations.scanner.DefaultMojoAnnotationsScannerTest
Tests run: 2, Failures: 0, Errors: 0, Skipped: 0, Time elapsed: 0.407 sec - in org.apache.maven.tools.plugin.extractor.annotations.scanner.DefaultMojoAnnotationsScannerTest
Running org.apache.maven.tools.plugin.extractor.annotations.TestAnnotationsReader
mojoAnnotatedClasses:{org.apache.maven.tools.plugin.extractor.annotations.FooMojo=MojoAnnotatedClass{className='org.apache.maven.tools.plugin.extractor.annotations.FooMojo', parentClassName='org.apache.maven.plugin.AbstractMojo', mojo=MojoAnnotationContent{name='foo', defaultPhase=COMPILE, requiresDependencyResolution='NONE', requiresDependencyCollection='NONE', instantiationStrategy='PER_LOOKUP', executionStrategy='once-per-session', requiresProject=true, requiresReports=false, aggregator=false, requiresDirectInvocation=false, requiresOnline=false, inheritByDefault=true, configurator='null', threadSafe=true}, execute=ExecuteAnnotationContent{goal='compiler', lifecycle='my-lifecycle', phase=PACKAGE}, parameters={beer=AnnotatedField{fieldName='beer'}ParameterAnnotationContent{name='null', alias='null', property='thebeer', defaultValue='coolbeer', required=false, readonly=false}, bar=AnnotatedField{fieldName='bar'}ParameterAnnotationContent{name='null', alias='null', property='thebar', defaultValue='coolbar', required=true, readonly=false}}, components={compilerManager=AnnotatedField{fieldName='compilerManager'}ComponentAnnotationContent{role='org.codehaus.plexus.compiler.manager.CompilerManager', hint='null'}, artifactMetadataSource=AnnotatedField{fieldName='artifactMetadataSource'}ComponentAnnotationContent{role='org.apache.maven.artifact.metadata.ArtifactMetadataSource', hint='maven'}}}}
Tests run: 1, Failures: 0, Errors: 0, Skipped: 0, Time elapsed: 0.064 sec - in org.apache.maven.tools.plugin.extractor.annotations.TestAnnotationsReader

Results :

Tests run: 3, Failures: 0, Errors: 0, Skipped: 0

[JENKINS] Recording test results
[INFO]
[INFO] --- maven-jar-plugin:3.0.0:jar (default-jar) @ maven-plugin-tools-annotations ---
[INFO] Building jar: <https://builds.apache.org/job/maven-plugin-tools-jdk-1.7/ws/maven-plugin-tools-annotations/target/maven-plugin-tools-annotations-3.5.1-SNAPSHOT.jar>
[INFO]
[INFO] --- maven-site-plugin:3.5.1:attach-descriptor (attach-descriptor) @ maven-plugin-tools-annotations ---
[INFO]
[INFO] --- maven-jar-plugin:3.0.0:test-jar (default) @ maven-plugin-tools-annotations ---
[INFO] Building jar: <https://builds.apache.org/job/maven-plugin-tools-jdk-1.7/ws/maven-plugin-tools-annotations/target/maven-plugin-tools-annotations-3.5.1-SNAPSHOT-tests.jar>
[INFO]
[INFO] --- maven-source-plugin:3.0.0:test-jar-no-fork (default) @ maven-plugin-tools-annotations ---
[INFO] Building jar: <https://builds.apache.org/job/maven-plugin-tools-jdk-1.7/ws/maven-plugin-tools-annotations/target/maven-plugin-tools-annotations-3.5.1-SNAPSHOT-test-sources.jar>
[INFO]
[INFO] --- maven-checkstyle-plugin:2.15:check (checkstyle-check) @ maven-plugin-tools-annotations ---
[INFO]
[INFO] --- maven-install-plugin:2.5.2:install (default-install) @ maven-plugin-tools-annotations ---
[INFO] Installing <https://builds.apache.org/job/maven-plugin-tools-jdk-1.7/ws/maven-plugin-tools-annotations/target/maven-plugin-tools-annotations-3.5.1-SNAPSHOT.jar> to /home/jenkins/jenkins-slave/maven-repositories/1/org/apache/maven/plugin-tools/maven-plugin-tools-annotations/3.5.1-SNAPSHOT/maven-plugin-tools-annotations-3.5.1-SNAPSHOT.jar
[INFO] Installing <https://builds.apache.org/job/maven-plugin-tools-jdk-1.7/ws/maven-plugin-tools-annotations/pom.xml> to /home/jenkins/jenkins-slave/maven-repositories/1/org/apache/maven/plugin-tools/maven-plugin-tools-annotations/3.5.1-SNAPSHOT/maven-plugin-tools-annotations-3.5.1-SNAPSHOT.pom
[INFO] Installing <https://builds.apache.org/job/maven-plugin-tools-jdk-1.7/ws/maven-plugin-tools-annotations/target/maven-plugin-tools-annotations-3.5.1-SNAPSHOT-tests.jar> to /home/jenkins/jenkins-slave/maven-repositories/1/org/apache/maven/plugin-tools/maven-plugin-tools-annotations/3.5.1-SNAPSHOT/maven-plugin-tools-annotations-3.5.1-SNAPSHOT-tests.jar
[INFO] Installing <https://builds.apache.org/job/maven-plugin-tools-jdk-1.7/ws/maven-plugin-tools-annotations/target/maven-plugin-tools-annotations-3.5.1-SNAPSHOT-test-sources.jar> to /home/jenkins/jenkins-slave/maven-repositories/1/org/apache/maven/plugin-tools/maven-plugin-tools-annotations/3.5.1-SNAPSHOT/maven-plugin-tools-annotations-3.5.1-SNAPSHOT-test-sources.jar
[INFO]                                                                        
[INFO] ------------------------------------------------------------------------
[INFO] Building Maven Plugin Tools Javadoc Taglets 3.5.1-SNAPSHOT
[INFO] ------------------------------------------------------------------------
Downloading: http://repo.maven.apache.org/maven2/org/apache/maven/plugins/maven-invoker-plugin/1.10/maven-invoker-plugin-1.10.pom
Downloaded: http://repo.maven.apache.org/maven2/org/apache/maven/plugins/maven-invoker-plugin/1.10/maven-invoker-plugin-1.10.pom (11 KB at 640.8 KB/sec)
Downloading: http://repo.maven.apache.org/maven2/org/apache/maven/plugins/maven-invoker-plugin/1.10/maven-invoker-plugin-1.10.jar
Downloaded: http://repo.maven.apache.org/maven2/org/apache/maven/plugins/maven-invoker-plugin/1.10/maven-invoker-plugin-1.10.jar (103 KB at 3943.8 KB/sec)
[INFO]
[INFO] --- maven-clean-plugin:3.0.0:clean (default-clean) @ maven-plugin-tools-javadoc ---
[INFO]
[INFO] --- maven-enforcer-plugin:1.4.1:enforce (enforce-bytecode-version) @ maven-plugin-tools-javadoc ---
[INFO]
[INFO] --- maven-enforcer-plugin:1.4.1:enforce (ban-known-bad-maven-versions) @ maven-plugin-tools-javadoc ---
[INFO]
[INFO] --- apache-rat-plugin:0.11:check (rat-check) @ maven-plugin-tools-javadoc ---
[INFO] 51 implicit excludes (use -debug for more details).
[INFO] Exclude: DEPENDENCIES
[INFO] 33 resources included (use -debug for more details)
[INFO] Rat check: Summary of files. Unapproved: 0 unknown: 0 generated: 0 approved: 32 licence.
[INFO]
[INFO] --- maven-remote-resources-plugin:1.5:process (process-resource-bundles) @ maven-plugin-tools-javadoc ---
[INFO]
[INFO] --- maven-resources-plugin:2.7:resources (default-resources) @ maven-plugin-tools-javadoc ---
[INFO] Using 'UTF-8' encoding to copy filtered resources.
[INFO] skip non existing resourceDirectory <https://builds.apache.org/job/maven-plugin-tools-jdk-1.7/ws/maven-plugin-tools-javadoc/src/main/resources>
[INFO] Copying 3 resources
[INFO]
[INFO] --- maven-compiler-plugin:3.5.1:compile (default-compile) @ maven-plugin-tools-javadoc ---
[INFO] Changes detected - recompiling the module!
[INFO] Compiling 22 source files to <https://builds.apache.org/job/maven-plugin-tools-jdk-1.7/ws/maven-plugin-tools-javadoc/target/classes>
[INFO]
[INFO] --- maven-resources-plugin:2.7:testResources (default-testResources) @ maven-plugin-tools-javadoc ---
[INFO] Using 'UTF-8' encoding to copy filtered resources.
[INFO] skip non existing resourceDirectory <https://builds.apache.org/job/maven-plugin-tools-jdk-1.7/ws/maven-plugin-tools-javadoc/src/test/resources>
[INFO] Copying 3 resources
[INFO]
[INFO] --- maven-compiler-plugin:3.5.1:testCompile (default-testCompile) @ maven-plugin-tools-javadoc ---
[INFO] No sources to compile
[INFO]
[INFO] --- maven-surefire-plugin:2.19.1:test (default-test) @ maven-plugin-tools-javadoc ---
[JENKINS] Recording test results
[INFO]
[INFO] --- maven-jar-plugin:3.0.0:jar (default-jar) @ maven-plugin-tools-javadoc ---
[INFO] Building jar: <https://builds.apache.org/job/maven-plugin-tools-jdk-1.7/ws/maven-plugin-tools-javadoc/target/maven-plugin-tools-javadoc-3.5.1-SNAPSHOT.jar>
[INFO]
[INFO] --- maven-site-plugin:3.5.1:attach-descriptor (attach-descriptor) @ maven-plugin-tools-javadoc ---
[INFO]
[INFO] --- maven-invoker-plugin:1.10:install (integration-test) @ maven-plugin-tools-javadoc ---
[INFO] Installing <https://builds.apache.org/job/maven-plugin-tools-jdk-1.7/ws/pom.xml> to <https://builds.apache.org/job/maven-plugin-tools-jdk-1.7/ws/maven-plugin-tools-javadoc/target/local-repo/org/apache/maven/plugin-tools/maven-plugin-tools/3.5.1-SNAPSHOT/maven-plugin-tools-3.5.1-SNAPSHOT.pom>
[INFO] Installing <https://builds.apache.org/job/maven-plugin-tools-jdk-1.7/ws/target/maven-plugin-tools-3.5.1-SNAPSHOT-site.xml> to <https://builds.apache.org/job/maven-plugin-tools-jdk-1.7/ws/maven-plugin-tools-javadoc/target/local-repo/org/apache/maven/plugin-tools/maven-plugin-tools/3.5.1-SNAPSHOT/maven-plugin-tools-3.5.1-SNAPSHOT-site.xml>
[INFO] Installing <https://builds.apache.org/job/maven-plugin-tools-jdk-1.7/ws/maven-plugin-tools-api/pom.xml> to <https://builds.apache.org/job/maven-plugin-tools-jdk-1.7/ws/maven-plugin-tools-javadoc/target/local-repo/org/apache/maven/plugin-tools/maven-plugin-tools-api/3.5.1-SNAPSHOT/maven-plugin-tools-api-3.5.1-SNAPSHOT.pom>
[INFO] Installing <https://builds.apache.org/job/maven-plugin-tools-jdk-1.7/ws/maven-plugin-tools-api/target/maven-plugin-tools-api-3.5.1-SNAPSHOT.jar> to <https://builds.apache.org/job/maven-plugin-tools-jdk-1.7/ws/maven-plugin-tools-javadoc/target/local-repo/org/apache/maven/plugin-tools/maven-plugin-tools-api/3.5.1-SNAPSHOT/maven-plugin-tools-api-3.5.1-SNAPSHOT.jar>
[INFO] Installing <https://builds.apache.org/job/maven-plugin-tools-jdk-1.7/ws/maven-plugin-tools-api/pom.xml> to <https://builds.apache.org/job/maven-plugin-tools-jdk-1.7/ws/maven-plugin-tools-javadoc/target/local-repo/org/apache/maven/plugin-tools/maven-plugin-tools-api/3.5.1-SNAPSHOT/maven-plugin-tools-api-3.5.1-SNAPSHOT.pom>
[INFO] Installing <https://builds.apache.org/job/maven-plugin-tools-jdk-1.7/ws/maven-plugin-tools-generators/pom.xml> to <https://builds.apache.org/job/maven-plugin-tools-jdk-1.7/ws/maven-plugin-tools-javadoc/target/local-repo/org/apache/maven/plugin-tools/maven-plugin-tools-generators/3.5.1-SNAPSHOT/maven-plugin-tools-generators-3.5.1-SNAPSHOT.pom>
[INFO] Installing <https://builds.apache.org/job/maven-plugin-tools-jdk-1.7/ws/maven-plugin-tools-generators/target/maven-plugin-tools-generators-3.5.1-SNAPSHOT.jar> to <https://builds.apache.org/job/maven-plugin-tools-jdk-1.7/ws/maven-plugin-tools-javadoc/target/local-repo/org/apache/maven/plugin-tools/maven-plugin-tools-generators/3.5.1-SNAPSHOT/maven-plugin-tools-generators-3.5.1-SNAPSHOT.jar>
[INFO] Installing <https://builds.apache.org/job/maven-plugin-tools-jdk-1.7/ws/maven-plugin-tools-generators/pom.xml> to <https://builds.apache.org/job/maven-plugin-tools-jdk-1.7/ws/maven-plugin-tools-javadoc/target/local-repo/org/apache/maven/plugin-tools/maven-plugin-tools-generators/3.5.1-SNAPSHOT/maven-plugin-tools-generators-3.5.1-SNAPSHOT.pom>
[INFO] Installing <https://builds.apache.org/job/maven-plugin-tools-jdk-1.7/ws/maven-plugin-tools-java/pom.xml> to <https://builds.apache.org/job/maven-plugin-tools-jdk-1.7/ws/maven-plugin-tools-javadoc/target/local-repo/org/apache/maven/plugin-tools/maven-plugin-tools-java/3.5.1-SNAPSHOT/maven-plugin-tools-java-3.5.1-SNAPSHOT.pom>
[INFO] Installing <https://builds.apache.org/job/maven-plugin-tools-jdk-1.7/ws/maven-plugin-tools-java/target/maven-plugin-tools-java-3.5.1-SNAPSHOT.jar> to <https://builds.apache.org/job/maven-plugin-tools-jdk-1.7/ws/maven-plugin-tools-javadoc/target/local-repo/org/apache/maven/plugin-tools/maven-plugin-tools-java/3.5.1-SNAPSHOT/maven-plugin-tools-java-3.5.1-SNAPSHOT.jar>
[INFO] Installing <https://builds.apache.org/job/maven-plugin-tools-jdk-1.7/ws/maven-plugin-tools-java/pom.xml> to <https://builds.apache.org/job/maven-plugin-tools-jdk-1.7/ws/maven-plugin-tools-javadoc/target/local-repo/org/apache/maven/plugin-tools/maven-plugin-tools-java/3.5.1-SNAPSHOT/maven-plugin-tools-java-3.5.1-SNAPSHOT.pom>
[INFO] Installing <https://builds.apache.org/job/maven-plugin-tools-jdk-1.7/ws/maven-plugin-annotations/pom.xml> to <https://builds.apache.org/job/maven-plugin-tools-jdk-1.7/ws/maven-plugin-tools-javadoc/target/local-repo/org/apache/maven/plugin-tools/maven-plugin-annotations/3.5.1-SNAPSHOT/maven-plugin-annotations-3.5.1-SNAPSHOT.pom>
[INFO] Installing <https://builds.apache.org/job/maven-plugin-tools-jdk-1.7/ws/maven-plugin-annotations/target/maven-plugin-annotations-3.5.1-SNAPSHOT.jar> to <https://builds.apache.org/job/maven-plugin-tools-jdk-1.7/ws/maven-plugin-tools-javadoc/target/local-repo/org/apache/maven/plugin-tools/maven-plugin-annotations/3.5.1-SNAPSHOT/maven-plugin-annotations-3.5.1-SNAPSHOT.jar>
[INFO] Installing <https://builds.apache.org/job/maven-plugin-tools-jdk-1.7/ws/maven-plugin-annotations/pom.xml> to <https://builds.apache.org/job/maven-plugin-tools-jdk-1.7/ws/maven-plugin-tools-javadoc/target/local-repo/org/apache/maven/plugin-tools/maven-plugin-annotations/3.5.1-SNAPSHOT/maven-plugin-annotations-3.5.1-SNAPSHOT.pom>
[INFO] Installing <https://builds.apache.org/job/maven-plugin-tools-jdk-1.7/ws/maven-plugin-tools-annotations/pom.xml> to <https://builds.apache.org/job/maven-plugin-tools-jdk-1.7/ws/maven-plugin-tools-javadoc/target/local-repo/org/apache/maven/plugin-tools/maven-plugin-tools-annotations/3.5.1-SNAPSHOT/maven-plugin-tools-annotations-3.5.1-SNAPSHOT.pom>
[INFO] Installing <https://builds.apache.org/job/maven-plugin-tools-jdk-1.7/ws/maven-plugin-tools-annotations/target/maven-plugin-tools-annotations-3.5.1-SNAPSHOT.jar> to <https://builds.apache.org/job/maven-plugin-tools-jdk-1.7/ws/maven-plugin-tools-javadoc/target/local-repo/org/apache/maven/plugin-tools/maven-plugin-tools-annotations/3.5.1-SNAPSHOT/maven-plugin-tools-annotations-3.5.1-SNAPSHOT.jar>
[INFO] Installing <https://builds.apache.org/job/maven-plugin-tools-jdk-1.7/ws/maven-plugin-tools-annotations/pom.xml> to <https://builds.apache.org/job/maven-plugin-tools-jdk-1.7/ws/maven-plugin-tools-javadoc/target/local-repo/org/apache/maven/plugin-tools/maven-plugin-tools-annotations/3.5.1-SNAPSHOT/maven-plugin-tools-annotations-3.5.1-SNAPSHOT.pom>
[INFO] Installing <https://builds.apache.org/job/maven-plugin-tools-jdk-1.7/ws/maven-plugin-tools-annotations/target/maven-plugin-tools-annotations-3.5.1-SNAPSHOT-tests.jar> to <https://builds.apache.org/job/maven-plugin-tools-jdk-1.7/ws/maven-plugin-tools-javadoc/target/local-repo/org/apache/maven/plugin-tools/maven-plugin-tools-annotations/3.5.1-SNAPSHOT/maven-plugin-tools-annotations-3.5.1-SNAPSHOT-tests.jar>
[INFO] Installing <https://builds.apache.org/job/maven-plugin-tools-jdk-1.7/ws/maven-plugin-tools-annotations/target/maven-plugin-tools-annotations-3.5.1-SNAPSHOT-test-sources.jar> to <https://builds.apache.org/job/maven-plugin-tools-jdk-1.7/ws/maven-plugin-tools-javadoc/target/local-repo/org/apache/maven/plugin-tools/maven-plugin-tools-annotations/3.5.1-SNAPSHOT/maven-plugin-tools-annotations-3.5.1-SNAPSHOT-test-sources.jar>
[INFO] Installing <https://builds.apache.org/job/maven-plugin-tools-jdk-1.7/ws/maven-plugin-tools-javadoc/pom.xml> to <https://builds.apache.org/job/maven-plugin-tools-jdk-1.7/ws/maven-plugin-tools-javadoc/target/local-repo/org/apache/maven/plugin-tools/maven-plugin-tools-javadoc/3.5.1-SNAPSHOT/maven-plugin-tools-javadoc-3.5.1-SNAPSHOT.pom>
[INFO] Installing <https://builds.apache.org/job/maven-plugin-tools-jdk-1.7/ws/maven-plugin-tools-javadoc/target/maven-plugin-tools-javadoc-3.5.1-SNAPSHOT.jar> to <https://builds.apache.org/job/maven-plugin-tools-jdk-1.7/ws/maven-plugin-tools-javadoc/target/local-repo/org/apache/maven/plugin-tools/maven-plugin-tools-javadoc/3.5.1-SNAPSHOT/maven-plugin-tools-javadoc-3.5.1-SNAPSHOT.jar>
[INFO]
[INFO] --- maven-invoker-plugin:1.10:run (integration-test) @ maven-plugin-tools-javadoc ---
[INFO] Building: basic/pom.xml
[INFO] run script verify.bsh.bsh
[INFO] ..SUCCESS (6.8 s)
[INFO] -------------------------------------------------
[INFO] Build Summary:
[INFO]   Passed: 1, Failed: 0, Errors: 0, Skipped: 0
[INFO] -------------------------------------------------
MavenInvokerArchiver
found reports:[<https://builds.apache.org/job/maven-plugin-tools-jdk-1.7/ws/maven-plugin-tools-javadoc/target/invoker-reports/BUILD-basic.xml]>
java.lang.reflect.InvocationTargetException
        at sun.reflect.NativeMethodAccessorImpl.invoke0(Native Method)
        at sun.reflect.NativeMethodAccessorImpl.invoke(NativeMethodAccessorImpl.java:62)
        at sun.reflect.DelegatingMethodAccessorImpl.invoke(DelegatingMethodAccessorImpl.java:43)
        at java.lang.reflect.Method.invoke(Method.java:498)
        at org.codehaus.plexus.classworlds.launcher.Launcher.launchStandard(Launcher.java:329)
        at org.codehaus.plexus.classworlds.launcher.Launcher.launch(Launcher.java:239)
        at org.jvnet.hudson.maven3.agent.Maven3Main.launch(Maven3Main.java:181)
        at sun.reflect.NativeMethodAccessorImpl.invoke0(Native Method)
        at sun.reflect.NativeMethodAccessorImpl.invoke(NativeMethodAccessorImpl.java:62)
        at sun.reflect.DelegatingMethodAccessorImpl.invoke(DelegatingMethodAccessorImpl.java:43)
        at java.lang.reflect.Method.invoke(Method.java:498)
        at hudson.maven.Maven3Builder.call(Maven3Builder.java:139)
        at hudson.maven.Maven3Builder.call(Maven3Builder.java:70)
        at hudson.remoting.UserRequest.perform(UserRequest.java:153)
        at hudson.remoting.UserRequest.perform(UserRequest.java:50)
        at hudson.remoting.Request$2.run(Request.java:336)
        at hudson.remoting.InterceptingExecutorService$1.call(InterceptingExecutorService.java:68)
        at java.util.concurrent.FutureTask.run(FutureTask.java:266)
        at java.util.concurrent.ThreadPoolExecutor.runWorker(ThreadPoolExecutor.java:1142)
        at java.util.concurrent.ThreadPoolExecutor$Worker.run(ThreadPoolExecutor.java:617)
        at java.lang.Thread.run(Thread.java:748)
Caused by: java.lang.NoSuchMethodError: org.codehaus.plexus.util.xml.pull.MXParser.<init>(Lorg/codehaus/plexus/util/xml/pull/EntityReplacementMap;)V
        at org.apache.maven.plugin.invoker.model.io.xpp3.BuildJobXpp3Reader.read(BuildJobXpp3Reader.java:510)
        at org.apache.maven.plugin.invoker.model.io.xpp3.BuildJobXpp3Reader.read(BuildJobXpp3Reader.java:529)
        at org.apache.maven.plugin.invoker.model.io.xpp3.BuildJobXpp3Reader.read(BuildJobXpp3Reader.java:558)
        at org.jenkinsci.plugins.maveninvoker.MavenInvokerArchiver.postExecute(MavenInvokerArchiver.java:113)
        at hudson.maven.Maven3Builder$MavenExecutionListener.recordMojoEnded(Maven3Builder.java:629)
        at hudson.maven.Maven3Builder$MavenExecutionListener.mojoSucceeded(Maven3Builder.java:610)
        at org.apache.maven.lifecycle.internal.DefaultExecutionEventCatapult.fire(DefaultExecutionEventCatapult.java:87)
        at org.apache.maven.lifecycle.internal.DefaultExecutionEventCatapult.fire(DefaultExecutionEventCatapult.java:42)
        at org.apache.maven.lifecycle.internal.MojoExecutor.execute(MojoExecutor.java:228)
        at org.apache.maven.lifecycle.internal.MojoExecutor.execute(MojoExecutor.java:153)
        at org.apache.maven.lifecycle.internal.MojoExecutor.execute(MojoExecutor.java:145)
        at org.apache.maven.lifecycle.internal.LifecycleModuleBuilder.buildProject(LifecycleModuleBuilder.java:84)
        at org.apache.maven.lifecycle.internal.LifecycleModuleBuilder.buildProject(LifecycleModuleBuilder.java:59)
        at org.apache.maven.lifecycle.internal.LifecycleStarter.singleThreadedBuild(LifecycleStarter.java:183)
        at org.apache.maven.lifecycle.internal.LifecycleStarter.execute(LifecycleStarter.java:161)
        at org.apache.maven.DefaultMaven.doExecute(DefaultMaven.java:320)
        at org.apache.maven.DefaultMaven.execute(DefaultMaven.java:156)
        at org.jvnet.hudson.maven3.launcher.Maven3Launcher.main(Maven3Launcher.java:117)
        ... 21 more
ERROR: Failed to parse POMs
java.io.IOException: java.lang.reflect.InvocationTargetException
        at hudson.maven.Maven3Builder.call(Maven3Builder.java:179)
        at hudson.maven.Maven3Builder.call(Maven3Builder.java:70)
        at hudson.remoting.UserRequest.perform(UserRequest.java:153)
        at hudson.remoting.UserRequest.perform(UserRequest.java:50)
        at hudson.remoting.Request$2.run(Request.java:336)
        at hudson.remoting.InterceptingExecutorService$1.call(InterceptingExecutorService.java:68)
        at java.util.concurrent.FutureTask.run(FutureTask.java:266)
        at java.util.concurrent.ThreadPoolExecutor.runWorker(ThreadPoolExecutor.java:1142)
        at java.util.concurrent.ThreadPoolExecutor$Worker.run(ThreadPoolExecutor.java:617)
        at java.lang.Thread.run(Thread.java:748)
        at ......remote call to Channel to Maven [/usr/local/asfpackages/java/jdk1.8.0_131/jre/bin/java, -Xmx2g, -Xms256m, -cp, /home/jenkins/jenkins-slave/maven3-agent.jar:/home/jenkins/tools/maven/apache-maven-3.0.5/boot/plexus-classworlds-2.4.jar, org.jvnet.hudson.maven3.agent.Maven3Main, /home/jenkins/tools/maven/apache-maven-3.0.5, /home/jenkins/jenkins-slave/slave.jar, /home/jenkins/jenkins-slave/maven3-interceptor.jar, /home/jenkins/jenkins-slave/maven3-interceptor-commons.jar, 34204](Native Method)
        at hudson.remoting.Channel.attachCallSiteStackTrace(Channel.java:1545)
        at hudson.remoting.UserResponse.retrieve(UserRequest.java:253)
        at hudson.remoting.Channel.call(Channel.java:830)
        at hudson.maven.ProcessCache$MavenProcess.call(ProcessCache.java:161)
        at hudson.maven.MavenModuleSetBuild$MavenModuleSetBuildExecution.doRun(MavenModuleSetBuild.java:878)
        at hudson.model.AbstractBuild$AbstractBuildExecution.run(AbstractBuild.java:490)
        at hudson.model.Run.execute(Run.java:1735)
        at hudson.maven.MavenModuleSetBuild.run(MavenModuleSetBuild.java:542)
        at hudson.model.ResourceController.execute(ResourceController.java:97)
        at hudson.model.Executor.run(Executor.java:405)
Caused by: java.lang.reflect.InvocationTargetException
        at sun.reflect.NativeMethodAccessorImpl.invoke0(Native Method)
        at sun.reflect.NativeMethodAccessorImpl.invoke(NativeMethodAccessorImpl.java:62)
        at sun.reflect.DelegatingMethodAccessorImpl.invoke(DelegatingMethodAccessorImpl.java:43)
        at java.lang.reflect.Method.invoke(Method.java:498)
        at hudson.maven.Maven3Builder.call(Maven3Builder.java:139)
        at hudson.maven.Maven3Builder.call(Maven3Builder.java:70)
        at hudson.remoting.UserRequest.perform(UserRequest.java:153)
        at hudson.remoting.UserRequest.perform(UserRequest.java:50)
        at hudson.remoting.Request$2.run(Request.java:336)
        at hudson.remoting.InterceptingExecutorService$1.call(InterceptingExecutorService.java:68)
        at java.util.concurrent.FutureTask.run(FutureTask.java:266)
        at java.util.concurrent.ThreadPoolExecutor.runWorker(ThreadPoolExecutor.java:1142)
        at java.util.concurrent.ThreadPoolExecutor$Worker.run(ThreadPoolExecutor.java:617)
        at java.lang.Thread.run(Thread.java:748)
Caused by: java.lang.Exception: java.lang.reflect.InvocationTargetException
        at org.jvnet.hudson.maven3.agent.Maven3Main.launch(Maven3Main.java:184)
        ... 14 more
Caused by: java.lang.reflect.InvocationTargetException
        at sun.reflect.NativeMethodAccessorImpl.invoke0(Native Method)
        at sun.reflect.NativeMethodAccessorImpl.invoke(NativeMethodAccessorImpl.java:62)
        at sun.reflect.DelegatingMethodAccessorImpl.invoke(DelegatingMethodAccessorImpl.java:43)
        at java.lang.reflect.Method.invoke(Method.java:498)
        at org.codehaus.plexus.classworlds.launcher.Launcher.launchStandard(Launcher.java:329)
        at org.codehaus.plexus.classworlds.launcher.Launcher.launch(Launcher.java:239)
        at org.jvnet.hudson.maven3.agent.Maven3Main.launch(Maven3Main.java:181)
        ... 14 more
Caused by: java.lang.NoSuchMethodError: org.codehaus.plexus.util.xml.pull.MXParser.<init>(Lorg/codehaus/plexus/util/xml/pull/EntityReplacementMap;)V
        at org.apache.maven.plugin.invoker.model.io.xpp3.BuildJobXpp3Reader.read(BuildJobXpp3Reader.java:510)
        at org.apache.maven.plugin.invoker.model.io.xpp3.BuildJobXpp3Reader.read(BuildJobXpp3Reader.java:529)
        at org.apache.maven.plugin.invoker.model.io.xpp3.BuildJobXpp3Reader.read(BuildJobXpp3Reader.java:558)
        at org.jenkinsci.plugins.maveninvoker.MavenInvokerArchiver.postExecute(MavenInvokerArchiver.java:113)
        at hudson.maven.Maven3Builder$MavenExecutionListener.recordMojoEnded(Maven3Builder.java:629)
        at hudson.maven.Maven3Builder$MavenExecutionListener.mojoSucceeded(Maven3Builder.java:610)
        at org.apache.maven.lifecycle.internal.DefaultExecutionEventCatapult.fire(DefaultExecutionEventCatapult.java:87)
        at org.apache.maven.lifecycle.internal.DefaultExecutionEventCatapult.fire(DefaultExecutionEventCatapult.java:42)
        at org.apache.maven.lifecycle.internal.MojoExecutor.execute(MojoExecutor.java:228)
        at org.apache.maven.lifecycle.internal.MojoExecutor.execute(MojoExecutor.java:153)
        at org.apache.maven.lifecycle.internal.MojoExecutor.execute(MojoExecutor.java:145)
        at org.apache.maven.lifecycle.internal.LifecycleModuleBuilder.buildProject(LifecycleModuleBuilder.java:84)
        at org.apache.maven.lifecycle.internal.LifecycleModuleBuilder.buildProject(LifecycleModuleBuilder.java:59)
        at org.apache.maven.lifecycle.internal.LifecycleStarter.singleThreadedBuild(LifecycleStarter.java:183)
        at org.apache.maven.lifecycle.internal.LifecycleStarter.execute(LifecycleStarter.java:161)
        at org.apache.maven.DefaultMaven.doExecute(DefaultMaven.java:320)
        at org.apache.maven.DefaultMaven.execute(DefaultMaven.java:156)
        at org.jvnet.hudson.maven3.launcher.Maven3Launcher.main(Maven3Launcher.java:117)
        ... 21 more
channel stopped
Reply | Threaded
Open this post in threaded view
|

Build failed in Jenkins: maven-plugin-tools-jdk-1.7 #160

Apache Jenkins Server-2
See <https://builds.apache.org/job/maven-plugin-tools-jdk-1.7/160/display/redirect>

------------------------------------------
[...truncated 130.88 KB...]
[INFO]
[INFO] --- maven-compiler-plugin:3.5.1:compile (default-compile) @ maven-plugin-tools-annotations ---
[INFO] Changes detected - recompiling the module!
[INFO] Compiling 14 source files to <https://builds.apache.org/job/maven-plugin-tools-jdk-1.7/ws/maven-plugin-tools-annotations/target/classes>
[INFO]
[INFO] --- plexus-component-metadata:1.7:generate-metadata (default) @ maven-plugin-tools-annotations ---
[INFO] Discovered 2 component descriptors(s)
[INFO]
[INFO] --- maven-resources-plugin:2.7:testResources (default-testResources) @ maven-plugin-tools-annotations ---
[INFO] Using 'UTF-8' encoding to copy filtered resources.
[INFO] Copying 2 resources
[INFO] Copying 3 resources
[INFO]
[INFO] --- maven-compiler-plugin:3.5.1:testCompile (default-testCompile) @ maven-plugin-tools-annotations ---
[INFO] Changes detected - recompiling the module!
[INFO] Compiling 3 source files to <https://builds.apache.org/job/maven-plugin-tools-jdk-1.7/ws/maven-plugin-tools-annotations/target/test-classes>
[INFO]
[INFO] --- plexus-component-metadata:1.7:generate-test-metadata (default) @ maven-plugin-tools-annotations ---
[INFO]
[INFO] --- maven-surefire-plugin:2.19.1:test (default-test) @ maven-plugin-tools-annotations ---
[INFO] Surefire report directory: <https://builds.apache.org/job/maven-plugin-tools-jdk-1.7/ws/maven-plugin-tools-annotations/target/surefire-reports>

-------------------------------------------------------
 T E S T S
-------------------------------------------------------
Running org.apache.maven.tools.plugin.extractor.annotations.TestAnnotationsReader
mojoAnnotatedClasses:{org.apache.maven.tools.plugin.extractor.annotations.FooMojo=MojoAnnotatedClass{className='org.apache.maven.tools.plugin.extractor.annotations.FooMojo', parentClassName='org.apache.maven.plugin.AbstractMojo', mojo=MojoAnnotationContent{name='foo', defaultPhase=COMPILE, requiresDependencyResolution='NONE', requiresDependencyCollection='NONE', instantiationStrategy='PER_LOOKUP', executionStrategy='once-per-session', requiresProject=true, requiresReports=false, aggregator=false, requiresDirectInvocation=false, requiresOnline=false, inheritByDefault=true, configurator='null', threadSafe=true}, execute=ExecuteAnnotationContent{goal='compiler', lifecycle='my-lifecycle', phase=PACKAGE}, parameters={beer=AnnotatedField{fieldName='beer'}ParameterAnnotationContent{name='null', alias='null', property='thebeer', defaultValue='coolbeer', required=false, readonly=false}, bar=AnnotatedField{fieldName='bar'}ParameterAnnotationContent{name='null', alias='null', property='thebar', defaultValue='coolbar', required=true, readonly=false}}, components={compilerManager=AnnotatedField{fieldName='compilerManager'}ComponentAnnotationContent{role='org.codehaus.plexus.compiler.manager.CompilerManager', hint='null'}, artifactMetadataSource=AnnotatedField{fieldName='artifactMetadataSource'}ComponentAnnotationContent{role='org.apache.maven.artifact.metadata.ArtifactMetadataSource', hint='maven'}}}}
Tests run: 1, Failures: 0, Errors: 0, Skipped: 0, Time elapsed: 0.412 sec - in org.apache.maven.tools.plugin.extractor.annotations.TestAnnotationsReader
Running org.apache.maven.tools.plugin.extractor.annotations.scanner.DefaultMojoAnnotationsScannerTest
Tests run: 2, Failures: 0, Errors: 0, Skipped: 0, Time elapsed: 0.148 sec - in org.apache.maven.tools.plugin.extractor.annotations.scanner.DefaultMojoAnnotationsScannerTest

Results :

Tests run: 3, Failures: 0, Errors: 0, Skipped: 0

[JENKINS] Recording test results
[INFO]
[INFO] --- maven-jar-plugin:3.0.0:jar (default-jar) @ maven-plugin-tools-annotations ---
[INFO] Building jar: <https://builds.apache.org/job/maven-plugin-tools-jdk-1.7/ws/maven-plugin-tools-annotations/target/maven-plugin-tools-annotations-3.5.1-SNAPSHOT.jar>
[INFO]
[INFO] --- maven-site-plugin:3.5.1:attach-descriptor (attach-descriptor) @ maven-plugin-tools-annotations ---
[INFO]
[INFO] --- maven-jar-plugin:3.0.0:test-jar (default) @ maven-plugin-tools-annotations ---
[INFO] Building jar: <https://builds.apache.org/job/maven-plugin-tools-jdk-1.7/ws/maven-plugin-tools-annotations/target/maven-plugin-tools-annotations-3.5.1-SNAPSHOT-tests.jar>
[INFO]
[INFO] --- maven-source-plugin:3.0.0:test-jar-no-fork (default) @ maven-plugin-tools-annotations ---
[INFO] Building jar: <https://builds.apache.org/job/maven-plugin-tools-jdk-1.7/ws/maven-plugin-tools-annotations/target/maven-plugin-tools-annotations-3.5.1-SNAPSHOT-test-sources.jar>
[INFO]
[INFO] --- maven-checkstyle-plugin:2.15:check (checkstyle-check) @ maven-plugin-tools-annotations ---
[INFO]
[INFO] --- maven-install-plugin:2.5.2:install (default-install) @ maven-plugin-tools-annotations ---
[INFO] Installing <https://builds.apache.org/job/maven-plugin-tools-jdk-1.7/ws/maven-plugin-tools-annotations/target/maven-plugin-tools-annotations-3.5.1-SNAPSHOT.jar> to /home/jenkins/jenkins-slave/maven-repositories/0/org/apache/maven/plugin-tools/maven-plugin-tools-annotations/3.5.1-SNAPSHOT/maven-plugin-tools-annotations-3.5.1-SNAPSHOT.jar
[INFO] Installing <https://builds.apache.org/job/maven-plugin-tools-jdk-1.7/ws/maven-plugin-tools-annotations/pom.xml> to /home/jenkins/jenkins-slave/maven-repositories/0/org/apache/maven/plugin-tools/maven-plugin-tools-annotations/3.5.1-SNAPSHOT/maven-plugin-tools-annotations-3.5.1-SNAPSHOT.pom
[INFO] Installing <https://builds.apache.org/job/maven-plugin-tools-jdk-1.7/ws/maven-plugin-tools-annotations/target/maven-plugin-tools-annotations-3.5.1-SNAPSHOT-tests.jar> to /home/jenkins/jenkins-slave/maven-repositories/0/org/apache/maven/plugin-tools/maven-plugin-tools-annotations/3.5.1-SNAPSHOT/maven-plugin-tools-annotations-3.5.1-SNAPSHOT-tests.jar
[INFO] Installing <https://builds.apache.org/job/maven-plugin-tools-jdk-1.7/ws/maven-plugin-tools-annotations/target/maven-plugin-tools-annotations-3.5.1-SNAPSHOT-test-sources.jar> to /home/jenkins/jenkins-slave/maven-repositories/0/org/apache/maven/plugin-tools/maven-plugin-tools-annotations/3.5.1-SNAPSHOT/maven-plugin-tools-annotations-3.5.1-SNAPSHOT-test-sources.jar
[INFO]                                                                        
[INFO] ------------------------------------------------------------------------
[INFO] Building Maven Plugin Tools Javadoc Taglets 3.5.1-SNAPSHOT
[INFO] ------------------------------------------------------------------------
Downloading: http://repo.maven.apache.org/maven2/org/apache/maven/plugins/maven-invoker-plugin/1.10/maven-invoker-plugin-1.10.pom
Downloaded: http://repo.maven.apache.org/maven2/org/apache/maven/plugins/maven-invoker-plugin/1.10/maven-invoker-plugin-1.10.pom (11 KB at 544.7 KB/sec)
Downloading: http://repo.maven.apache.org/maven2/org/apache/maven/plugins/maven-invoker-plugin/1.10/maven-invoker-plugin-1.10.jar
Downloaded: http://repo.maven.apache.org/maven2/org/apache/maven/plugins/maven-invoker-plugin/1.10/maven-invoker-plugin-1.10.jar (103 KB at 4101.6 KB/sec)
[INFO]
[INFO] --- maven-clean-plugin:3.0.0:clean (default-clean) @ maven-plugin-tools-javadoc ---
[INFO]
[INFO] --- maven-enforcer-plugin:1.4.1:enforce (enforce-bytecode-version) @ maven-plugin-tools-javadoc ---
[INFO]
[INFO] --- maven-enforcer-plugin:1.4.1:enforce (ban-known-bad-maven-versions) @ maven-plugin-tools-javadoc ---
[INFO]
[INFO] --- apache-rat-plugin:0.11:check (rat-check) @ maven-plugin-tools-javadoc ---
[INFO] 51 implicit excludes (use -debug for more details).
[INFO] Exclude: DEPENDENCIES
[INFO] 33 resources included (use -debug for more details)
[INFO] Rat check: Summary of files. Unapproved: 0 unknown: 0 generated: 0 approved: 32 licence.
[INFO]
[INFO] --- maven-remote-resources-plugin:1.5:process (process-resource-bundles) @ maven-plugin-tools-javadoc ---
[INFO]
[INFO] --- maven-resources-plugin:2.7:resources (default-resources) @ maven-plugin-tools-javadoc ---
[INFO] Using 'UTF-8' encoding to copy filtered resources.
[INFO] skip non existing resourceDirectory <https://builds.apache.org/job/maven-plugin-tools-jdk-1.7/ws/maven-plugin-tools-javadoc/src/main/resources>
[INFO] Copying 3 resources
[INFO]
[INFO] --- maven-compiler-plugin:3.5.1:compile (default-compile) @ maven-plugin-tools-javadoc ---
[INFO] Changes detected - recompiling the module!
[INFO] Compiling 22 source files to <https://builds.apache.org/job/maven-plugin-tools-jdk-1.7/ws/maven-plugin-tools-javadoc/target/classes>
[INFO]
[INFO] --- maven-resources-plugin:2.7:testResources (default-testResources) @ maven-plugin-tools-javadoc ---
[INFO] Using 'UTF-8' encoding to copy filtered resources.
[INFO] skip non existing resourceDirectory <https://builds.apache.org/job/maven-plugin-tools-jdk-1.7/ws/maven-plugin-tools-javadoc/src/test/resources>
[INFO] Copying 3 resources
[INFO]
[INFO] --- maven-compiler-plugin:3.5.1:testCompile (default-testCompile) @ maven-plugin-tools-javadoc ---
[INFO] No sources to compile
[INFO]
[INFO] --- maven-surefire-plugin:2.19.1:test (default-test) @ maven-plugin-tools-javadoc ---
[JENKINS] Recording test results
[INFO]
[INFO] --- maven-jar-plugin:3.0.0:jar (default-jar) @ maven-plugin-tools-javadoc ---
[INFO] Building jar: <https://builds.apache.org/job/maven-plugin-tools-jdk-1.7/ws/maven-plugin-tools-javadoc/target/maven-plugin-tools-javadoc-3.5.1-SNAPSHOT.jar>
[INFO]
[INFO] --- maven-site-plugin:3.5.1:attach-descriptor (attach-descriptor) @ maven-plugin-tools-javadoc ---
[INFO]
[INFO] --- maven-invoker-plugin:1.10:install (integration-test) @ maven-plugin-tools-javadoc ---
[INFO] Installing <https://builds.apache.org/job/maven-plugin-tools-jdk-1.7/ws/pom.xml> to <https://builds.apache.org/job/maven-plugin-tools-jdk-1.7/ws/maven-plugin-tools-javadoc/target/local-repo/org/apache/maven/plugin-tools/maven-plugin-tools/3.5.1-SNAPSHOT/maven-plugin-tools-3.5.1-SNAPSHOT.pom>
[INFO] Installing <https://builds.apache.org/job/maven-plugin-tools-jdk-1.7/ws/target/maven-plugin-tools-3.5.1-SNAPSHOT-site.xml> to <https://builds.apache.org/job/maven-plugin-tools-jdk-1.7/ws/maven-plugin-tools-javadoc/target/local-repo/org/apache/maven/plugin-tools/maven-plugin-tools/3.5.1-SNAPSHOT/maven-plugin-tools-3.5.1-SNAPSHOT-site.xml>
[INFO] Installing <https://builds.apache.org/job/maven-plugin-tools-jdk-1.7/ws/maven-plugin-tools-api/pom.xml> to <https://builds.apache.org/job/maven-plugin-tools-jdk-1.7/ws/maven-plugin-tools-javadoc/target/local-repo/org/apache/maven/plugin-tools/maven-plugin-tools-api/3.5.1-SNAPSHOT/maven-plugin-tools-api-3.5.1-SNAPSHOT.pom>
[INFO] Installing <https://builds.apache.org/job/maven-plugin-tools-jdk-1.7/ws/maven-plugin-tools-api/target/maven-plugin-tools-api-3.5.1-SNAPSHOT.jar> to <https://builds.apache.org/job/maven-plugin-tools-jdk-1.7/ws/maven-plugin-tools-javadoc/target/local-repo/org/apache/maven/plugin-tools/maven-plugin-tools-api/3.5.1-SNAPSHOT/maven-plugin-tools-api-3.5.1-SNAPSHOT.jar>
[INFO] Installing <https://builds.apache.org/job/maven-plugin-tools-jdk-1.7/ws/maven-plugin-tools-api/pom.xml> to <https://builds.apache.org/job/maven-plugin-tools-jdk-1.7/ws/maven-plugin-tools-javadoc/target/local-repo/org/apache/maven/plugin-tools/maven-plugin-tools-api/3.5.1-SNAPSHOT/maven-plugin-tools-api-3.5.1-SNAPSHOT.pom>
[INFO] Installing <https://builds.apache.org/job/maven-plugin-tools-jdk-1.7/ws/maven-plugin-tools-generators/pom.xml> to <https://builds.apache.org/job/maven-plugin-tools-jdk-1.7/ws/maven-plugin-tools-javadoc/target/local-repo/org/apache/maven/plugin-tools/maven-plugin-tools-generators/3.5.1-SNAPSHOT/maven-plugin-tools-generators-3.5.1-SNAPSHOT.pom>
[INFO] Installing <https://builds.apache.org/job/maven-plugin-tools-jdk-1.7/ws/maven-plugin-tools-generators/target/maven-plugin-tools-generators-3.5.1-SNAPSHOT.jar> to <https://builds.apache.org/job/maven-plugin-tools-jdk-1.7/ws/maven-plugin-tools-javadoc/target/local-repo/org/apache/maven/plugin-tools/maven-plugin-tools-generators/3.5.1-SNAPSHOT/maven-plugin-tools-generators-3.5.1-SNAPSHOT.jar>
[INFO] Installing <https://builds.apache.org/job/maven-plugin-tools-jdk-1.7/ws/maven-plugin-tools-generators/pom.xml> to <https://builds.apache.org/job/maven-plugin-tools-jdk-1.7/ws/maven-plugin-tools-javadoc/target/local-repo/org/apache/maven/plugin-tools/maven-plugin-tools-generators/3.5.1-SNAPSHOT/maven-plugin-tools-generators-3.5.1-SNAPSHOT.pom>
[INFO] Installing <https://builds.apache.org/job/maven-plugin-tools-jdk-1.7/ws/maven-plugin-tools-java/pom.xml> to <https://builds.apache.org/job/maven-plugin-tools-jdk-1.7/ws/maven-plugin-tools-javadoc/target/local-repo/org/apache/maven/plugin-tools/maven-plugin-tools-java/3.5.1-SNAPSHOT/maven-plugin-tools-java-3.5.1-SNAPSHOT.pom>
[INFO] Installing <https://builds.apache.org/job/maven-plugin-tools-jdk-1.7/ws/maven-plugin-tools-java/target/maven-plugin-tools-java-3.5.1-SNAPSHOT.jar> to <https://builds.apache.org/job/maven-plugin-tools-jdk-1.7/ws/maven-plugin-tools-javadoc/target/local-repo/org/apache/maven/plugin-tools/maven-plugin-tools-java/3.5.1-SNAPSHOT/maven-plugin-tools-java-3.5.1-SNAPSHOT.jar>
[INFO] Installing <https://builds.apache.org/job/maven-plugin-tools-jdk-1.7/ws/maven-plugin-tools-java/pom.xml> to <https://builds.apache.org/job/maven-plugin-tools-jdk-1.7/ws/maven-plugin-tools-javadoc/target/local-repo/org/apache/maven/plugin-tools/maven-plugin-tools-java/3.5.1-SNAPSHOT/maven-plugin-tools-java-3.5.1-SNAPSHOT.pom>
[INFO] Installing <https://builds.apache.org/job/maven-plugin-tools-jdk-1.7/ws/maven-plugin-annotations/pom.xml> to <https://builds.apache.org/job/maven-plugin-tools-jdk-1.7/ws/maven-plugin-tools-javadoc/target/local-repo/org/apache/maven/plugin-tools/maven-plugin-annotations/3.5.1-SNAPSHOT/maven-plugin-annotations-3.5.1-SNAPSHOT.pom>
[INFO] Installing <https://builds.apache.org/job/maven-plugin-tools-jdk-1.7/ws/maven-plugin-annotations/target/maven-plugin-annotations-3.5.1-SNAPSHOT.jar> to <https://builds.apache.org/job/maven-plugin-tools-jdk-1.7/ws/maven-plugin-tools-javadoc/target/local-repo/org/apache/maven/plugin-tools/maven-plugin-annotations/3.5.1-SNAPSHOT/maven-plugin-annotations-3.5.1-SNAPSHOT.jar>
[INFO] Installing <https://builds.apache.org/job/maven-plugin-tools-jdk-1.7/ws/maven-plugin-annotations/pom.xml> to <https://builds.apache.org/job/maven-plugin-tools-jdk-1.7/ws/maven-plugin-tools-javadoc/target/local-repo/org/apache/maven/plugin-tools/maven-plugin-annotations/3.5.1-SNAPSHOT/maven-plugin-annotations-3.5.1-SNAPSHOT.pom>
[INFO] Installing <https://builds.apache.org/job/maven-plugin-tools-jdk-1.7/ws/maven-plugin-tools-annotations/pom.xml> to <https://builds.apache.org/job/maven-plugin-tools-jdk-1.7/ws/maven-plugin-tools-javadoc/target/local-repo/org/apache/maven/plugin-tools/maven-plugin-tools-annotations/3.5.1-SNAPSHOT/maven-plugin-tools-annotations-3.5.1-SNAPSHOT.pom>
[INFO] Installing <https://builds.apache.org/job/maven-plugin-tools-jdk-1.7/ws/maven-plugin-tools-annotations/target/maven-plugin-tools-annotations-3.5.1-SNAPSHOT.jar> to <https://builds.apache.org/job/maven-plugin-tools-jdk-1.7/ws/maven-plugin-tools-javadoc/target/local-repo/org/apache/maven/plugin-tools/maven-plugin-tools-annotations/3.5.1-SNAPSHOT/maven-plugin-tools-annotations-3.5.1-SNAPSHOT.jar>
[INFO] Installing <https://builds.apache.org/job/maven-plugin-tools-jdk-1.7/ws/maven-plugin-tools-annotations/pom.xml> to <https://builds.apache.org/job/maven-plugin-tools-jdk-1.7/ws/maven-plugin-tools-javadoc/target/local-repo/org/apache/maven/plugin-tools/maven-plugin-tools-annotations/3.5.1-SNAPSHOT/maven-plugin-tools-annotations-3.5.1-SNAPSHOT.pom>
[INFO] Installing <https://builds.apache.org/job/maven-plugin-tools-jdk-1.7/ws/maven-plugin-tools-annotations/target/maven-plugin-tools-annotations-3.5.1-SNAPSHOT-tests.jar> to <https://builds.apache.org/job/maven-plugin-tools-jdk-1.7/ws/maven-plugin-tools-javadoc/target/local-repo/org/apache/maven/plugin-tools/maven-plugin-tools-annotations/3.5.1-SNAPSHOT/maven-plugin-tools-annotations-3.5.1-SNAPSHOT-tests.jar>
[INFO] Installing <https://builds.apache.org/job/maven-plugin-tools-jdk-1.7/ws/maven-plugin-tools-annotations/target/maven-plugin-tools-annotations-3.5.1-SNAPSHOT-test-sources.jar> to <https://builds.apache.org/job/maven-plugin-tools-jdk-1.7/ws/maven-plugin-tools-javadoc/target/local-repo/org/apache/maven/plugin-tools/maven-plugin-tools-annotations/3.5.1-SNAPSHOT/maven-plugin-tools-annotations-3.5.1-SNAPSHOT-test-sources.jar>
[INFO] Installing <https://builds.apache.org/job/maven-plugin-tools-jdk-1.7/ws/maven-plugin-tools-javadoc/pom.xml> to <https://builds.apache.org/job/maven-plugin-tools-jdk-1.7/ws/maven-plugin-tools-javadoc/target/local-repo/org/apache/maven/plugin-tools/maven-plugin-tools-javadoc/3.5.1-SNAPSHOT/maven-plugin-tools-javadoc-3.5.1-SNAPSHOT.pom>
[INFO] Installing <https://builds.apache.org/job/maven-plugin-tools-jdk-1.7/ws/maven-plugin-tools-javadoc/target/maven-plugin-tools-javadoc-3.5.1-SNAPSHOT.jar> to <https://builds.apache.org/job/maven-plugin-tools-jdk-1.7/ws/maven-plugin-tools-javadoc/target/local-repo/org/apache/maven/plugin-tools/maven-plugin-tools-javadoc/3.5.1-SNAPSHOT/maven-plugin-tools-javadoc-3.5.1-SNAPSHOT.jar>
[INFO]
[INFO] --- maven-invoker-plugin:1.10:run (integration-test) @ maven-plugin-tools-javadoc ---
[INFO] Building: basic/pom.xml
[INFO] run script verify.bsh.bsh
[INFO] ..SUCCESS (8.0 s)
[INFO] -------------------------------------------------
[INFO] Build Summary:
[INFO]   Passed: 1, Failed: 0, Errors: 0, Skipped: 0
[INFO] -------------------------------------------------
MavenInvokerArchiver
found reports:[<https://builds.apache.org/job/maven-plugin-tools-jdk-1.7/ws/maven-plugin-tools-javadoc/target/invoker-reports/BUILD-basic.xml]>
java.lang.reflect.InvocationTargetException
        at sun.reflect.NativeMethodAccessorImpl.invoke0(Native Method)
        at sun.reflect.NativeMethodAccessorImpl.invoke(NativeMethodAccessorImpl.java:62)
        at sun.reflect.DelegatingMethodAccessorImpl.invoke(DelegatingMethodAccessorImpl.java:43)
        at java.lang.reflect.Method.invoke(Method.java:498)
        at org.codehaus.plexus.classworlds.launcher.Launcher.launchStandard(Launcher.java:329)
        at org.codehaus.plexus.classworlds.launcher.Launcher.launch(Launcher.java:239)
        at org.jvnet.hudson.maven3.agent.Maven3Main.launch(Maven3Main.java:181)
        at sun.reflect.NativeMethodAccessorImpl.invoke0(Native Method)
        at sun.reflect.NativeMethodAccessorImpl.invoke(NativeMethodAccessorImpl.java:62)
        at sun.reflect.DelegatingMethodAccessorImpl.invoke(DelegatingMethodAccessorImpl.java:43)
        at java.lang.reflect.Method.invoke(Method.java:498)
        at hudson.maven.Maven3Builder.call(Maven3Builder.java:139)
        at hudson.maven.Maven3Builder.call(Maven3Builder.java:70)
        at hudson.remoting.UserRequest.perform(UserRequest.java:153)
        at hudson.remoting.UserRequest.perform(UserRequest.java:50)
        at hudson.remoting.Request$2.run(Request.java:336)
        at hudson.remoting.InterceptingExecutorService$1.call(InterceptingExecutorService.java:68)
        at java.util.concurrent.FutureTask.run(FutureTask.java:266)
        at java.util.concurrent.ThreadPoolExecutor.runWorker(ThreadPoolExecutor.java:1142)
        at java.util.concurrent.ThreadPoolExecutor$Worker.run(ThreadPoolExecutor.java:617)
        at java.lang.Thread.run(Thread.java:748)
Caused by: java.lang.NoSuchMethodError: org.codehaus.plexus.util.xml.pull.MXParser.<init>(Lorg/codehaus/plexus/util/xml/pull/EntityReplacementMap;)V
        at org.apache.maven.plugin.invoker.model.io.xpp3.BuildJobXpp3Reader.read(BuildJobXpp3Reader.java:510)
        at org.apache.maven.plugin.invoker.model.io.xpp3.BuildJobXpp3Reader.read(BuildJobXpp3Reader.java:529)
        at org.apache.maven.plugin.invoker.model.io.xpp3.BuildJobXpp3Reader.read(BuildJobXpp3Reader.java:558)
        at org.jenkinsci.plugins.maveninvoker.MavenInvokerArchiver.postExecute(MavenInvokerArchiver.java:113)
        at hudson.maven.Maven3Builder$MavenExecutionListener.recordMojoEnded(Maven3Builder.java:629)
        at hudson.maven.Maven3Builder$MavenExecutionListener.mojoSucceeded(Maven3Builder.java:610)
        at org.apache.maven.lifecycle.internal.DefaultExecutionEventCatapult.fire(DefaultExecutionEventCatapult.java:87)
        at org.apache.maven.lifecycle.internal.DefaultExecutionEventCatapult.fire(DefaultExecutionEventCatapult.java:42)
        at org.apache.maven.lifecycle.internal.MojoExecutor.execute(MojoExecutor.java:228)
        at org.apache.maven.lifecycle.internal.MojoExecutor.execute(MojoExecutor.java:153)
        at org.apache.maven.lifecycle.internal.MojoExecutor.execute(MojoExecutor.java:145)
        at org.apache.maven.lifecycle.internal.LifecycleModuleBuilder.buildProject(LifecycleModuleBuilder.java:84)
        at org.apache.maven.lifecycle.internal.LifecycleModuleBuilder.buildProject(LifecycleModuleBuilder.java:59)
        at org.apache.maven.lifecycle.internal.LifecycleStarter.singleThreadedBuild(LifecycleStarter.java:183)
        at org.apache.maven.lifecycle.internal.LifecycleStarter.execute(LifecycleStarter.java:161)
        at org.apache.maven.DefaultMaven.doExecute(DefaultMaven.java:320)
        at org.apache.maven.DefaultMaven.execute(DefaultMaven.java:156)
        at org.jvnet.hudson.maven3.launcher.Maven3Launcher.main(Maven3Launcher.java:117)
        ... 21 more
ERROR: Failed to parse POMs
java.io.IOException: java.lang.reflect.InvocationTargetException
        at hudson.maven.Maven3Builder.call(Maven3Builder.java:179)
        at hudson.maven.Maven3Builder.call(Maven3Builder.java:70)
        at hudson.remoting.UserRequest.perform(UserRequest.java:153)
        at hudson.remoting.UserRequest.perform(UserRequest.java:50)
        at hudson.remoting.Request$2.run(Request.java:336)
        at hudson.remoting.InterceptingExecutorService$1.call(InterceptingExecutorService.java:68)
        at java.util.concurrent.FutureTask.run(FutureTask.java:266)
        at java.util.concurrent.ThreadPoolExecutor.runWorker(ThreadPoolExecutor.java:1142)
        at java.util.concurrent.ThreadPoolExecutor$Worker.run(ThreadPoolExecutor.java:617)
        at java.lang.Thread.run(Thread.java:748)
        at ......remote call to Channel to Maven [/usr/local/asfpackages/java/jdk1.8.0_131/jre/bin/java, -Xmx2g, -Xms256m, -cp, /home/jenkins/jenkins-slave/maven3-agent.jar:/home/jenkins/tools/maven/apache-maven-3.0.5/boot/plexus-classworlds-2.4.jar, org.jvnet.hudson.maven3.agent.Maven3Main, /home/jenkins/tools/maven/apache-maven-3.0.5, /home/jenkins/jenkins-slave/slave.jar, /home/jenkins/jenkins-slave/maven3-interceptor.jar, /home/jenkins/jenkins-slave/maven3-interceptor-commons.jar, 40700](Native Method)
        at hudson.remoting.Channel.attachCallSiteStackTrace(Channel.java:1545)
        at hudson.remoting.UserResponse.retrieve(UserRequest.java:253)
        at hudson.remoting.Channel.call(Channel.java:830)
        at hudson.maven.ProcessCache$MavenProcess.call(ProcessCache.java:161)
        at hudson.maven.MavenModuleSetBuild$MavenModuleSetBuildExecution.doRun(MavenModuleSetBuild.java:878)
        at hudson.model.AbstractBuild$AbstractBuildExecution.run(AbstractBuild.java:490)
        at hudson.model.Run.execute(Run.java:1735)
        at hudson.maven.MavenModuleSetBuild.run(MavenModuleSetBuild.java:542)
        at hudson.model.ResourceController.execute(ResourceController.java:97)
        at hudson.model.Executor.run(Executor.java:405)
Caused by: java.lang.reflect.InvocationTargetException
        at sun.reflect.NativeMethodAccessorImpl.invoke0(Native Method)
        at sun.reflect.NativeMethodAccessorImpl.invoke(NativeMethodAccessorImpl.java:62)
        at sun.reflect.DelegatingMethodAccessorImpl.invoke(DelegatingMethodAccessorImpl.java:43)
        at java.lang.reflect.Method.invoke(Method.java:498)
        at hudson.maven.Maven3Builder.call(Maven3Builder.java:139)
        at hudson.maven.Maven3Builder.call(Maven3Builder.java:70)
        at hudson.remoting.UserRequest.perform(UserRequest.java:153)
        at hudson.remoting.UserRequest.perform(UserRequest.java:50)
        at hudson.remoting.Request$2.run(Request.java:336)
        at hudson.remoting.InterceptingExecutorService$1.call(InterceptingExecutorService.java:68)
        at java.util.concurrent.FutureTask.run(FutureTask.java:266)
        at java.util.concurrent.ThreadPoolExecutor.runWorker(ThreadPoolExecutor.java:1142)
        at java.util.concurrent.ThreadPoolExecutor$Worker.run(ThreadPoolExecutor.java:617)
        at java.lang.Thread.run(Thread.java:748)
Caused by: java.lang.Exception: java.lang.reflect.InvocationTargetException
        at org.jvnet.hudson.maven3.agent.Maven3Main.launch(Maven3Main.java:184)
        ... 14 more
Caused by: java.lang.reflect.InvocationTargetException
        at sun.reflect.NativeMethodAccessorImpl.invoke0(Native Method)
        at sun.reflect.NativeMethodAccessorImpl.invoke(NativeMethodAccessorImpl.java:62)
        at sun.reflect.DelegatingMethodAccessorImpl.invoke(DelegatingMethodAccessorImpl.java:43)
        at java.lang.reflect.Method.invoke(Method.java:498)
        at org.codehaus.plexus.classworlds.launcher.Launcher.launchStandard(Launcher.java:329)
        at org.codehaus.plexus.classworlds.launcher.Launcher.launch(Launcher.java:239)
        at org.jvnet.hudson.maven3.agent.Maven3Main.launch(Maven3Main.java:181)
        ... 14 more
Caused by: java.lang.NoSuchMethodError: org.codehaus.plexus.util.xml.pull.MXParser.<init>(Lorg/codehaus/plexus/util/xml/pull/EntityReplacementMap;)V
        at org.apache.maven.plugin.invoker.model.io.xpp3.BuildJobXpp3Reader.read(BuildJobXpp3Reader.java:510)
        at org.apache.maven.plugin.invoker.model.io.xpp3.BuildJobXpp3Reader.read(BuildJobXpp3Reader.java:529)
        at org.apache.maven.plugin.invoker.model.io.xpp3.BuildJobXpp3Reader.read(BuildJobXpp3Reader.java:558)
        at org.jenkinsci.plugins.maveninvoker.MavenInvokerArchiver.postExecute(MavenInvokerArchiver.java:113)
        at hudson.maven.Maven3Builder$MavenExecutionListener.recordMojoEnded(Maven3Builder.java:629)
        at hudson.maven.Maven3Builder$MavenExecutionListener.mojoSucceeded(Maven3Builder.java:610)
        at org.apache.maven.lifecycle.internal.DefaultExecutionEventCatapult.fire(DefaultExecutionEventCatapult.java:87)
        at org.apache.maven.lifecycle.internal.DefaultExecutionEventCatapult.fire(DefaultExecutionEventCatapult.java:42)
        at org.apache.maven.lifecycle.internal.MojoExecutor.execute(MojoExecutor.java:228)
        at org.apache.maven.lifecycle.internal.MojoExecutor.execute(MojoExecutor.java:153)
        at org.apache.maven.lifecycle.internal.MojoExecutor.execute(MojoExecutor.java:145)
        at org.apache.maven.lifecycle.internal.LifecycleModuleBuilder.buildProject(LifecycleModuleBuilder.java:84)
        at org.apache.maven.lifecycle.internal.LifecycleModuleBuilder.buildProject(LifecycleModuleBuilder.java:59)
        at org.apache.maven.lifecycle.internal.LifecycleStarter.singleThreadedBuild(LifecycleStarter.java:183)
        at org.apache.maven.lifecycle.internal.LifecycleStarter.execute(LifecycleStarter.java:161)
        at org.apache.maven.DefaultMaven.doExecute(DefaultMaven.java:320)
        at org.apache.maven.DefaultMaven.execute(DefaultMaven.java:156)
        at org.jvnet.hudson.maven3.launcher.Maven3Launcher.main(Maven3Launcher.java:117)
        ... 21 more
channel stopped