Build failed in Jenkins: maven-enforcer-m3.1.x #217

Previous Topic Next Topic
 
classic Classic list List threaded Threaded
7 messages Options
Reply | Threaded
Open this post in threaded view
|

Build failed in Jenkins: maven-enforcer-m3.1.x #217

Apache Jenkins Server-2
See <https://builds.apache.org/job/maven-enforcer-m3.1.x/217/display/redirect?page=changes>

Changes:

[khmarbaise] [MENFORCER-289] Upgrade maven-plugin-plugin to 3.5

------------------------------------------
Started by an SCM change
[EnvInject] - Loading node environment variables.
Building remotely on H27 (ubuntu xenial) in workspace <https://builds.apache.org/job/maven-enforcer-m3.1.x/ws/>
 > git rev-parse --is-inside-work-tree # timeout=10
Fetching changes from the remote Git repository
 > git config remote.origin.url https://gitbox.apache.org/repos/asf/maven-enforcer.git # timeout=10
Fetching upstream changes from https://gitbox.apache.org/repos/asf/maven-enforcer.git
 > git --version # timeout=10
 > git fetch --tags --progress https://gitbox.apache.org/repos/asf/maven-enforcer.git +refs/heads/*:refs/remotes/origin/*
 > git rev-parse refs/remotes/origin/master^{commit} # timeout=10
 > git rev-parse refs/remotes/origin/origin/master^{commit} # timeout=10
Checking out Revision d8936e4d7090e91fdf213dcfbd99a4abcffa2300 (refs/remotes/origin/master)
 > git config core.sparsecheckout # timeout=10
 > git checkout -f d8936e4d7090e91fdf213dcfbd99a4abcffa2300
Commit message: "[MENFORCER-289] Upgrade maven-plugin-plugin to 3.5"
 > git rev-list 91f57bbd86e670f07aa4bd262decce19a78d0857 # timeout=10
Parsing POMs
Modules changed, recalculating dependency graph
Established TCP socket on 44430
maven33-agent.jar already up to date
maven33-interceptor.jar already up to date
maven3-interceptor-commons.jar already up to date
[maven-enforcer-m3.1.x] $ /home/jenkins/tools/java/latest1.7/bin/java -Xmx2g -Xms256m -cp /home/jenkins/jenkins-slave/maven33-agent.jar:/home/jenkins/tools/maven/apache-maven-3.3.9/boot/plexus-classworlds-2.5.2.jar:/home/jenkins/tools/maven/apache-maven-3.3.9/conf/logging jenkins.maven3.agent.Maven33Main /home/jenkins/tools/maven/apache-maven-3.3.9 /home/jenkins/jenkins-slave/slave.jar /home/jenkins/jenkins-slave/maven33-interceptor.jar /home/jenkins/jenkins-slave/maven3-interceptor-commons.jar 44430
Exception in thread "main" java.lang.UnsupportedClassVersionError: hudson/remoting/Launcher : Unsupported major.minor version 52.0
        at java.lang.ClassLoader.defineClass1(Native Method)
        at java.lang.ClassLoader.defineClass(ClassLoader.java:800)
        at java.security.SecureClassLoader.defineClass(SecureClassLoader.java:142)
        at java.net.URLClassLoader.defineClass(URLClassLoader.java:449)
        at java.net.URLClassLoader.access$100(URLClassLoader.java:71)
        at java.net.URLClassLoader$1.run(URLClassLoader.java:361)
        at java.net.URLClassLoader$1.run(URLClassLoader.java:355)
        at java.security.AccessController.doPrivileged(Native Method)
        at java.net.URLClassLoader.findClass(URLClassLoader.java:354)
        at org.codehaus.plexus.classworlds.realm.ClassRealm.loadClassFromSelf(ClassRealm.java:401)
        at org.codehaus.plexus.classworlds.strategy.SelfFirstStrategy.loadClass(SelfFirstStrategy.java:42)
        at org.codehaus.plexus.classworlds.realm.ClassRealm.unsynchronizedLoadClass(ClassRealm.java:271)
        at org.codehaus.plexus.classworlds.realm.ClassRealm.loadClass(ClassRealm.java:247)
        at org.codehaus.plexus.classworlds.realm.ClassRealm.loadClass(ClassRealm.java:239)
        at jenkins.maven3.agent.Maven33Main.main(Maven33Main.java:133)
        at jenkins.maven3.agent.Maven33Main.main(Maven33Main.java:64)
ERROR: Failed to parse POMs
java.io.EOFException: unexpected stream termination
        at hudson.remoting.ChannelBuilder.negotiate(ChannelBuilder.java:408)
        at hudson.remoting.ChannelBuilder.build(ChannelBuilder.java:353)
        at hudson.slaves.Channels.forProcess(Channels.java:115)
        at hudson.maven.AbstractMavenProcessFactory.newProcess(AbstractMavenProcessFactory.java:294)
        at hudson.maven.ProcessCache.get(ProcessCache.java:236)
        at hudson.maven.MavenModuleSetBuild$MavenModuleSetBuildExecution.doRun(MavenModuleSetBuild.java:804)
        at hudson.model.AbstractBuild$AbstractBuildExecution.run(AbstractBuild.java:504)
        at hudson.model.Run.execute(Run.java:1724)
        at hudson.maven.MavenModuleSetBuild.run(MavenModuleSetBuild.java:543)
        at hudson.model.ResourceController.execute(ResourceController.java:97)
        at hudson.model.Executor.run(Executor.java:421)
Reply | Threaded
Open this post in threaded view
|

Build failed in Jenkins: maven-enforcer-m3.1.x #218

Apache Jenkins Server-2
See <https://builds.apache.org/job/maven-enforcer-m3.1.x/218/display/redirect?page=changes>

Changes:

[khmarbaise] [MENFORCER-290] Upgrade plexus-utils 3.1.0

------------------------------------------
Started by an SCM change
[EnvInject] - Loading node environment variables.
Building remotely on H27 (ubuntu xenial) in workspace <https://builds.apache.org/job/maven-enforcer-m3.1.x/ws/>
 > git rev-parse --is-inside-work-tree # timeout=10
Fetching changes from the remote Git repository
 > git config remote.origin.url https://gitbox.apache.org/repos/asf/maven-enforcer.git # timeout=10
Fetching upstream changes from https://gitbox.apache.org/repos/asf/maven-enforcer.git
 > git --version # timeout=10
 > git fetch --tags --progress https://gitbox.apache.org/repos/asf/maven-enforcer.git +refs/heads/*:refs/remotes/origin/*
 > git rev-parse refs/remotes/origin/master^{commit} # timeout=10
 > git rev-parse refs/remotes/origin/origin/master^{commit} # timeout=10
Checking out Revision cca17c1aed5c63ffa73d55458ede687224572ac3 (refs/remotes/origin/master)
 > git config core.sparsecheckout # timeout=10
 > git checkout -f cca17c1aed5c63ffa73d55458ede687224572ac3
Commit message: "[MENFORCER-290] Upgrade plexus-utils 3.1.0"
 > git rev-list d8936e4d7090e91fdf213dcfbd99a4abcffa2300 # timeout=10
Parsing POMs
Modules changed, recalculating dependency graph
Established TCP socket on 38018
maven33-agent.jar already up to date
maven33-interceptor.jar already up to date
maven3-interceptor-commons.jar already up to date
[maven-enforcer-m3.1.x] $ /home/jenkins/tools/java/latest1.7/bin/java -Xmx2g -Xms256m -cp /home/jenkins/jenkins-slave/maven33-agent.jar:/home/jenkins/tools/maven/apache-maven-3.3.9/boot/plexus-classworlds-2.5.2.jar:/home/jenkins/tools/maven/apache-maven-3.3.9/conf/logging jenkins.maven3.agent.Maven33Main /home/jenkins/tools/maven/apache-maven-3.3.9 /home/jenkins/jenkins-slave/slave.jar /home/jenkins/jenkins-slave/maven33-interceptor.jar /home/jenkins/jenkins-slave/maven3-interceptor-commons.jar 38018
Exception in thread "main" java.lang.UnsupportedClassVersionError: hudson/remoting/Launcher : Unsupported major.minor version 52.0
        at java.lang.ClassLoader.defineClass1(Native Method)
        at java.lang.ClassLoader.defineClass(ClassLoader.java:800)
        at java.security.SecureClassLoader.defineClass(SecureClassLoader.java:142)
        at java.net.URLClassLoader.defineClass(URLClassLoader.java:449)
        at java.net.URLClassLoader.access$100(URLClassLoader.java:71)
        at java.net.URLClassLoader$1.run(URLClassLoader.java:361)
        at java.net.URLClassLoader$1.run(URLClassLoader.java:355)
        at java.security.AccessController.doPrivileged(Native Method)
        at java.net.URLClassLoader.findClass(URLClassLoader.java:354)
        at org.codehaus.plexus.classworlds.realm.ClassRealm.loadClassFromSelf(ClassRealm.java:401)
        at org.codehaus.plexus.classworlds.strategy.SelfFirstStrategy.loadClass(SelfFirstStrategy.java:42)
        at org.codehaus.plexus.classworlds.realm.ClassRealm.unsynchronizedLoadClass(ClassRealm.java:271)
        at org.codehaus.plexus.classworlds.realm.ClassRealm.loadClass(ClassRealm.java:247)
        at org.codehaus.plexus.classworlds.realm.ClassRealm.loadClass(ClassRealm.java:239)
        at jenkins.maven3.agent.Maven33Main.main(Maven33Main.java:133)
        at jenkins.maven3.agent.Maven33Main.main(Maven33Main.java:64)
ERROR: Failed to parse POMs
java.io.EOFException: unexpected stream termination
        at hudson.remoting.ChannelBuilder.negotiate(ChannelBuilder.java:408)
        at hudson.remoting.ChannelBuilder.build(ChannelBuilder.java:353)
        at hudson.slaves.Channels.forProcess(Channels.java:115)
        at hudson.maven.AbstractMavenProcessFactory.newProcess(AbstractMavenProcessFactory.java:294)
        at hudson.maven.ProcessCache.get(ProcessCache.java:236)
        at hudson.maven.MavenModuleSetBuild$MavenModuleSetBuildExecution.doRun(MavenModuleSetBuild.java:804)
        at hudson.model.AbstractBuild$AbstractBuildExecution.run(AbstractBuild.java:504)
        at hudson.model.Run.execute(Run.java:1724)
        at hudson.maven.MavenModuleSetBuild.run(MavenModuleSetBuild.java:543)
        at hudson.model.ResourceController.execute(ResourceController.java:97)
        at hudson.model.Executor.run(Executor.java:421)
Reply | Threaded
Open this post in threaded view
|

Build failed in Jenkins: maven-enforcer-m3.1.x #219

Apache Jenkins Server-2
See <https://builds.apache.org/job/maven-enforcer-m3.1.x/219/display/redirect?page=changes>

Changes:

[khmarbaise] [MENFORCER-268] Usage of CI friendly version placeholders does not work

------------------------------------------
Started by an SCM change
[EnvInject] - Loading node environment variables.
Building remotely on H27 (ubuntu xenial) in workspace <https://builds.apache.org/job/maven-enforcer-m3.1.x/ws/>
 > git rev-parse --is-inside-work-tree # timeout=10
Fetching changes from the remote Git repository
 > git config remote.origin.url https://gitbox.apache.org/repos/asf/maven-enforcer.git # timeout=10
Fetching upstream changes from https://gitbox.apache.org/repos/asf/maven-enforcer.git
 > git --version # timeout=10
 > git fetch --tags --progress https://gitbox.apache.org/repos/asf/maven-enforcer.git +refs/heads/*:refs/remotes/origin/*
 > git rev-parse refs/remotes/origin/master^{commit} # timeout=10
 > git rev-parse refs/remotes/origin/origin/master^{commit} # timeout=10
Checking out Revision f0e88b23f0eaa038462a81f9dfc11a790a3da928 (refs/remotes/origin/master)
 > git config core.sparsecheckout # timeout=10
 > git checkout -f f0e88b23f0eaa038462a81f9dfc11a790a3da928
Commit message: "[MENFORCER-268] Usage of CI friendly version placeholders does not work  o Changed the implementation to use the Maven 3    access to the pom files in a Maven project instead    of hand made reading of pom files.  o Added Invoker test to prove requirePluginVersions is working."
 > git rev-list cca17c1aed5c63ffa73d55458ede687224572ac3 # timeout=10
Parsing POMs
Established TCP socket on 38856
maven33-agent.jar already up to date
maven33-interceptor.jar already up to date
maven3-interceptor-commons.jar already up to date
[maven-enforcer-m3.1.x] $ /home/jenkins/tools/java/latest1.7/bin/java -Xmx2g -Xms256m -cp /home/jenkins/jenkins-slave/maven33-agent.jar:/home/jenkins/tools/maven/apache-maven-3.3.9/boot/plexus-classworlds-2.5.2.jar:/home/jenkins/tools/maven/apache-maven-3.3.9/conf/logging jenkins.maven3.agent.Maven33Main /home/jenkins/tools/maven/apache-maven-3.3.9 /home/jenkins/jenkins-slave/slave.jar /home/jenkins/jenkins-slave/maven33-interceptor.jar /home/jenkins/jenkins-slave/maven3-interceptor-commons.jar 38856
Exception in thread "main" java.lang.UnsupportedClassVersionError: hudson/remoting/Launcher : Unsupported major.minor version 52.0
        at java.lang.ClassLoader.defineClass1(Native Method)
        at java.lang.ClassLoader.defineClass(ClassLoader.java:800)
        at java.security.SecureClassLoader.defineClass(SecureClassLoader.java:142)
        at java.net.URLClassLoader.defineClass(URLClassLoader.java:449)
        at java.net.URLClassLoader.access$100(URLClassLoader.java:71)
        at java.net.URLClassLoader$1.run(URLClassLoader.java:361)
        at java.net.URLClassLoader$1.run(URLClassLoader.java:355)
        at java.security.AccessController.doPrivileged(Native Method)
        at java.net.URLClassLoader.findClass(URLClassLoader.java:354)
        at org.codehaus.plexus.classworlds.realm.ClassRealm.loadClassFromSelf(ClassRealm.java:401)
        at org.codehaus.plexus.classworlds.strategy.SelfFirstStrategy.loadClass(SelfFirstStrategy.java:42)
        at org.codehaus.plexus.classworlds.realm.ClassRealm.unsynchronizedLoadClass(ClassRealm.java:271)
        at org.codehaus.plexus.classworlds.realm.ClassRealm.loadClass(ClassRealm.java:247)
        at org.codehaus.plexus.classworlds.realm.ClassRealm.loadClass(ClassRealm.java:239)
        at jenkins.maven3.agent.Maven33Main.main(Maven33Main.java:133)
        at jenkins.maven3.agent.Maven33Main.main(Maven33Main.java:64)
ERROR: Failed to parse POMs
java.io.EOFException: unexpected stream termination
        at hudson.remoting.ChannelBuilder.negotiate(ChannelBuilder.java:408)
        at hudson.remoting.ChannelBuilder.build(ChannelBuilder.java:353)
        at hudson.slaves.Channels.forProcess(Channels.java:115)
        at hudson.maven.AbstractMavenProcessFactory.newProcess(AbstractMavenProcessFactory.java:294)
        at hudson.maven.ProcessCache.get(ProcessCache.java:236)
        at hudson.maven.MavenModuleSetBuild$MavenModuleSetBuildExecution.doRun(MavenModuleSetBuild.java:804)
        at hudson.model.AbstractBuild$AbstractBuildExecution.run(AbstractBuild.java:504)
        at hudson.model.Run.execute(Run.java:1724)
        at hudson.maven.MavenModuleSetBuild.run(MavenModuleSetBuild.java:543)
        at hudson.model.ResourceController.execute(ResourceController.java:97)
        at hudson.model.Executor.run(Executor.java:421)
Reply | Threaded
Open this post in threaded view
|

Build failed in Jenkins: maven-enforcer-m3.1.x #220

Apache Jenkins Server-2
See <https://builds.apache.org/job/maven-enforcer-m3.1.x/220/display/redirect?page=changes>

Changes:

[khmarbaise] [MENFORCER-291] Cleanup ReactorModuleConvergence implementation  o

------------------------------------------
Started by an SCM change
[EnvInject] - Loading node environment variables.
Building remotely on H27 (ubuntu xenial) in workspace <https://builds.apache.org/job/maven-enforcer-m3.1.x/ws/>
 > git rev-parse --is-inside-work-tree # timeout=10
Fetching changes from the remote Git repository
 > git config remote.origin.url https://gitbox.apache.org/repos/asf/maven-enforcer.git # timeout=10
Fetching upstream changes from https://gitbox.apache.org/repos/asf/maven-enforcer.git
 > git --version # timeout=10
 > git fetch --tags --progress https://gitbox.apache.org/repos/asf/maven-enforcer.git +refs/heads/*:refs/remotes/origin/*
 > git rev-parse refs/remotes/origin/master^{commit} # timeout=10
 > git rev-parse refs/remotes/origin/origin/master^{commit} # timeout=10
Checking out Revision c7568bc86e30bdfddbd69c05221ca69913fb15e1 (refs/remotes/origin/master)
 > git config core.sparsecheckout # timeout=10
 > git checkout -f c7568bc86e30bdfddbd69c05221ca69913fb15e1
Commit message: "[MENFORCER-291] Cleanup ReactorModuleConvergence implementation  o Replaced deprecated implementation with    non deprecated implementation.  o Changed unit test accordingly."
 > git rev-list f0e88b23f0eaa038462a81f9dfc11a790a3da928 # timeout=10
Parsing POMs
Established TCP socket on 43968
maven33-agent.jar already up to date
maven33-interceptor.jar already up to date
maven3-interceptor-commons.jar already up to date
[maven-enforcer-m3.1.x] $ /home/jenkins/tools/java/latest1.7/bin/java -Xmx2g -Xms256m -cp /home/jenkins/jenkins-slave/maven33-agent.jar:/home/jenkins/tools/maven/apache-maven-3.3.9/boot/plexus-classworlds-2.5.2.jar:/home/jenkins/tools/maven/apache-maven-3.3.9/conf/logging jenkins.maven3.agent.Maven33Main /home/jenkins/tools/maven/apache-maven-3.3.9 /home/jenkins/jenkins-slave/slave.jar /home/jenkins/jenkins-slave/maven33-interceptor.jar /home/jenkins/jenkins-slave/maven3-interceptor-commons.jar 43968
Exception in thread "main" java.lang.UnsupportedClassVersionError: hudson/remoting/Launcher : Unsupported major.minor version 52.0
        at java.lang.ClassLoader.defineClass1(Native Method)
        at java.lang.ClassLoader.defineClass(ClassLoader.java:800)
        at java.security.SecureClassLoader.defineClass(SecureClassLoader.java:142)
        at java.net.URLClassLoader.defineClass(URLClassLoader.java:449)
        at java.net.URLClassLoader.access$100(URLClassLoader.java:71)
        at java.net.URLClassLoader$1.run(URLClassLoader.java:361)
        at java.net.URLClassLoader$1.run(URLClassLoader.java:355)
        at java.security.AccessController.doPrivileged(Native Method)
        at java.net.URLClassLoader.findClass(URLClassLoader.java:354)
        at org.codehaus.plexus.classworlds.realm.ClassRealm.loadClassFromSelf(ClassRealm.java:401)
        at org.codehaus.plexus.classworlds.strategy.SelfFirstStrategy.loadClass(SelfFirstStrategy.java:42)
        at org.codehaus.plexus.classworlds.realm.ClassRealm.unsynchronizedLoadClass(ClassRealm.java:271)
        at org.codehaus.plexus.classworlds.realm.ClassRealm.loadClass(ClassRealm.java:247)
        at org.codehaus.plexus.classworlds.realm.ClassRealm.loadClass(ClassRealm.java:239)
        at jenkins.maven3.agent.Maven33Main.main(Maven33Main.java:133)
        at jenkins.maven3.agent.Maven33Main.main(Maven33Main.java:64)
ERROR: Failed to parse POMs
java.io.EOFException: unexpected stream termination
        at hudson.remoting.ChannelBuilder.negotiate(ChannelBuilder.java:408)
        at hudson.remoting.ChannelBuilder.build(ChannelBuilder.java:353)
        at hudson.slaves.Channels.forProcess(Channels.java:115)
        at hudson.maven.AbstractMavenProcessFactory.newProcess(AbstractMavenProcessFactory.java:294)
        at hudson.maven.ProcessCache.get(ProcessCache.java:236)
        at hudson.maven.MavenModuleSetBuild$MavenModuleSetBuildExecution.doRun(MavenModuleSetBuild.java:804)
        at hudson.model.AbstractBuild$AbstractBuildExecution.run(AbstractBuild.java:504)
        at hudson.model.Run.execute(Run.java:1724)
        at hudson.maven.MavenModuleSetBuild.run(MavenModuleSetBuild.java:543)
        at hudson.model.ResourceController.execute(ResourceController.java:97)
        at hudson.model.Executor.run(Executor.java:421)
Reply | Threaded
Open this post in threaded view
|

Build failed in Jenkins: maven-enforcer-m3.1.x #221

Apache Jenkins Server-2
See <https://builds.apache.org/job/maven-enforcer-m3.1.x/221/display/redirect?page=changes>

Changes:

[khmarbaise] [MENFORCER-221] Removed deprecated marked constructor from

------------------------------------------
Started by an SCM change
[EnvInject] - Loading node environment variables.
Building remotely on H27 (ubuntu xenial) in workspace <https://builds.apache.org/job/maven-enforcer-m3.1.x/ws/>
 > git rev-parse --is-inside-work-tree # timeout=10
Fetching changes from the remote Git repository
 > git config remote.origin.url https://gitbox.apache.org/repos/asf/maven-enforcer.git # timeout=10
Fetching upstream changes from https://gitbox.apache.org/repos/asf/maven-enforcer.git
 > git --version # timeout=10
 > git fetch --tags --progress https://gitbox.apache.org/repos/asf/maven-enforcer.git +refs/heads/*:refs/remotes/origin/*
 > git rev-parse refs/remotes/origin/master^{commit} # timeout=10
 > git rev-parse refs/remotes/origin/origin/master^{commit} # timeout=10
Checking out Revision 655a24e6d3b72c5cb6d5fa9448206eccea3834ee (refs/remotes/origin/master)
 > git config core.sparsecheckout # timeout=10
 > git checkout -f 655a24e6d3b72c5cb6d5fa9448206eccea3834ee
Commit message: "[MENFORCER-221] Removed deprecated marked constructor from EnforcerExpressionEvaluator"
 > git rev-list c7568bc86e30bdfddbd69c05221ca69913fb15e1 # timeout=10
Parsing POMs
Established TCP socket on 43789
maven33-agent.jar already up to date
maven33-interceptor.jar already up to date
maven3-interceptor-commons.jar already up to date
[maven-enforcer-m3.1.x] $ /home/jenkins/tools/java/latest1.7/bin/java -Xmx2g -Xms256m -cp /home/jenkins/jenkins-slave/maven33-agent.jar:/home/jenkins/tools/maven/apache-maven-3.3.9/boot/plexus-classworlds-2.5.2.jar:/home/jenkins/tools/maven/apache-maven-3.3.9/conf/logging jenkins.maven3.agent.Maven33Main /home/jenkins/tools/maven/apache-maven-3.3.9 /home/jenkins/jenkins-slave/slave.jar /home/jenkins/jenkins-slave/maven33-interceptor.jar /home/jenkins/jenkins-slave/maven3-interceptor-commons.jar 43789
Exception in thread "main" java.lang.UnsupportedClassVersionError: hudson/remoting/Launcher : Unsupported major.minor version 52.0
        at java.lang.ClassLoader.defineClass1(Native Method)
        at java.lang.ClassLoader.defineClass(ClassLoader.java:800)
        at java.security.SecureClassLoader.defineClass(SecureClassLoader.java:142)
        at java.net.URLClassLoader.defineClass(URLClassLoader.java:449)
        at java.net.URLClassLoader.access$100(URLClassLoader.java:71)
        at java.net.URLClassLoader$1.run(URLClassLoader.java:361)
        at java.net.URLClassLoader$1.run(URLClassLoader.java:355)
        at java.security.AccessController.doPrivileged(Native Method)
        at java.net.URLClassLoader.findClass(URLClassLoader.java:354)
        at org.codehaus.plexus.classworlds.realm.ClassRealm.loadClassFromSelf(ClassRealm.java:401)
        at org.codehaus.plexus.classworlds.strategy.SelfFirstStrategy.loadClass(SelfFirstStrategy.java:42)
        at org.codehaus.plexus.classworlds.realm.ClassRealm.unsynchronizedLoadClass(ClassRealm.java:271)
        at org.codehaus.plexus.classworlds.realm.ClassRealm.loadClass(ClassRealm.java:247)
        at org.codehaus.plexus.classworlds.realm.ClassRealm.loadClass(ClassRealm.java:239)
        at jenkins.maven3.agent.Maven33Main.main(Maven33Main.java:133)
        at jenkins.maven3.agent.Maven33Main.main(Maven33Main.java:64)
ERROR: Failed to parse POMs
java.io.EOFException: unexpected stream termination
        at hudson.remoting.ChannelBuilder.negotiate(ChannelBuilder.java:408)
        at hudson.remoting.ChannelBuilder.build(ChannelBuilder.java:353)
        at hudson.slaves.Channels.forProcess(Channels.java:115)
        at hudson.maven.AbstractMavenProcessFactory.newProcess(AbstractMavenProcessFactory.java:294)
        at hudson.maven.ProcessCache.get(ProcessCache.java:236)
        at hudson.maven.MavenModuleSetBuild$MavenModuleSetBuildExecution.doRun(MavenModuleSetBuild.java:804)
        at hudson.model.AbstractBuild$AbstractBuildExecution.run(AbstractBuild.java:504)
        at hudson.model.Run.execute(Run.java:1724)
        at hudson.maven.MavenModuleSetBuild.run(MavenModuleSetBuild.java:543)
        at hudson.model.ResourceController.execute(ResourceController.java:97)
        at hudson.model.Executor.run(Executor.java:421)
Reply | Threaded
Open this post in threaded view
|

Build failed in Jenkins: maven-enforcer-m3.1.x #222

Apache Jenkins Server-2
See <https://builds.apache.org/job/maven-enforcer-m3.1.x/222/display/redirect?page=changes>

Changes:

[khmarbaise] [MENFORCER-281] RequirePluginVersions broken with "CI Friendly versions"

[khmarbaise] [MENFORCER-281] RequirePluginVersions broken with "CI Friendly versions"

------------------------------------------
Started by an SCM change
[EnvInject] - Loading node environment variables.
Building remotely on H27 (ubuntu xenial) in workspace <https://builds.apache.org/job/maven-enforcer-m3.1.x/ws/>
 > git rev-parse --is-inside-work-tree # timeout=10
Fetching changes from the remote Git repository
 > git config remote.origin.url https://gitbox.apache.org/repos/asf/maven-enforcer.git # timeout=10
Fetching upstream changes from https://gitbox.apache.org/repos/asf/maven-enforcer.git
 > git --version # timeout=10
 > git fetch --tags --progress https://gitbox.apache.org/repos/asf/maven-enforcer.git +refs/heads/*:refs/remotes/origin/*
 > git rev-parse refs/remotes/origin/master^{commit} # timeout=10
 > git rev-parse refs/remotes/origin/origin/master^{commit} # timeout=10
Checking out Revision ad0a84368f97a335a9455f04ec04bfbbb10ac49e (refs/remotes/origin/master)
 > git config core.sparsecheckout # timeout=10
 > git checkout -f ad0a84368f97a335a9455f04ec04bfbbb10ac49e
Commit message: "[MENFORCER-281] RequirePluginVersions broken with "CI Friendly versions"  o Followup    o Added selector condition to limit execution to Maven 3.5.0+      for the invoker integration test.    o Replaced EnforcerRuleUtils.getModelsRecursively      method with session.getProjectDependencyGraph().getSortedProjects()    o Removed the testGetAllPlugins() and all related tests      from TestEnforcerRuleUtils cause it only tests the      getModelsRecursively method. Left only a static method      and renamed to EnforcerRuleUtilsHelper cause it's      used in some Tests."
 > git rev-list 655a24e6d3b72c5cb6d5fa9448206eccea3834ee # timeout=10
Parsing POMs
Established TCP socket on 45373
maven33-agent.jar already up to date
maven33-interceptor.jar already up to date
maven3-interceptor-commons.jar already up to date
[maven-enforcer-m3.1.x] $ /home/jenkins/tools/java/latest1.7/bin/java -Xmx2g -Xms256m -cp /home/jenkins/jenkins-slave/maven33-agent.jar:/home/jenkins/tools/maven/apache-maven-3.3.9/boot/plexus-classworlds-2.5.2.jar:/home/jenkins/tools/maven/apache-maven-3.3.9/conf/logging jenkins.maven3.agent.Maven33Main /home/jenkins/tools/maven/apache-maven-3.3.9 /home/jenkins/jenkins-slave/slave.jar /home/jenkins/jenkins-slave/maven33-interceptor.jar /home/jenkins/jenkins-slave/maven3-interceptor-commons.jar 45373
Exception in thread "main" java.lang.UnsupportedClassVersionError: hudson/remoting/Launcher : Unsupported major.minor version 52.0
        at java.lang.ClassLoader.defineClass1(Native Method)
        at java.lang.ClassLoader.defineClass(ClassLoader.java:800)
        at java.security.SecureClassLoader.defineClass(SecureClassLoader.java:142)
        at java.net.URLClassLoader.defineClass(URLClassLoader.java:449)
        at java.net.URLClassLoader.access$100(URLClassLoader.java:71)
        at java.net.URLClassLoader$1.run(URLClassLoader.java:361)
        at java.net.URLClassLoader$1.run(URLClassLoader.java:355)
        at java.security.AccessController.doPrivileged(Native Method)
        at java.net.URLClassLoader.findClass(URLClassLoader.java:354)
        at org.codehaus.plexus.classworlds.realm.ClassRealm.loadClassFromSelf(ClassRealm.java:401)
        at org.codehaus.plexus.classworlds.strategy.SelfFirstStrategy.loadClass(SelfFirstStrategy.java:42)
        at org.codehaus.plexus.classworlds.realm.ClassRealm.unsynchronizedLoadClass(ClassRealm.java:271)
        at org.codehaus.plexus.classworlds.realm.ClassRealm.loadClass(ClassRealm.java:247)
        at org.codehaus.plexus.classworlds.realm.ClassRealm.loadClass(ClassRealm.java:239)
        at jenkins.maven3.agent.Maven33Main.main(Maven33Main.java:133)
        at jenkins.maven3.agent.Maven33Main.main(Maven33Main.java:64)
ERROR: Failed to parse POMs
java.io.EOFException: unexpected stream termination
        at hudson.remoting.ChannelBuilder.negotiate(ChannelBuilder.java:408)
        at hudson.remoting.ChannelBuilder.build(ChannelBuilder.java:353)
        at hudson.slaves.Channels.forProcess(Channels.java:115)
        at hudson.maven.AbstractMavenProcessFactory.newProcess(AbstractMavenProcessFactory.java:294)
        at hudson.maven.ProcessCache.get(ProcessCache.java:236)
        at hudson.maven.MavenModuleSetBuild$MavenModuleSetBuildExecution.doRun(MavenModuleSetBuild.java:804)
        at hudson.model.AbstractBuild$AbstractBuildExecution.run(AbstractBuild.java:504)
        at hudson.model.Run.execute(Run.java:1724)
        at hudson.maven.MavenModuleSetBuild.run(MavenModuleSetBuild.java:543)
        at hudson.model.ResourceController.execute(ResourceController.java:97)
        at hudson.model.Executor.run(Executor.java:421)
Reply | Threaded
Open this post in threaded view
|

Build failed in Jenkins: maven-enforcer-m3.1.x #223

Apache Jenkins Server-2
See <https://builds.apache.org/job/maven-enforcer-m3.1.x/223/display/redirect?page=changes>

Changes:

[khmarbaise] [MENFORCER-293] Remove deprecated marked ignoreParent from

------------------------------------------
Started by an SCM change
[EnvInject] - Loading node environment variables.
Building remotely on H23 (ubuntu xenial) in workspace <https://builds.apache.org/job/maven-enforcer-m3.1.x/ws/>
Cloning the remote Git repository
Cloning repository https://gitbox.apache.org/repos/asf/maven-enforcer.git
 > git init <https://builds.apache.org/job/maven-enforcer-m3.1.x/ws/> # timeout=10
Fetching upstream changes from https://gitbox.apache.org/repos/asf/maven-enforcer.git
 > git --version # timeout=10
 > git fetch --tags --progress https://gitbox.apache.org/repos/asf/maven-enforcer.git +refs/heads/*:refs/remotes/origin/*
 > git config remote.origin.url https://gitbox.apache.org/repos/asf/maven-enforcer.git # timeout=10
 > git config --add remote.origin.fetch +refs/heads/*:refs/remotes/origin/* # timeout=10
 > git config remote.origin.url https://gitbox.apache.org/repos/asf/maven-enforcer.git # timeout=10
Fetching upstream changes from https://gitbox.apache.org/repos/asf/maven-enforcer.git
 > git fetch --tags --progress https://gitbox.apache.org/repos/asf/maven-enforcer.git +refs/heads/*:refs/remotes/origin/*
 > git rev-parse refs/remotes/origin/master^{commit} # timeout=10
 > git rev-parse refs/remotes/origin/origin/master^{commit} # timeout=10
Checking out Revision 8d6f3e899f2eaaa11960876f2d4329dae03d6c3f (refs/remotes/origin/master)
 > git config core.sparsecheckout # timeout=10
 > git checkout -f 8d6f3e899f2eaaa11960876f2d4329dae03d6c3f
Commit message: "[MENFORCER-293] Remove deprecated marked ignoreParent from BanDistributionManagement"
 > git rev-list ad0a84368f97a335a9455f04ec04bfbbb10ac49e # timeout=10
Parsing POMs
Established TCP socket on 41806
maven33-agent.jar already up to date
maven33-interceptor.jar already up to date
maven3-interceptor-commons.jar already up to date
[maven-enforcer-m3.1.x] $ /home/jenkins/tools/java/latest1.7/bin/java -Xmx2g -Xms256m -cp /home/jenkins/jenkins-slave/maven33-agent.jar:/home/jenkins/tools/maven/apache-maven-3.3.9/boot/plexus-classworlds-2.5.2.jar:/home/jenkins/tools/maven/apache-maven-3.3.9/conf/logging jenkins.maven3.agent.Maven33Main /home/jenkins/tools/maven/apache-maven-3.3.9 /home/jenkins/jenkins-slave/slave.jar /home/jenkins/jenkins-slave/maven33-interceptor.jar /home/jenkins/jenkins-slave/maven3-interceptor-commons.jar 41806
Exception in thread "main" java.lang.UnsupportedClassVersionError: hudson/remoting/Launcher : Unsupported major.minor version 52.0
        at java.lang.ClassLoader.defineClass1(Native Method)
        at java.lang.ClassLoader.defineClass(ClassLoader.java:800)
        at java.security.SecureClassLoader.defineClass(SecureClassLoader.java:142)
        at java.net.URLClassLoader.defineClass(URLClassLoader.java:449)
        at java.net.URLClassLoader.access$100(URLClassLoader.java:71)
        at java.net.URLClassLoader$1.run(URLClassLoader.java:361)
        at java.net.URLClassLoader$1.run(URLClassLoader.java:355)
        at java.security.AccessController.doPrivileged(Native Method)
        at java.net.URLClassLoader.findClass(URLClassLoader.java:354)
        at org.codehaus.plexus.classworlds.realm.ClassRealm.loadClassFromSelf(ClassRealm.java:401)
        at org.codehaus.plexus.classworlds.strategy.SelfFirstStrategy.loadClass(SelfFirstStrategy.java:42)
        at org.codehaus.plexus.classworlds.realm.ClassRealm.unsynchronizedLoadClass(ClassRealm.java:271)
        at org.codehaus.plexus.classworlds.realm.ClassRealm.loadClass(ClassRealm.java:247)
        at org.codehaus.plexus.classworlds.realm.ClassRealm.loadClass(ClassRealm.java:239)
        at jenkins.maven3.agent.Maven33Main.main(Maven33Main.java:133)
        at jenkins.maven3.agent.Maven33Main.main(Maven33Main.java:64)
ERROR: Failed to parse POMs
java.io.EOFException: unexpected stream termination
        at hudson.remoting.ChannelBuilder.negotiate(ChannelBuilder.java:408)
        at hudson.remoting.ChannelBuilder.build(ChannelBuilder.java:353)
        at hudson.slaves.Channels.forProcess(Channels.java:115)
        at hudson.maven.AbstractMavenProcessFactory.newProcess(AbstractMavenProcessFactory.java:294)
        at hudson.maven.ProcessCache.get(ProcessCache.java:236)
        at hudson.maven.MavenModuleSetBuild$MavenModuleSetBuildExecution.doRun(MavenModuleSetBuild.java:804)
        at hudson.model.AbstractBuild$AbstractBuildExecution.run(AbstractBuild.java:504)
        at hudson.model.Run.execute(Run.java:1724)
        at hudson.maven.MavenModuleSetBuild.run(MavenModuleSetBuild.java:543)
        at hudson.model.ResourceController.execute(ResourceController.java:97)
        at hudson.model.Executor.run(Executor.java:421)