Build failed in Jenkins: dist-tool-plugin #2970

Previous Topic Next Topic
 
classic Classic list List threaded Threaded
8 messages Options
Reply | Threaded
Open this post in threaded view
|

Build failed in Jenkins: dist-tool-plugin #2970

Apache Jenkins Server-2
See <https://builds.apache.org/job/dist-tool-plugin/2970/display/redirect>

Changes:


------------------------------------------
[...truncated 229.99 KB...]
[INFO]   maven-help-plugin
[INFO]   maven-install-plugin
[INFO]   maven-invoker-plugin
[INFO]   maven-jar-plugin
[INFO]   maven-jarsigner-plugin
[INFO]   maven-javadoc-plugin
[INFO]   maven-jdeps-plugin
[INFO]   maven-jdeprscan-plugin
[INFO]   maven-jlink-plugin
[INFO]   maven-jmod-plugin
[INFO]   * maven-jxr-plugin
[INFO]   maven-linkcheck-plugin
[INFO]   maven-patch-plugin
[INFO]   maven-pdf-plugin
[INFO]   * maven-plugin-plugin
[INFO]   maven-pmd-plugin
[INFO]   maven-project-info-reports-plugin
[INFO]   maven-rar-plugin
[INFO]   * maven-release-plugin  
[INFO]   maven-remote-resources-plugin
[INFO]   maven-resources-plugin
[INFO]   * maven-scm-plugin
[INFO]   maven-scm-publish-plugin
[INFO]   maven-shade-plugin
[INFO]   maven-site-plugin
[INFO]   maven-source-plugin
[INFO]   maven-stage-plugin
[INFO]   * maven-surefire-plugin
[INFO]   * maven-surefire-report-plugin
[INFO]   maven-toolchains-plugin
[INFO]   maven-verifier-plugin
[INFO]   maven-war-plugin
[INFO] /pom: org.apache https://maven.apache.org/pom/
[INFO] > apache index-path = /asf/
[INFO] > apache site = https://maven.apache.org/pom/asf/
[INFO]   apache
[INFO] /pom: org.apache.maven https://maven.apache.org/pom/
[INFO] > maven-parent index-path = /maven/
[INFO] > maven-parent site = https://maven.apache.org/pom/maven/
[INFO]   maven-parent
[INFO] /release: org.apache.maven.release
[INFO]   maven-release (,3)
[INFO] /reporting: org.apache.maven.reporting https://maven.apache.org/shared/
[INFO]   maven-reporting-api
[INFO]   maven-reporting-exec
[INFO]   maven-reporting-impl
[INFO] /resolver: org.apache.maven.resolver
[INFO]   maven-resolver
[INFO] /resources: org.apache.apache.resources
[INFO] > apache-source-release-assembly-descriptor site = http://maven.apache.org/apache-resource-bundles/
[INFO]   apache-source-release-assembly-descriptor
[INFO] /resources: org.apache
[INFO] > apache-incubator-disclaimer-resource-bundle site = http://maven.apache.org/apache-resource-bundles/
[INFO]   apache-incubator-disclaimer-resource-bundle (,1.1]
[INFO] > apache-jar-resource-bundle site = http://maven.apache.org/apache-resource-bundles/
[INFO]   apache-jar-resource-bundle (,1.4]
[INFO] > apache-license-header-resource-bundle site = http://maven.apache.org/apache-resource-bundles/
[INFO]   apache-license-header-resource-bundle (,1.1]
[INFO] /scm: org.apache.maven.scm
[INFO]   maven-scm
[INFO] /shared: org.apache.maven.shared https://maven.apache.org/shared/
[INFO]   file-management
[INFO]   maven-artifact-transfer
[INFO]   maven-common-artifact-filters
[INFO]   maven-dependency-analyzer
[INFO]   maven-dependency-tree
[INFO]   maven-filtering
[INFO]   maven-invoker
[INFO]   maven-jarsigner
[INFO]   maven-mapping
[INFO]   maven-script-interpreter
[INFO]   maven-shared-incremental
[INFO]   maven-shared-jar
[INFO]   maven-shared-resources
[INFO]   maven-shared-utils
[INFO]   maven-shared-io
[INFO]   maven-verifier
[INFO] /shared: org.apache.maven https://maven.apache.org/shared/
[INFO]   maven-archiver
[INFO] > maven-skins index-path = /skins/
[INFO] /skins: org.apache.maven.skins https://maven.apache.org/skins/
[INFO]   maven-default-skin
[INFO]   maven-fluido-skin
[INFO] /surefire: org.apache.maven.surefire
[INFO]   surefire
[INFO] /wagon: org.apache.maven.wagon
[INFO]   wagon
[INFO]
[ERROR] maven-project-info-reports-plugin: found 3.1.0 instead of 3.0.0 in https://maven.apache.org/plugins/
[INFO] Generating "Dist Tool> Check Errors" report --- dist-tool-plugin:1.0-SNAPSHOT:check-errors
[INFO] Generating "Dist Tool> List Plugins Prerequisites" report --- dist-tool-plugin:1.0-SNAPSHOT:list-plugins-prerequisites
[INFO] Generating "Dist Tool> List Master Jobs" report --- dist-tool-plugin:1.0-SNAPSHOT:list-master-jobs
IOException try 1 while reading https://builds.apache.org/job/maven-box/job/maven-metric: class org.jsoup.HttpStatusException HTTP error fetching URL
IOException try 2 while reading https://builds.apache.org/job/maven-box/job/maven-metric: class org.jsoup.HttpStatusException HTTP error fetching URL
IOException try 3 while reading https://builds.apache.org/job/maven-box/job/maven-metric: class org.jsoup.HttpStatusException HTTP error fetching URL
[WARNING] Failed to read status for maven-metric Jenkins job https://builds.apache.org/job/maven-box/job/maven-metric
IOException try 1 while reading https://builds.apache.org/job/maven-box/job/maven-metric-extension: class org.jsoup.HttpStatusException HTTP error fetching URL
IOException try 2 while reading https://builds.apache.org/job/maven-box/job/maven-metric-extension: class org.jsoup.HttpStatusException HTTP error fetching URL
IOException try 3 while reading https://builds.apache.org/job/maven-box/job/maven-metric-extension: class org.jsoup.HttpStatusException HTTP error fetching URL
[WARNING] Failed to read status for maven-metric-extension Jenkins job https://builds.apache.org/job/maven-box/job/maven-metric-extension
[INFO] Generating "Dist Tool> Failure Hack" report --- dist-tool-plugin:1.0-SNAPSHOT:failure-report
[ERROR] check-source-release.log error log not empty:
Missing file for maven-project-info-reports-plugin in http://www.apache.org/dist/maven/plugins
 > maven-project-info-reports-plugin-3.0.0-source-release.zip <
 > maven-project-info-reports-plugin-3.0.0-source-release.zip.asc <
 > maven-project-info-reports-plugin-3.0.0-source-release.zip.sha1 or .sha512 <
Different version than 3.0.0 for maven-project-info-reports-plugin available in http://www.apache.org/dist/maven/plugins
 > maven-project-info-reports-plugin-3.1.0-source-release.zip <
 > maven-project-info-reports-plugin-3.1.0-source-release.zip.asc <
 > maven-project-info-reports-plugin-3.1.0-source-release.zip.sha512 <
Missing file for wagon in http://www.apache.org/dist/maven/wagon
 > wagon-3.4.0-source-release.zip <
 > wagon-3.4.0-source-release.zip.asc <
 > wagon-3.4.0-source-release.zip.sha1 or .sha512 <
Different version than 3.4.0 for wagon available in http://www.apache.org/dist/maven/wagon
 > wagon-3.4.1-source-release.zip <
 > wagon-3.4.1-source-release.zip.asc <
 > wagon-3.4.1-source-release.zip.sha512 <

[ERROR] check-index-page.log error log not empty:
maven-project-info-reports-plugin: found 3.1.0 instead of 3.0.0 in https://maven.apache.org/plugins/

[JENKINS] Archiving site from <https://builds.apache.org/job/dist-tool-plugin/ws/target/site> to /x1/jenkins/jenkins-home/jobs/dist-tool-plugin/site
[INFO] ------------------------------------------------------------------------
[INFO] BUILD FAILURE
[INFO] ------------------------------------------------------------------------
[INFO] Total time:  06:07 min
[INFO] Finished at: 2020-05-27T09:57:31Z
[INFO] ------------------------------------------------------------------------
[WARNING] The requested profile "apache.snapshots" could not be activated because it does not exist.
Waiting for Jenkins to finish collecting data
[ERROR] Failed to execute goal org.apache.maven.plugins:maven-site-plugin:3.7.1:site (default-site) on project dist-tool-plugin: Error generating dist-tool-plugin:1.0-SNAPSHOT:failure-report report: Dist Tool> Checks found inconsistencies in some released artifacts, see https://builds.apache.org/job/dist-tool-plugin/site/dist-tool-check-errors.html for more information -> [Help 1]
org.apache.maven.lifecycle.LifecycleExecutionException: Failed to execute goal org.apache.maven.plugins:maven-site-plugin:3.7.1:site (default-site) on project dist-tool-plugin: Error generating dist-tool-plugin:1.0-SNAPSHOT:failure-report report
    at org.apache.maven.lifecycle.internal.MojoExecutor.execute (MojoExecutor.java:215)
    at org.apache.maven.lifecycle.internal.MojoExecutor.execute (MojoExecutor.java:156)
    at org.apache.maven.lifecycle.internal.MojoExecutor.execute (MojoExecutor.java:148)
    at org.apache.maven.lifecycle.internal.LifecycleModuleBuilder.buildProject (LifecycleModuleBuilder.java:117)
    at org.apache.maven.lifecycle.internal.LifecycleModuleBuilder.buildProject (LifecycleModuleBuilder.java:81)
    at org.apache.maven.lifecycle.internal.builder.singlethreaded.SingleThreadedBuilder.build (SingleThreadedBuilder.java:56)
    at org.apache.maven.lifecycle.internal.LifecycleStarter.execute (LifecycleStarter.java:128)
    at org.apache.maven.DefaultMaven.doExecute (DefaultMaven.java:305)
    at org.apache.maven.DefaultMaven.doExecute (DefaultMaven.java:192)
    at org.apache.maven.DefaultMaven.execute (DefaultMaven.java:105)
    at org.jvnet.hudson.maven3.launcher.Maven35Launcher.main (Maven35Launcher.java:130)
    at sun.reflect.NativeMethodAccessorImpl.invoke0 (Native Method)
    at sun.reflect.NativeMethodAccessorImpl.invoke (NativeMethodAccessorImpl.java:62)
    at sun.reflect.DelegatingMethodAccessorImpl.invoke (DelegatingMethodAccessorImpl.java:43)
    at java.lang.reflect.Method.invoke (Method.java:498)
    at org.codehaus.plexus.classworlds.launcher.Launcher.launchEnhanced (Launcher.java:282)
    at org.codehaus.plexus.classworlds.launcher.Launcher.launch (Launcher.java:225)
    at jenkins.maven3.agent.Maven35Main.launch (Maven35Main.java:178)
    at sun.reflect.NativeMethodAccessorImpl.invoke0 (Native Method)
    at sun.reflect.NativeMethodAccessorImpl.invoke (NativeMethodAccessorImpl.java:62)
    at sun.reflect.DelegatingMethodAccessorImpl.invoke (DelegatingMethodAccessorImpl.java:43)
    at java.lang.reflect.Method.invoke (Method.java:498)
    at hudson.maven.Maven3Builder.call (Maven3Builder.java:139)
    at hudson.maven.Maven3Builder.call (Maven3Builder.java:70)
    at hudson.remoting.UserRequest.perform (UserRequest.java:212)
    at hudson.remoting.UserRequest.perform (UserRequest.java:54)
    at hudson.remoting.Request$2.run (Request.java:369)
    at hudson.remoting.InterceptingExecutorService$1.call (InterceptingExecutorService.java:72)
    at java.util.concurrent.FutureTask.run (FutureTask.java:266)
    at java.util.concurrent.ThreadPoolExecutor.runWorker (ThreadPoolExecutor.java:1149)
    at java.util.concurrent.ThreadPoolExecutor$Worker.run (ThreadPoolExecutor.java:624)
    at java.lang.Thread.run (Thread.java:748)
Caused by: org.apache.maven.plugin.MojoExecutionException: Error generating dist-tool-plugin:1.0-SNAPSHOT:failure-report report
    at org.apache.maven.plugins.site.render.SiteMojo.execute (SiteMojo.java:155)
    at org.apache.maven.plugin.DefaultBuildPluginManager.executeMojo (DefaultBuildPluginManager.java:137)
    at org.apache.maven.lifecycle.internal.MojoExecutor.execute (MojoExecutor.java:210)
    at org.apache.maven.lifecycle.internal.MojoExecutor.execute (MojoExecutor.java:156)
    at org.apache.maven.lifecycle.internal.MojoExecutor.execute (MojoExecutor.java:148)
    at org.apache.maven.lifecycle.internal.LifecycleModuleBuilder.buildProject (LifecycleModuleBuilder.java:117)
    at org.apache.maven.lifecycle.internal.LifecycleModuleBuilder.buildProject (LifecycleModuleBuilder.java:81)
    at org.apache.maven.lifecycle.internal.builder.singlethreaded.SingleThreadedBuilder.build (SingleThreadedBuilder.java:56)
    at org.apache.maven.lifecycle.internal.LifecycleStarter.execute (LifecycleStarter.java:128)
    at org.apache.maven.DefaultMaven.doExecute (DefaultMaven.java:305)
    at org.apache.maven.DefaultMaven.doExecute (DefaultMaven.java:192)
    at org.apache.maven.DefaultMaven.execute (DefaultMaven.java:105)
    at org.jvnet.hudson.maven3.launcher.Maven35Launcher.main (Maven35Launcher.java:130)
    at sun.reflect.NativeMethodAccessorImpl.invoke0 (Native Method)
    at sun.reflect.NativeMethodAccessorImpl.invoke (NativeMethodAccessorImpl.java:62)
    at sun.reflect.DelegatingMethodAccessorImpl.invoke (DelegatingMethodAccessorImpl.java:43)
    at java.lang.reflect.Method.invoke (Method.java:498)
    at org.codehaus.plexus.classworlds.launcher.Launcher.launchEnhanced (Launcher.java:282)
    at org.codehaus.plexus.classworlds.launcher.Launcher.launch (Launcher.java:225)
    at jenkins.maven3.agent.Maven35Main.launch (Maven35Main.java:178)
    at sun.reflect.NativeMethodAccessorImpl.invoke0 (Native Method)
    at sun.reflect.NativeMethodAccessorImpl.invoke (NativeMethodAccessorImpl.java:62)
    at sun.reflect.DelegatingMethodAccessorImpl.invoke (DelegatingMethodAccessorImpl.java:43)
    at java.lang.reflect.Method.invoke (Method.java:498)
    at hudson.maven.Maven3Builder.call (Maven3Builder.java:139)
    at hudson.maven.Maven3Builder.call (Maven3Builder.java:70)
    at hudson.remoting.UserRequest.perform (UserRequest.java:212)
    at hudson.remoting.UserRequest.perform (UserRequest.java:54)
    at hudson.remoting.Request$2.run (Request.java:369)
    at hudson.remoting.InterceptingExecutorService$1.call (InterceptingExecutorService.java:72)
    at java.util.concurrent.FutureTask.run (FutureTask.java:266)
    at java.util.concurrent.ThreadPoolExecutor.runWorker (ThreadPoolExecutor.java:1149)
    at java.util.concurrent.ThreadPoolExecutor$Worker.run (ThreadPoolExecutor.java:624)
    at java.lang.Thread.run (Thread.java:748)
Caused by: org.apache.maven.reporting.MavenReportException: Dist Tool> Checks found inconsistencies in some released artifacts, see https://builds.apache.org/job/dist-tool-plugin/site/dist-tool-check-errors.html for more information
    at org.apache.maven.dist.tools.DistCheckErrorsMojo.executeReport (DistCheckErrorsMojo.java:113)
    at org.apache.maven.reporting.AbstractMavenReport.generate (AbstractMavenReport.java:251)
    at org.apache.maven.plugins.site.render.ReportDocumentRenderer.renderDocument (ReportDocumentRenderer.java:230)
    at org.apache.maven.doxia.siterenderer.DefaultSiteRenderer.render (DefaultSiteRenderer.java:349)
    at org.apache.maven.plugins.site.render.SiteMojo.renderLocale (SiteMojo.java:198)
    at org.apache.maven.plugins.site.render.SiteMojo.execute (SiteMojo.java:147)
    at org.apache.maven.plugin.DefaultBuildPluginManager.executeMojo (DefaultBuildPluginManager.java:137)
    at org.apache.maven.lifecycle.internal.MojoExecutor.execute (MojoExecutor.java:210)
    at org.apache.maven.lifecycle.internal.MojoExecutor.execute (MojoExecutor.java:156)
    at org.apache.maven.lifecycle.internal.MojoExecutor.execute (MojoExecutor.java:148)
    at org.apache.maven.lifecycle.internal.LifecycleModuleBuilder.buildProject (LifecycleModuleBuilder.java:117)
    at org.apache.maven.lifecycle.internal.LifecycleModuleBuilder.buildProject (LifecycleModuleBuilder.java:81)
    at org.apache.maven.lifecycle.internal.builder.singlethreaded.SingleThreadedBuilder.build (SingleThreadedBuilder.java:56)
    at org.apache.maven.lifecycle.internal.LifecycleStarter.execute (LifecycleStarter.java:128)
    at org.apache.maven.DefaultMaven.doExecute (DefaultMaven.java:305)
    at org.apache.maven.DefaultMaven.doExecute (DefaultMaven.java:192)
    at org.apache.maven.DefaultMaven.execute (DefaultMaven.java:105)
    at org.jvnet.hudson.maven3.launcher.Maven35Launcher.main (Maven35Launcher.java:130)
    at sun.reflect.NativeMethodAccessorImpl.invoke0 (Native Method)
    at sun.reflect.NativeMethodAccessorImpl.invoke (NativeMethodAccessorImpl.java:62)
    at sun.reflect.DelegatingMethodAccessorImpl.invoke (DelegatingMethodAccessorImpl.java:43)
    at java.lang.reflect.Method.invoke (Method.java:498)
    at org.codehaus.plexus.classworlds.launcher.Launcher.launchEnhanced (Launcher.java:282)
    at org.codehaus.plexus.classworlds.launcher.Launcher.launch (Launcher.java:225)
    at jenkins.maven3.agent.Maven35Main.launch (Maven35Main.java:178)
    at sun.reflect.NativeMethodAccessorImpl.invoke0 (Native Method)
    at sun.reflect.NativeMethodAccessorImpl.invoke (NativeMethodAccessorImpl.java:62)
    at sun.reflect.DelegatingMethodAccessorImpl.invoke (DelegatingMethodAccessorImpl.java:43)
    at java.lang.reflect.Method.invoke (Method.java:498)
    at hudson.maven.Maven3Builder.call (Maven3Builder.java:139)
    at hudson.maven.Maven3Builder.call (Maven3Builder.java:70)
    at hudson.remoting.UserRequest.perform (UserRequest.java:212)
    at hudson.remoting.UserRequest.perform (UserRequest.java:54)
    at hudson.remoting.Request$2.run (Request.java:369)
    at hudson.remoting.InterceptingExecutorService$1.call (InterceptingExecutorService.java:72)
    at java.util.concurrent.FutureTask.run (FutureTask.java:266)
    at java.util.concurrent.ThreadPoolExecutor.runWorker (ThreadPoolExecutor.java:1149)
    at java.util.concurrent.ThreadPoolExecutor$Worker.run (ThreadPoolExecutor.java:624)
    at java.lang.Thread.run (Thread.java:748)
[ERROR]
[ERROR] Re-run Maven using the -X switch to enable full debug logging.
[ERROR]
[ERROR] For more information about the errors and possible solutions, please read the following articles:
[ERROR] [Help 1] http://cwiki.apache.org/confluence/display/MAVEN/MojoExecutionException
[JENKINS] Archiving <https://builds.apache.org/job/dist-tool-plugin/ws/pom.xml> to org.apache.maven.dist.tools/dist-tool-plugin/1.0-SNAPSHOT/dist-tool-plugin-1.0-SNAPSHOT.pom
[JENKINS] Archiving <https://builds.apache.org/job/dist-tool-plugin/ws/target/dist-tool-plugin-1.0-SNAPSHOT.jar> to org.apache.maven.dist.tools/dist-tool-plugin/1.0-SNAPSHOT/dist-tool-plugin-1.0-SNAPSHOT.jar
[Fast Archiver] Compressed 87.80 KB of artifacts by 72.9% relative to #2969
channel stopped
Reply | Threaded
Open this post in threaded view
|

Build failed in Jenkins: dist-tool-plugin #2971

Apache Jenkins Server-2
See <https://builds.apache.org/job/dist-tool-plugin/2971/display/redirect>

Changes:


------------------------------------------
[...truncated 230.01 KB...]
[INFO]   maven-install-plugin
[INFO]   maven-invoker-plugin
[INFO]   maven-jar-plugin
[INFO]   maven-jarsigner-plugin
[INFO]   maven-javadoc-plugin
[INFO]   maven-jdeps-plugin
[INFO]   maven-jdeprscan-plugin
[INFO]   maven-jlink-plugin
[INFO]   maven-jmod-plugin
[INFO]   * maven-jxr-plugin
[INFO]   maven-linkcheck-plugin
[INFO]   maven-patch-plugin
[INFO]   maven-pdf-plugin
[INFO]   * maven-plugin-plugin
[INFO]   maven-pmd-plugin
[INFO]   maven-project-info-reports-plugin
[INFO]   maven-rar-plugin
[INFO]   * maven-release-plugin  
[INFO]   maven-remote-resources-plugin
[INFO]   maven-resources-plugin
[INFO]   * maven-scm-plugin
[INFO]   maven-scm-publish-plugin
[INFO]   maven-shade-plugin
[INFO]   maven-site-plugin
[INFO]   maven-source-plugin
[INFO]   maven-stage-plugin
[INFO]   * maven-surefire-plugin
[INFO]   * maven-surefire-report-plugin
[INFO]   maven-toolchains-plugin
[INFO]   maven-verifier-plugin
[INFO]   maven-war-plugin
[INFO] /pom: org.apache https://maven.apache.org/pom/
[INFO] > apache index-path = /asf/
[INFO] > apache site = https://maven.apache.org/pom/asf/
[INFO]   apache
IOException try 1 while reading https://maven.apache.org/pom/: class java.net.SocketTimeoutException Read timed out
[INFO] /pom: org.apache.maven https://maven.apache.org/pom/
[INFO] > maven-parent index-path = /maven/
[INFO] > maven-parent site = https://maven.apache.org/pom/maven/
[INFO]   maven-parent
[INFO] /release: org.apache.maven.release
[INFO]   maven-release (,3)
[INFO] /reporting: org.apache.maven.reporting https://maven.apache.org/shared/
[INFO]   maven-reporting-api
[INFO]   maven-reporting-exec
[INFO]   maven-reporting-impl
[INFO] /resolver: org.apache.maven.resolver
[INFO]   maven-resolver
[INFO] /resources: org.apache.apache.resources
[INFO] > apache-source-release-assembly-descriptor site = http://maven.apache.org/apache-resource-bundles/
[INFO]   apache-source-release-assembly-descriptor
[INFO] /resources: org.apache
[INFO] > apache-incubator-disclaimer-resource-bundle site = http://maven.apache.org/apache-resource-bundles/
[INFO]   apache-incubator-disclaimer-resource-bundle (,1.1]
[INFO] > apache-jar-resource-bundle site = http://maven.apache.org/apache-resource-bundles/
[INFO]   apache-jar-resource-bundle (,1.4]
[INFO] > apache-license-header-resource-bundle site = http://maven.apache.org/apache-resource-bundles/
[INFO]   apache-license-header-resource-bundle (,1.1]
[INFO] /scm: org.apache.maven.scm
[INFO]   maven-scm
[INFO] /shared: org.apache.maven.shared https://maven.apache.org/shared/
[INFO]   file-management
[INFO]   maven-artifact-transfer
[INFO]   maven-common-artifact-filters
[INFO]   maven-dependency-analyzer
[INFO]   maven-dependency-tree
[INFO]   maven-filtering
[INFO]   maven-invoker
[INFO]   maven-jarsigner
[INFO]   maven-mapping
[INFO]   maven-script-interpreter
[INFO]   maven-shared-incremental
[INFO]   maven-shared-jar
[INFO]   maven-shared-resources
[INFO]   maven-shared-utils
[INFO]   maven-shared-io
[INFO]   maven-verifier
[INFO] /shared: org.apache.maven https://maven.apache.org/shared/
[INFO]   maven-archiver
[INFO] > maven-skins index-path = /skins/
[INFO] /skins: org.apache.maven.skins https://maven.apache.org/skins/
[INFO]   maven-default-skin
[INFO]   maven-fluido-skin
[INFO] /surefire: org.apache.maven.surefire
[INFO]   surefire
[INFO] /wagon: org.apache.maven.wagon
[INFO]   wagon
[INFO]
[ERROR] maven-project-info-reports-plugin: found 3.1.0 instead of 3.0.0 in https://maven.apache.org/plugins/
[INFO] Generating "Dist Tool> Check Errors" report --- dist-tool-plugin:1.0-SNAPSHOT:check-errors
[INFO] Generating "Dist Tool> List Plugins Prerequisites" report --- dist-tool-plugin:1.0-SNAPSHOT:list-plugins-prerequisites
[INFO] Generating "Dist Tool> List Master Jobs" report --- dist-tool-plugin:1.0-SNAPSHOT:list-master-jobs
IOException try 1 while reading https://builds.apache.org/job/maven-box/job/maven-metric: class org.jsoup.HttpStatusException HTTP error fetching URL
IOException try 2 while reading https://builds.apache.org/job/maven-box/job/maven-metric: class org.jsoup.HttpStatusException HTTP error fetching URL
IOException try 3 while reading https://builds.apache.org/job/maven-box/job/maven-metric: class org.jsoup.HttpStatusException HTTP error fetching URL
[WARNING] Failed to read status for maven-metric Jenkins job https://builds.apache.org/job/maven-box/job/maven-metric
IOException try 1 while reading https://builds.apache.org/job/maven-box/job/maven-metric-extension: class org.jsoup.HttpStatusException HTTP error fetching URL
IOException try 2 while reading https://builds.apache.org/job/maven-box/job/maven-metric-extension: class org.jsoup.HttpStatusException HTTP error fetching URL
IOException try 3 while reading https://builds.apache.org/job/maven-box/job/maven-metric-extension: class org.jsoup.HttpStatusException HTTP error fetching URL
[WARNING] Failed to read status for maven-metric-extension Jenkins job https://builds.apache.org/job/maven-box/job/maven-metric-extension
[INFO] Generating "Dist Tool> Failure Hack" report --- dist-tool-plugin:1.0-SNAPSHOT:failure-report
[ERROR] check-source-release.log error log not empty:
Missing file for maven-project-info-reports-plugin in http://www.apache.org/dist/maven/plugins
 > maven-project-info-reports-plugin-3.0.0-source-release.zip <
 > maven-project-info-reports-plugin-3.0.0-source-release.zip.asc <
 > maven-project-info-reports-plugin-3.0.0-source-release.zip.sha1 or .sha512 <
Different version than 3.0.0 for maven-project-info-reports-plugin available in http://www.apache.org/dist/maven/plugins
 > maven-project-info-reports-plugin-3.1.0-source-release.zip <
 > maven-project-info-reports-plugin-3.1.0-source-release.zip.asc <
 > maven-project-info-reports-plugin-3.1.0-source-release.zip.sha512 <
Missing file for wagon in http://www.apache.org/dist/maven/wagon
 > wagon-3.4.0-source-release.zip <
 > wagon-3.4.0-source-release.zip.asc <
 > wagon-3.4.0-source-release.zip.sha1 or .sha512 <
Different version than 3.4.0 for wagon available in http://www.apache.org/dist/maven/wagon
 > wagon-3.4.1-source-release.zip <
 > wagon-3.4.1-source-release.zip.asc <
 > wagon-3.4.1-source-release.zip.sha512 <

[ERROR] check-index-page.log error log not empty:
maven-project-info-reports-plugin: found 3.1.0 instead of 3.0.0 in https://maven.apache.org/plugins/

[JENKINS] Archiving site from <https://builds.apache.org/job/dist-tool-plugin/ws/target/site> to /x1/jenkins/jenkins-home/jobs/dist-tool-plugin/site
[INFO] ------------------------------------------------------------------------
[INFO] BUILD FAILURE
[INFO] ------------------------------------------------------------------------
[INFO] Total time:  05:46 min
[INFO] Finished at: 2020-05-28T09:57:09Z
[INFO] ------------------------------------------------------------------------
[WARNING] The requested profile "apache.snapshots" could not be activated because it does not exist.
Waiting for Jenkins to finish collecting data
[ERROR] Failed to execute goal org.apache.maven.plugins:maven-site-plugin:3.7.1:site (default-site) on project dist-tool-plugin: Error generating dist-tool-plugin:1.0-SNAPSHOT:failure-report report: Dist Tool> Checks found inconsistencies in some released artifacts, see https://builds.apache.org/job/dist-tool-plugin/site/dist-tool-check-errors.html for more information -> [Help 1]
org.apache.maven.lifecycle.LifecycleExecutionException: Failed to execute goal org.apache.maven.plugins:maven-site-plugin:3.7.1:site (default-site) on project dist-tool-plugin: Error generating dist-tool-plugin:1.0-SNAPSHOT:failure-report report
    at org.apache.maven.lifecycle.internal.MojoExecutor.execute (MojoExecutor.java:215)
    at org.apache.maven.lifecycle.internal.MojoExecutor.execute (MojoExecutor.java:156)
    at org.apache.maven.lifecycle.internal.MojoExecutor.execute (MojoExecutor.java:148)
    at org.apache.maven.lifecycle.internal.LifecycleModuleBuilder.buildProject (LifecycleModuleBuilder.java:117)
    at org.apache.maven.lifecycle.internal.LifecycleModuleBuilder.buildProject (LifecycleModuleBuilder.java:81)
    at org.apache.maven.lifecycle.internal.builder.singlethreaded.SingleThreadedBuilder.build (SingleThreadedBuilder.java:56)
    at org.apache.maven.lifecycle.internal.LifecycleStarter.execute (LifecycleStarter.java:128)
    at org.apache.maven.DefaultMaven.doExecute (DefaultMaven.java:305)
    at org.apache.maven.DefaultMaven.doExecute (DefaultMaven.java:192)
    at org.apache.maven.DefaultMaven.execute (DefaultMaven.java:105)
    at org.jvnet.hudson.maven3.launcher.Maven35Launcher.main (Maven35Launcher.java:130)
    at sun.reflect.NativeMethodAccessorImpl.invoke0 (Native Method)
    at sun.reflect.NativeMethodAccessorImpl.invoke (NativeMethodAccessorImpl.java:62)
    at sun.reflect.DelegatingMethodAccessorImpl.invoke (DelegatingMethodAccessorImpl.java:43)
    at java.lang.reflect.Method.invoke (Method.java:498)
    at org.codehaus.plexus.classworlds.launcher.Launcher.launchEnhanced (Launcher.java:282)
    at org.codehaus.plexus.classworlds.launcher.Launcher.launch (Launcher.java:225)
    at jenkins.maven3.agent.Maven35Main.launch (Maven35Main.java:178)
    at sun.reflect.NativeMethodAccessorImpl.invoke0 (Native Method)
    at sun.reflect.NativeMethodAccessorImpl.invoke (NativeMethodAccessorImpl.java:62)
    at sun.reflect.DelegatingMethodAccessorImpl.invoke (DelegatingMethodAccessorImpl.java:43)
    at java.lang.reflect.Method.invoke (Method.java:498)
    at hudson.maven.Maven3Builder.call (Maven3Builder.java:139)
    at hudson.maven.Maven3Builder.call (Maven3Builder.java:70)
    at hudson.remoting.UserRequest.perform (UserRequest.java:212)
    at hudson.remoting.UserRequest.perform (UserRequest.java:54)
    at hudson.remoting.Request$2.run (Request.java:369)
    at hudson.remoting.InterceptingExecutorService$1.call (InterceptingExecutorService.java:72)
    at java.util.concurrent.FutureTask.run (FutureTask.java:266)
    at java.util.concurrent.ThreadPoolExecutor.runWorker (ThreadPoolExecutor.java:1149)
    at java.util.concurrent.ThreadPoolExecutor$Worker.run (ThreadPoolExecutor.java:624)
    at java.lang.Thread.run (Thread.java:748)
Caused by: org.apache.maven.plugin.MojoExecutionException: Error generating dist-tool-plugin:1.0-SNAPSHOT:failure-report report
    at org.apache.maven.plugins.site.render.SiteMojo.execute (SiteMojo.java:155)
    at org.apache.maven.plugin.DefaultBuildPluginManager.executeMojo (DefaultBuildPluginManager.java:137)
    at org.apache.maven.lifecycle.internal.MojoExecutor.execute (MojoExecutor.java:210)
    at org.apache.maven.lifecycle.internal.MojoExecutor.execute (MojoExecutor.java:156)
    at org.apache.maven.lifecycle.internal.MojoExecutor.execute (MojoExecutor.java:148)
    at org.apache.maven.lifecycle.internal.LifecycleModuleBuilder.buildProject (LifecycleModuleBuilder.java:117)
    at org.apache.maven.lifecycle.internal.LifecycleModuleBuilder.buildProject (LifecycleModuleBuilder.java:81)
    at org.apache.maven.lifecycle.internal.builder.singlethreaded.SingleThreadedBuilder.build (SingleThreadedBuilder.java:56)
    at org.apache.maven.lifecycle.internal.LifecycleStarter.execute (LifecycleStarter.java:128)
    at org.apache.maven.DefaultMaven.doExecute (DefaultMaven.java:305)
    at org.apache.maven.DefaultMaven.doExecute (DefaultMaven.java:192)
    at org.apache.maven.DefaultMaven.execute (DefaultMaven.java:105)
    at org.jvnet.hudson.maven3.launcher.Maven35Launcher.main (Maven35Launcher.java:130)
    at sun.reflect.NativeMethodAccessorImpl.invoke0 (Native Method)
    at sun.reflect.NativeMethodAccessorImpl.invoke (NativeMethodAccessorImpl.java:62)
    at sun.reflect.DelegatingMethodAccessorImpl.invoke (DelegatingMethodAccessorImpl.java:43)
    at java.lang.reflect.Method.invoke (Method.java:498)
    at org.codehaus.plexus.classworlds.launcher.Launcher.launchEnhanced (Launcher.java:282)
    at org.codehaus.plexus.classworlds.launcher.Launcher.launch (Launcher.java:225)
    at jenkins.maven3.agent.Maven35Main.launch (Maven35Main.java:178)
    at sun.reflect.NativeMethodAccessorImpl.invoke0 (Native Method)
    at sun.reflect.NativeMethodAccessorImpl.invoke (NativeMethodAccessorImpl.java:62)
    at sun.reflect.DelegatingMethodAccessorImpl.invoke (DelegatingMethodAccessorImpl.java:43)
    at java.lang.reflect.Method.invoke (Method.java:498)
    at hudson.maven.Maven3Builder.call (Maven3Builder.java:139)
    at hudson.maven.Maven3Builder.call (Maven3Builder.java:70)
    at hudson.remoting.UserRequest.perform (UserRequest.java:212)
    at hudson.remoting.UserRequest.perform (UserRequest.java:54)
    at hudson.remoting.Request$2.run (Request.java:369)
    at hudson.remoting.InterceptingExecutorService$1.call (InterceptingExecutorService.java:72)
    at java.util.concurrent.FutureTask.run (FutureTask.java:266)
    at java.util.concurrent.ThreadPoolExecutor.runWorker (ThreadPoolExecutor.java:1149)
    at java.util.concurrent.ThreadPoolExecutor$Worker.run (ThreadPoolExecutor.java:624)
    at java.lang.Thread.run (Thread.java:748)
Caused by: org.apache.maven.reporting.MavenReportException: Dist Tool> Checks found inconsistencies in some released artifacts, see https://builds.apache.org/job/dist-tool-plugin/site/dist-tool-check-errors.html for more information
    at org.apache.maven.dist.tools.DistCheckErrorsMojo.executeReport (DistCheckErrorsMojo.java:113)
    at org.apache.maven.reporting.AbstractMavenReport.generate (AbstractMavenReport.java:251)
    at org.apache.maven.plugins.site.render.ReportDocumentRenderer.renderDocument (ReportDocumentRenderer.java:230)
    at org.apache.maven.doxia.siterenderer.DefaultSiteRenderer.render (DefaultSiteRenderer.java:349)
    at org.apache.maven.plugins.site.render.SiteMojo.renderLocale (SiteMojo.java:198)
    at org.apache.maven.plugins.site.render.SiteMojo.execute (SiteMojo.java:147)
    at org.apache.maven.plugin.DefaultBuildPluginManager.executeMojo (DefaultBuildPluginManager.java:137)
    at org.apache.maven.lifecycle.internal.MojoExecutor.execute (MojoExecutor.java:210)
    at org.apache.maven.lifecycle.internal.MojoExecutor.execute (MojoExecutor.java:156)
    at org.apache.maven.lifecycle.internal.MojoExecutor.execute (MojoExecutor.java:148)
    at org.apache.maven.lifecycle.internal.LifecycleModuleBuilder.buildProject (LifecycleModuleBuilder.java:117)
    at org.apache.maven.lifecycle.internal.LifecycleModuleBuilder.buildProject (LifecycleModuleBuilder.java:81)
    at org.apache.maven.lifecycle.internal.builder.singlethreaded.SingleThreadedBuilder.build (SingleThreadedBuilder.java:56)
    at org.apache.maven.lifecycle.internal.LifecycleStarter.execute (LifecycleStarter.java:128)
    at org.apache.maven.DefaultMaven.doExecute (DefaultMaven.java:305)
    at org.apache.maven.DefaultMaven.doExecute (DefaultMaven.java:192)
    at org.apache.maven.DefaultMaven.execute (DefaultMaven.java:105)
    at org.jvnet.hudson.maven3.launcher.Maven35Launcher.main (Maven35Launcher.java:130)
    at sun.reflect.NativeMethodAccessorImpl.invoke0 (Native Method)
    at sun.reflect.NativeMethodAccessorImpl.invoke (NativeMethodAccessorImpl.java:62)
    at sun.reflect.DelegatingMethodAccessorImpl.invoke (DelegatingMethodAccessorImpl.java:43)
    at java.lang.reflect.Method.invoke (Method.java:498)
    at org.codehaus.plexus.classworlds.launcher.Launcher.launchEnhanced (Launcher.java:282)
    at org.codehaus.plexus.classworlds.launcher.Launcher.launch (Launcher.java:225)
    at jenkins.maven3.agent.Maven35Main.launch (Maven35Main.java:178)
    at sun.reflect.NativeMethodAccessorImpl.invoke0 (Native Method)
    at sun.reflect.NativeMethodAccessorImpl.invoke (NativeMethodAccessorImpl.java:62)
    at sun.reflect.DelegatingMethodAccessorImpl.invoke (DelegatingMethodAccessorImpl.java:43)
    at java.lang.reflect.Method.invoke (Method.java:498)
    at hudson.maven.Maven3Builder.call (Maven3Builder.java:139)
    at hudson.maven.Maven3Builder.call (Maven3Builder.java:70)
    at hudson.remoting.UserRequest.perform (UserRequest.java:212)
    at hudson.remoting.UserRequest.perform (UserRequest.java:54)
    at hudson.remoting.Request$2.run (Request.java:369)
    at hudson.remoting.InterceptingExecutorService$1.call (InterceptingExecutorService.java:72)
    at java.util.concurrent.FutureTask.run (FutureTask.java:266)
    at java.util.concurrent.ThreadPoolExecutor.runWorker (ThreadPoolExecutor.java:1149)
    at java.util.concurrent.ThreadPoolExecutor$Worker.run (ThreadPoolExecutor.java:624)
    at java.lang.Thread.run (Thread.java:748)
[ERROR]
[ERROR] Re-run Maven using the -X switch to enable full debug logging.
[ERROR]
[ERROR] For more information about the errors and possible solutions, please read the following articles:
[ERROR] [Help 1] http://cwiki.apache.org/confluence/display/MAVEN/MojoExecutionException
[JENKINS] Archiving <https://builds.apache.org/job/dist-tool-plugin/ws/pom.xml> to org.apache.maven.dist.tools/dist-tool-plugin/1.0-SNAPSHOT/dist-tool-plugin-1.0-SNAPSHOT.pom
[JENKINS] Archiving <https://builds.apache.org/job/dist-tool-plugin/ws/target/dist-tool-plugin-1.0-SNAPSHOT.jar> to org.apache.maven.dist.tools/dist-tool-plugin/1.0-SNAPSHOT/dist-tool-plugin-1.0-SNAPSHOT.jar
[Fast Archiver] Compressed 87.80 KB of artifacts by 72.9% relative to #2969
channel stopped
Reply | Threaded
Open this post in threaded view
|

Build failed in Jenkins: dist-tool-plugin #2972

Apache Jenkins Server-2
See <https://builds.apache.org/job/dist-tool-plugin/2972/display/redirect>

Changes:


------------------------------------------
[...truncated 281.91 KB...]
[INFO]   maven-help-plugin
[INFO]   maven-install-plugin
[INFO]   maven-invoker-plugin
[INFO]   maven-jar-plugin
[INFO]   maven-jarsigner-plugin
[INFO]   maven-javadoc-plugin
[INFO]   maven-jdeps-plugin
[INFO]   maven-jdeprscan-plugin
[INFO]   maven-jlink-plugin
[INFO]   maven-jmod-plugin
[INFO]   * maven-jxr-plugin
[INFO]   maven-linkcheck-plugin
[INFO]   maven-patch-plugin
[INFO]   maven-pdf-plugin
[INFO]   * maven-plugin-plugin
[INFO]   maven-pmd-plugin
[INFO]   maven-project-info-reports-plugin
[INFO]   maven-rar-plugin
[INFO]   * maven-release-plugin  
[INFO]   maven-remote-resources-plugin
[INFO]   maven-resources-plugin
[INFO]   * maven-scm-plugin
[INFO]   maven-scm-publish-plugin
[INFO]   maven-shade-plugin
[INFO]   maven-site-plugin
[INFO]   maven-source-plugin
[INFO]   maven-stage-plugin
[INFO]   * maven-surefire-plugin
[INFO]   * maven-surefire-report-plugin
[INFO]   maven-toolchains-plugin
[INFO]   maven-verifier-plugin
[INFO]   maven-war-plugin
[INFO] /pom: org.apache https://maven.apache.org/pom/
[INFO] > apache index-path = /asf/
[INFO] > apache site = https://maven.apache.org/pom/asf/
[INFO]   apache
[INFO] /pom: org.apache.maven https://maven.apache.org/pom/
[INFO] > maven-parent index-path = /maven/
[INFO] > maven-parent site = https://maven.apache.org/pom/maven/
[INFO]   maven-parent
[INFO] /release: org.apache.maven.release
[INFO]   maven-release (,3)
[INFO] /reporting: org.apache.maven.reporting https://maven.apache.org/shared/
[INFO]   maven-reporting-api
[INFO]   maven-reporting-exec
[INFO]   maven-reporting-impl
[INFO] /resolver: org.apache.maven.resolver
[INFO]   maven-resolver
[INFO] /resources: org.apache.apache.resources
[INFO] > apache-source-release-assembly-descriptor site = http://maven.apache.org/apache-resource-bundles/
[INFO]   apache-source-release-assembly-descriptor
[INFO] /resources: org.apache
[INFO] > apache-incubator-disclaimer-resource-bundle site = http://maven.apache.org/apache-resource-bundles/
[INFO]   apache-incubator-disclaimer-resource-bundle (,1.1]
[INFO] > apache-jar-resource-bundle site = http://maven.apache.org/apache-resource-bundles/
[INFO]   apache-jar-resource-bundle (,1.4]
[INFO] > apache-license-header-resource-bundle site = http://maven.apache.org/apache-resource-bundles/
[INFO]   apache-license-header-resource-bundle (,1.1]
[INFO] /scm: org.apache.maven.scm
[INFO]   maven-scm
[INFO] /shared: org.apache.maven.shared https://maven.apache.org/shared/
[INFO]   file-management
[INFO]   maven-artifact-transfer
[INFO]   maven-common-artifact-filters
[INFO]   maven-dependency-analyzer
[INFO]   maven-dependency-tree
[INFO]   maven-filtering
[INFO]   maven-invoker
[INFO]   maven-jarsigner
[INFO]   maven-mapping
[INFO]   maven-script-interpreter
[INFO]   maven-shared-incremental
[INFO]   maven-shared-jar
[INFO]   maven-shared-resources
[INFO]   maven-shared-utils
[INFO]   maven-shared-io
[INFO]   maven-verifier
[INFO] /shared: org.apache.maven https://maven.apache.org/shared/
[INFO]   maven-archiver
[INFO] > maven-skins index-path = /skins/
[INFO] /skins: org.apache.maven.skins https://maven.apache.org/skins/
[INFO]   maven-default-skin
[INFO]   maven-fluido-skin
[INFO] /surefire: org.apache.maven.surefire
[INFO]   surefire
[INFO] /wagon: org.apache.maven.wagon
[INFO]   wagon
[INFO]
[ERROR] maven-project-info-reports-plugin: found 3.1.0 instead of 3.0.0 in https://maven.apache.org/plugins/
[INFO] Generating "Dist Tool> Check Errors" report --- dist-tool-plugin:1.0-SNAPSHOT:check-errors
[INFO] Generating "Dist Tool> List Plugins Prerequisites" report --- dist-tool-plugin:1.0-SNAPSHOT:list-plugins-prerequisites
[INFO] Generating "Dist Tool> List Master Jobs" report --- dist-tool-plugin:1.0-SNAPSHOT:list-master-jobs
IOException try 1 while reading https://builds.apache.org/job/maven-box/job/maven-metric: class org.jsoup.HttpStatusException HTTP error fetching URL
IOException try 2 while reading https://builds.apache.org/job/maven-box/job/maven-metric: class org.jsoup.HttpStatusException HTTP error fetching URL
IOException try 3 while reading https://builds.apache.org/job/maven-box/job/maven-metric: class org.jsoup.HttpStatusException HTTP error fetching URL
[WARNING] Failed to read status for maven-metric Jenkins job https://builds.apache.org/job/maven-box/job/maven-metric
IOException try 1 while reading https://builds.apache.org/job/maven-box/job/maven-metric-extension: class org.jsoup.HttpStatusException HTTP error fetching URL
IOException try 2 while reading https://builds.apache.org/job/maven-box/job/maven-metric-extension: class org.jsoup.HttpStatusException HTTP error fetching URL
IOException try 3 while reading https://builds.apache.org/job/maven-box/job/maven-metric-extension: class org.jsoup.HttpStatusException HTTP error fetching URL
[WARNING] Failed to read status for maven-metric-extension Jenkins job https://builds.apache.org/job/maven-box/job/maven-metric-extension
[INFO] Generating "Dist Tool> Failure Hack" report --- dist-tool-plugin:1.0-SNAPSHOT:failure-report
[ERROR] check-source-release.log error log not empty:
Missing file for maven-project-info-reports-plugin in http://www.apache.org/dist/maven/plugins
 > maven-project-info-reports-plugin-3.0.0-source-release.zip <
 > maven-project-info-reports-plugin-3.0.0-source-release.zip.asc <
 > maven-project-info-reports-plugin-3.0.0-source-release.zip.sha1 or .sha512 <
Different version than 3.0.0 for maven-project-info-reports-plugin available in http://www.apache.org/dist/maven/plugins
 > maven-project-info-reports-plugin-3.1.0-source-release.zip <
 > maven-project-info-reports-plugin-3.1.0-source-release.zip.asc <
 > maven-project-info-reports-plugin-3.1.0-source-release.zip.sha512 <
Missing file for wagon in http://www.apache.org/dist/maven/wagon
 > wagon-3.4.0-source-release.zip <
 > wagon-3.4.0-source-release.zip.asc <
 > wagon-3.4.0-source-release.zip.sha1 or .sha512 <
Different version than 3.4.0 for wagon available in http://www.apache.org/dist/maven/wagon
 > wagon-3.4.1-source-release.zip <
 > wagon-3.4.1-source-release.zip.asc <
 > wagon-3.4.1-source-release.zip.sha512 <

[ERROR] check-index-page.log error log not empty:
maven-project-info-reports-plugin: found 3.1.0 instead of 3.0.0 in https://maven.apache.org/plugins/

[JENKINS] Archiving site from <https://builds.apache.org/job/dist-tool-plugin/ws/target/site> to /x1/jenkins/jenkins-home/jobs/dist-tool-plugin/site
[INFO] ------------------------------------------------------------------------
[INFO] BUILD FAILURE
[INFO] ------------------------------------------------------------------------
[INFO] Total time:  05:49 min
[INFO] Finished at: 2020-05-29T10:28:33Z
[INFO] ------------------------------------------------------------------------
[WARNING] The requested profile "apache.snapshots" could not be activated because it does not exist.
Waiting for Jenkins to finish collecting data
[ERROR] Failed to execute goal org.apache.maven.plugins:maven-site-plugin:3.7.1:site (default-site) on project dist-tool-plugin: Error generating dist-tool-plugin:1.0-SNAPSHOT:failure-report report: Dist Tool> Checks found inconsistencies in some released artifacts, see https://builds.apache.org/job/dist-tool-plugin/site/dist-tool-check-errors.html for more information -> [Help 1]
org.apache.maven.lifecycle.LifecycleExecutionException: Failed to execute goal org.apache.maven.plugins:maven-site-plugin:3.7.1:site (default-site) on project dist-tool-plugin: Error generating dist-tool-plugin:1.0-SNAPSHOT:failure-report report
    at org.apache.maven.lifecycle.internal.MojoExecutor.execute (MojoExecutor.java:215)
    at org.apache.maven.lifecycle.internal.MojoExecutor.execute (MojoExecutor.java:156)
    at org.apache.maven.lifecycle.internal.MojoExecutor.execute (MojoExecutor.java:148)
    at org.apache.maven.lifecycle.internal.LifecycleModuleBuilder.buildProject (LifecycleModuleBuilder.java:117)
    at org.apache.maven.lifecycle.internal.LifecycleModuleBuilder.buildProject (LifecycleModuleBuilder.java:81)
    at org.apache.maven.lifecycle.internal.builder.singlethreaded.SingleThreadedBuilder.build (SingleThreadedBuilder.java:56)
    at org.apache.maven.lifecycle.internal.LifecycleStarter.execute (LifecycleStarter.java:128)
    at org.apache.maven.DefaultMaven.doExecute (DefaultMaven.java:305)
    at org.apache.maven.DefaultMaven.doExecute (DefaultMaven.java:192)
    at org.apache.maven.DefaultMaven.execute (DefaultMaven.java:105)
    at org.jvnet.hudson.maven3.launcher.Maven35Launcher.main (Maven35Launcher.java:130)
    at sun.reflect.NativeMethodAccessorImpl.invoke0 (Native Method)
    at sun.reflect.NativeMethodAccessorImpl.invoke (NativeMethodAccessorImpl.java:62)
    at sun.reflect.DelegatingMethodAccessorImpl.invoke (DelegatingMethodAccessorImpl.java:43)
    at java.lang.reflect.Method.invoke (Method.java:498)
    at org.codehaus.plexus.classworlds.launcher.Launcher.launchEnhanced (Launcher.java:282)
    at org.codehaus.plexus.classworlds.launcher.Launcher.launch (Launcher.java:225)
    at jenkins.maven3.agent.Maven35Main.launch (Maven35Main.java:178)
    at sun.reflect.NativeMethodAccessorImpl.invoke0 (Native Method)
    at sun.reflect.NativeMethodAccessorImpl.invoke (NativeMethodAccessorImpl.java:62)
    at sun.reflect.DelegatingMethodAccessorImpl.invoke (DelegatingMethodAccessorImpl.java:43)
    at java.lang.reflect.Method.invoke (Method.java:498)
    at hudson.maven.Maven3Builder.call (Maven3Builder.java:139)
    at hudson.maven.Maven3Builder.call (Maven3Builder.java:70)
    at hudson.remoting.UserRequest.perform (UserRequest.java:212)
    at hudson.remoting.UserRequest.perform (UserRequest.java:54)
    at hudson.remoting.Request$2.run (Request.java:369)
    at hudson.remoting.InterceptingExecutorService$1.call (InterceptingExecutorService.java:72)
    at java.util.concurrent.FutureTask.run (FutureTask.java:266)
    at java.util.concurrent.ThreadPoolExecutor.runWorker (ThreadPoolExecutor.java:1149)
    at java.util.concurrent.ThreadPoolExecutor$Worker.run (ThreadPoolExecutor.java:624)
    at java.lang.Thread.run (Thread.java:748)
Caused by: org.apache.maven.plugin.MojoExecutionException: Error generating dist-tool-plugin:1.0-SNAPSHOT:failure-report report
    at org.apache.maven.plugins.site.render.SiteMojo.execute (SiteMojo.java:155)
    at org.apache.maven.plugin.DefaultBuildPluginManager.executeMojo (DefaultBuildPluginManager.java:137)
    at org.apache.maven.lifecycle.internal.MojoExecutor.execute (MojoExecutor.java:210)
    at org.apache.maven.lifecycle.internal.MojoExecutor.execute (MojoExecutor.java:156)
    at org.apache.maven.lifecycle.internal.MojoExecutor.execute (MojoExecutor.java:148)
    at org.apache.maven.lifecycle.internal.LifecycleModuleBuilder.buildProject (LifecycleModuleBuilder.java:117)
    at org.apache.maven.lifecycle.internal.LifecycleModuleBuilder.buildProject (LifecycleModuleBuilder.java:81)
    at org.apache.maven.lifecycle.internal.builder.singlethreaded.SingleThreadedBuilder.build (SingleThreadedBuilder.java:56)
    at org.apache.maven.lifecycle.internal.LifecycleStarter.execute (LifecycleStarter.java:128)
    at org.apache.maven.DefaultMaven.doExecute (DefaultMaven.java:305)
    at org.apache.maven.DefaultMaven.doExecute (DefaultMaven.java:192)
    at org.apache.maven.DefaultMaven.execute (DefaultMaven.java:105)
    at org.jvnet.hudson.maven3.launcher.Maven35Launcher.main (Maven35Launcher.java:130)
    at sun.reflect.NativeMethodAccessorImpl.invoke0 (Native Method)
    at sun.reflect.NativeMethodAccessorImpl.invoke (NativeMethodAccessorImpl.java:62)
    at sun.reflect.DelegatingMethodAccessorImpl.invoke (DelegatingMethodAccessorImpl.java:43)
    at java.lang.reflect.Method.invoke (Method.java:498)
    at org.codehaus.plexus.classworlds.launcher.Launcher.launchEnhanced (Launcher.java:282)
    at org.codehaus.plexus.classworlds.launcher.Launcher.launch (Launcher.java:225)
    at jenkins.maven3.agent.Maven35Main.launch (Maven35Main.java:178)
    at sun.reflect.NativeMethodAccessorImpl.invoke0 (Native Method)
    at sun.reflect.NativeMethodAccessorImpl.invoke (NativeMethodAccessorImpl.java:62)
    at sun.reflect.DelegatingMethodAccessorImpl.invoke (DelegatingMethodAccessorImpl.java:43)
    at java.lang.reflect.Method.invoke (Method.java:498)
    at hudson.maven.Maven3Builder.call (Maven3Builder.java:139)
    at hudson.maven.Maven3Builder.call (Maven3Builder.java:70)
    at hudson.remoting.UserRequest.perform (UserRequest.java:212)
    at hudson.remoting.UserRequest.perform (UserRequest.java:54)
    at hudson.remoting.Request$2.run (Request.java:369)
    at hudson.remoting.InterceptingExecutorService$1.call (InterceptingExecutorService.java:72)
    at java.util.concurrent.FutureTask.run (FutureTask.java:266)
    at java.util.concurrent.ThreadPoolExecutor.runWorker (ThreadPoolExecutor.java:1149)
    at java.util.concurrent.ThreadPoolExecutor$Worker.run (ThreadPoolExecutor.java:624)
    at java.lang.Thread.run (Thread.java:748)
Caused by: org.apache.maven.reporting.MavenReportException: Dist Tool> Checks found inconsistencies in some released artifacts, see https://builds.apache.org/job/dist-tool-plugin/site/dist-tool-check-errors.html for more information
    at org.apache.maven.dist.tools.DistCheckErrorsMojo.executeReport (DistCheckErrorsMojo.java:113)
    at org.apache.maven.reporting.AbstractMavenReport.generate (AbstractMavenReport.java:251)
    at org.apache.maven.plugins.site.render.ReportDocumentRenderer.renderDocument (ReportDocumentRenderer.java:230)
    at org.apache.maven.doxia.siterenderer.DefaultSiteRenderer.render (DefaultSiteRenderer.java:349)
    at org.apache.maven.plugins.site.render.SiteMojo.renderLocale (SiteMojo.java:198)
    at org.apache.maven.plugins.site.render.SiteMojo.execute (SiteMojo.java:147)
    at org.apache.maven.plugin.DefaultBuildPluginManager.executeMojo (DefaultBuildPluginManager.java:137)
    at org.apache.maven.lifecycle.internal.MojoExecutor.execute (MojoExecutor.java:210)
    at org.apache.maven.lifecycle.internal.MojoExecutor.execute (MojoExecutor.java:156)
    at org.apache.maven.lifecycle.internal.MojoExecutor.execute (MojoExecutor.java:148)
    at org.apache.maven.lifecycle.internal.LifecycleModuleBuilder.buildProject (LifecycleModuleBuilder.java:117)
    at org.apache.maven.lifecycle.internal.LifecycleModuleBuilder.buildProject (LifecycleModuleBuilder.java:81)
    at org.apache.maven.lifecycle.internal.builder.singlethreaded.SingleThreadedBuilder.build (SingleThreadedBuilder.java:56)
    at org.apache.maven.lifecycle.internal.LifecycleStarter.execute (LifecycleStarter.java:128)
    at org.apache.maven.DefaultMaven.doExecute (DefaultMaven.java:305)
    at org.apache.maven.DefaultMaven.doExecute (DefaultMaven.java:192)
    at org.apache.maven.DefaultMaven.execute (DefaultMaven.java:105)
    at org.jvnet.hudson.maven3.launcher.Maven35Launcher.main (Maven35Launcher.java:130)
    at sun.reflect.NativeMethodAccessorImpl.invoke0 (Native Method)
    at sun.reflect.NativeMethodAccessorImpl.invoke (NativeMethodAccessorImpl.java:62)
    at sun.reflect.DelegatingMethodAccessorImpl.invoke (DelegatingMethodAccessorImpl.java:43)
    at java.lang.reflect.Method.invoke (Method.java:498)
    at org.codehaus.plexus.classworlds.launcher.Launcher.launchEnhanced (Launcher.java:282)
    at org.codehaus.plexus.classworlds.launcher.Launcher.launch (Launcher.java:225)
    at jenkins.maven3.agent.Maven35Main.launch (Maven35Main.java:178)
    at sun.reflect.NativeMethodAccessorImpl.invoke0 (Native Method)
    at sun.reflect.NativeMethodAccessorImpl.invoke (NativeMethodAccessorImpl.java:62)
    at sun.reflect.DelegatingMethodAccessorImpl.invoke (DelegatingMethodAccessorImpl.java:43)
    at java.lang.reflect.Method.invoke (Method.java:498)
    at hudson.maven.Maven3Builder.call (Maven3Builder.java:139)
    at hudson.maven.Maven3Builder.call (Maven3Builder.java:70)
    at hudson.remoting.UserRequest.perform (UserRequest.java:212)
    at hudson.remoting.UserRequest.perform (UserRequest.java:54)
    at hudson.remoting.Request$2.run (Request.java:369)
    at hudson.remoting.InterceptingExecutorService$1.call (InterceptingExecutorService.java:72)
    at java.util.concurrent.FutureTask.run (FutureTask.java:266)
    at java.util.concurrent.ThreadPoolExecutor.runWorker (ThreadPoolExecutor.java:1149)
    at java.util.concurrent.ThreadPoolExecutor$Worker.run (ThreadPoolExecutor.java:624)
    at java.lang.Thread.run (Thread.java:748)
[ERROR]
[ERROR] Re-run Maven using the -X switch to enable full debug logging.
[ERROR]
[ERROR] For more information about the errors and possible solutions, please read the following articles:
[ERROR] [Help 1] http://cwiki.apache.org/confluence/display/MAVEN/MojoExecutionException
[JENKINS] Archiving <https://builds.apache.org/job/dist-tool-plugin/ws/pom.xml> to org.apache.maven.dist.tools/dist-tool-plugin/1.0-SNAPSHOT/dist-tool-plugin-1.0-SNAPSHOT.pom
[JENKINS] Archiving <https://builds.apache.org/job/dist-tool-plugin/ws/target/dist-tool-plugin-1.0-SNAPSHOT.jar> to org.apache.maven.dist.tools/dist-tool-plugin/1.0-SNAPSHOT/dist-tool-plugin-1.0-SNAPSHOT.jar
[Fast Archiver] Compressed 87.80 KB of artifacts by 72.9% relative to #2969
channel stopped
Reply | Threaded
Open this post in threaded view
|

Build failed in Jenkins: dist-tool-plugin #2973

Apache Jenkins Server-2
See <https://builds.apache.org/job/dist-tool-plugin/2973/display/redirect>

Changes:


------------------------------------------
[...truncated 229.99 KB...]
[INFO]   maven-help-plugin
[INFO]   maven-install-plugin
[INFO]   maven-invoker-plugin
[INFO]   maven-jar-plugin
[INFO]   maven-jarsigner-plugin
[INFO]   maven-javadoc-plugin
[INFO]   maven-jdeps-plugin
[INFO]   maven-jdeprscan-plugin
[INFO]   maven-jlink-plugin
[INFO]   maven-jmod-plugin
[INFO]   * maven-jxr-plugin
[INFO]   maven-linkcheck-plugin
[INFO]   maven-patch-plugin
[INFO]   maven-pdf-plugin
[INFO]   * maven-plugin-plugin
[INFO]   maven-pmd-plugin
[INFO]   maven-project-info-reports-plugin
[INFO]   maven-rar-plugin
[INFO]   * maven-release-plugin  
[INFO]   maven-remote-resources-plugin
[INFO]   maven-resources-plugin
[INFO]   * maven-scm-plugin
[INFO]   maven-scm-publish-plugin
[INFO]   maven-shade-plugin
[INFO]   maven-site-plugin
[INFO]   maven-source-plugin
[INFO]   maven-stage-plugin
[INFO]   * maven-surefire-plugin
[INFO]   * maven-surefire-report-plugin
[INFO]   maven-toolchains-plugin
[INFO]   maven-verifier-plugin
[INFO]   maven-war-plugin
[INFO] /pom: org.apache https://maven.apache.org/pom/
[INFO] > apache index-path = /asf/
[INFO] > apache site = https://maven.apache.org/pom/asf/
[INFO]   apache
[INFO] /pom: org.apache.maven https://maven.apache.org/pom/
[INFO] > maven-parent index-path = /maven/
[INFO] > maven-parent site = https://maven.apache.org/pom/maven/
[INFO]   maven-parent
[INFO] /release: org.apache.maven.release
[INFO]   maven-release (,3)
[INFO] /reporting: org.apache.maven.reporting https://maven.apache.org/shared/
[INFO]   maven-reporting-api
[INFO]   maven-reporting-exec
[INFO]   maven-reporting-impl
[INFO] /resolver: org.apache.maven.resolver
[INFO]   maven-resolver
[INFO] /resources: org.apache.apache.resources
[INFO] > apache-source-release-assembly-descriptor site = http://maven.apache.org/apache-resource-bundles/
[INFO]   apache-source-release-assembly-descriptor
[INFO] /resources: org.apache
[INFO] > apache-incubator-disclaimer-resource-bundle site = http://maven.apache.org/apache-resource-bundles/
[INFO]   apache-incubator-disclaimer-resource-bundle (,1.1]
[INFO] > apache-jar-resource-bundle site = http://maven.apache.org/apache-resource-bundles/
[INFO]   apache-jar-resource-bundle (,1.4]
[INFO] > apache-license-header-resource-bundle site = http://maven.apache.org/apache-resource-bundles/
[INFO]   apache-license-header-resource-bundle (,1.1]
[INFO] /scm: org.apache.maven.scm
[INFO]   maven-scm
[INFO] /shared: org.apache.maven.shared https://maven.apache.org/shared/
[INFO]   file-management
[INFO]   maven-artifact-transfer
[INFO]   maven-common-artifact-filters
[INFO]   maven-dependency-analyzer
[INFO]   maven-dependency-tree
[INFO]   maven-filtering
[INFO]   maven-invoker
[INFO]   maven-jarsigner
[INFO]   maven-mapping
[INFO]   maven-script-interpreter
[INFO]   maven-shared-incremental
[INFO]   maven-shared-jar
[INFO]   maven-shared-resources
[INFO]   maven-shared-utils
[INFO]   maven-shared-io
[INFO]   maven-verifier
[INFO] /shared: org.apache.maven https://maven.apache.org/shared/
[INFO]   maven-archiver
[INFO] > maven-skins index-path = /skins/
[INFO] /skins: org.apache.maven.skins https://maven.apache.org/skins/
[INFO]   maven-default-skin
[INFO]   maven-fluido-skin
[INFO] /surefire: org.apache.maven.surefire
[INFO]   surefire
[INFO] /wagon: org.apache.maven.wagon
[INFO]   wagon
[INFO]
[ERROR] maven-project-info-reports-plugin: found 3.1.0 instead of 3.0.0 in https://maven.apache.org/plugins/
[INFO] Generating "Dist Tool> Check Errors" report --- dist-tool-plugin:1.0-SNAPSHOT:check-errors
[INFO] Generating "Dist Tool> List Plugins Prerequisites" report --- dist-tool-plugin:1.0-SNAPSHOT:list-plugins-prerequisites
[INFO] Generating "Dist Tool> List Master Jobs" report --- dist-tool-plugin:1.0-SNAPSHOT:list-master-jobs
IOException try 1 while reading https://builds.apache.org/job/maven-box/job/maven-metric: class org.jsoup.HttpStatusException HTTP error fetching URL
IOException try 2 while reading https://builds.apache.org/job/maven-box/job/maven-metric: class org.jsoup.HttpStatusException HTTP error fetching URL
IOException try 3 while reading https://builds.apache.org/job/maven-box/job/maven-metric: class org.jsoup.HttpStatusException HTTP error fetching URL
[WARNING] Failed to read status for maven-metric Jenkins job https://builds.apache.org/job/maven-box/job/maven-metric
IOException try 1 while reading https://builds.apache.org/job/maven-box/job/maven-metric-extension: class org.jsoup.HttpStatusException HTTP error fetching URL
IOException try 2 while reading https://builds.apache.org/job/maven-box/job/maven-metric-extension: class org.jsoup.HttpStatusException HTTP error fetching URL
IOException try 3 while reading https://builds.apache.org/job/maven-box/job/maven-metric-extension: class org.jsoup.HttpStatusException HTTP error fetching URL
[WARNING] Failed to read status for maven-metric-extension Jenkins job https://builds.apache.org/job/maven-box/job/maven-metric-extension
[INFO] Generating "Dist Tool> Failure Hack" report --- dist-tool-plugin:1.0-SNAPSHOT:failure-report
[ERROR] check-source-release.log error log not empty:
Missing file for maven-project-info-reports-plugin in http://www.apache.org/dist/maven/plugins
 > maven-project-info-reports-plugin-3.0.0-source-release.zip <
 > maven-project-info-reports-plugin-3.0.0-source-release.zip.asc <
 > maven-project-info-reports-plugin-3.0.0-source-release.zip.sha1 or .sha512 <
Different version than 3.0.0 for maven-project-info-reports-plugin available in http://www.apache.org/dist/maven/plugins
 > maven-project-info-reports-plugin-3.1.0-source-release.zip <
 > maven-project-info-reports-plugin-3.1.0-source-release.zip.asc <
 > maven-project-info-reports-plugin-3.1.0-source-release.zip.sha512 <
Missing file for wagon in http://www.apache.org/dist/maven/wagon
 > wagon-3.4.0-source-release.zip <
 > wagon-3.4.0-source-release.zip.asc <
 > wagon-3.4.0-source-release.zip.sha1 or .sha512 <
Different version than 3.4.0 for wagon available in http://www.apache.org/dist/maven/wagon
 > wagon-3.4.1-source-release.zip <
 > wagon-3.4.1-source-release.zip.asc <
 > wagon-3.4.1-source-release.zip.sha512 <

[ERROR] check-index-page.log error log not empty:
maven-project-info-reports-plugin: found 3.1.0 instead of 3.0.0 in https://maven.apache.org/plugins/

[JENKINS] Archiving site from <https://builds.apache.org/job/dist-tool-plugin/ws/target/site> to /x1/jenkins/jenkins-home/jobs/dist-tool-plugin/site
[INFO] ------------------------------------------------------------------------
[INFO] BUILD FAILURE
[INFO] ------------------------------------------------------------------------
[INFO] Total time:  05:27 min
[INFO] Finished at: 2020-05-30T09:56:50Z
[INFO] ------------------------------------------------------------------------
[WARNING] The requested profile "apache.snapshots" could not be activated because it does not exist.
Waiting for Jenkins to finish collecting data
[ERROR] Failed to execute goal org.apache.maven.plugins:maven-site-plugin:3.7.1:site (default-site) on project dist-tool-plugin: Error generating dist-tool-plugin:1.0-SNAPSHOT:failure-report report: Dist Tool> Checks found inconsistencies in some released artifacts, see https://builds.apache.org/job/dist-tool-plugin/site/dist-tool-check-errors.html for more information -> [Help 1]
org.apache.maven.lifecycle.LifecycleExecutionException: Failed to execute goal org.apache.maven.plugins:maven-site-plugin:3.7.1:site (default-site) on project dist-tool-plugin: Error generating dist-tool-plugin:1.0-SNAPSHOT:failure-report report
    at org.apache.maven.lifecycle.internal.MojoExecutor.execute (MojoExecutor.java:215)
    at org.apache.maven.lifecycle.internal.MojoExecutor.execute (MojoExecutor.java:156)
    at org.apache.maven.lifecycle.internal.MojoExecutor.execute (MojoExecutor.java:148)
    at org.apache.maven.lifecycle.internal.LifecycleModuleBuilder.buildProject (LifecycleModuleBuilder.java:117)
    at org.apache.maven.lifecycle.internal.LifecycleModuleBuilder.buildProject (LifecycleModuleBuilder.java:81)
    at org.apache.maven.lifecycle.internal.builder.singlethreaded.SingleThreadedBuilder.build (SingleThreadedBuilder.java:56)
    at org.apache.maven.lifecycle.internal.LifecycleStarter.execute (LifecycleStarter.java:128)
    at org.apache.maven.DefaultMaven.doExecute (DefaultMaven.java:305)
    at org.apache.maven.DefaultMaven.doExecute (DefaultMaven.java:192)
    at org.apache.maven.DefaultMaven.execute (DefaultMaven.java:105)
    at org.jvnet.hudson.maven3.launcher.Maven35Launcher.main (Maven35Launcher.java:130)
    at sun.reflect.NativeMethodAccessorImpl.invoke0 (Native Method)
    at sun.reflect.NativeMethodAccessorImpl.invoke (NativeMethodAccessorImpl.java:62)
    at sun.reflect.DelegatingMethodAccessorImpl.invoke (DelegatingMethodAccessorImpl.java:43)
    at java.lang.reflect.Method.invoke (Method.java:498)
    at org.codehaus.plexus.classworlds.launcher.Launcher.launchEnhanced (Launcher.java:282)
    at org.codehaus.plexus.classworlds.launcher.Launcher.launch (Launcher.java:225)
    at jenkins.maven3.agent.Maven35Main.launch (Maven35Main.java:178)
    at sun.reflect.NativeMethodAccessorImpl.invoke0 (Native Method)
    at sun.reflect.NativeMethodAccessorImpl.invoke (NativeMethodAccessorImpl.java:62)
    at sun.reflect.DelegatingMethodAccessorImpl.invoke (DelegatingMethodAccessorImpl.java:43)
    at java.lang.reflect.Method.invoke (Method.java:498)
    at hudson.maven.Maven3Builder.call (Maven3Builder.java:139)
    at hudson.maven.Maven3Builder.call (Maven3Builder.java:70)
    at hudson.remoting.UserRequest.perform (UserRequest.java:212)
    at hudson.remoting.UserRequest.perform (UserRequest.java:54)
    at hudson.remoting.Request$2.run (Request.java:369)
    at hudson.remoting.InterceptingExecutorService$1.call (InterceptingExecutorService.java:72)
    at java.util.concurrent.FutureTask.run (FutureTask.java:266)
    at java.util.concurrent.ThreadPoolExecutor.runWorker (ThreadPoolExecutor.java:1149)
    at java.util.concurrent.ThreadPoolExecutor$Worker.run (ThreadPoolExecutor.java:624)
    at java.lang.Thread.run (Thread.java:748)
Caused by: org.apache.maven.plugin.MojoExecutionException: Error generating dist-tool-plugin:1.0-SNAPSHOT:failure-report report
    at org.apache.maven.plugins.site.render.SiteMojo.execute (SiteMojo.java:155)
    at org.apache.maven.plugin.DefaultBuildPluginManager.executeMojo (DefaultBuildPluginManager.java:137)
    at org.apache.maven.lifecycle.internal.MojoExecutor.execute (MojoExecutor.java:210)
    at org.apache.maven.lifecycle.internal.MojoExecutor.execute (MojoExecutor.java:156)
    at org.apache.maven.lifecycle.internal.MojoExecutor.execute (MojoExecutor.java:148)
    at org.apache.maven.lifecycle.internal.LifecycleModuleBuilder.buildProject (LifecycleModuleBuilder.java:117)
    at org.apache.maven.lifecycle.internal.LifecycleModuleBuilder.buildProject (LifecycleModuleBuilder.java:81)
    at org.apache.maven.lifecycle.internal.builder.singlethreaded.SingleThreadedBuilder.build (SingleThreadedBuilder.java:56)
    at org.apache.maven.lifecycle.internal.LifecycleStarter.execute (LifecycleStarter.java:128)
    at org.apache.maven.DefaultMaven.doExecute (DefaultMaven.java:305)
    at org.apache.maven.DefaultMaven.doExecute (DefaultMaven.java:192)
    at org.apache.maven.DefaultMaven.execute (DefaultMaven.java:105)
    at org.jvnet.hudson.maven3.launcher.Maven35Launcher.main (Maven35Launcher.java:130)
    at sun.reflect.NativeMethodAccessorImpl.invoke0 (Native Method)
    at sun.reflect.NativeMethodAccessorImpl.invoke (NativeMethodAccessorImpl.java:62)
    at sun.reflect.DelegatingMethodAccessorImpl.invoke (DelegatingMethodAccessorImpl.java:43)
    at java.lang.reflect.Method.invoke (Method.java:498)
    at org.codehaus.plexus.classworlds.launcher.Launcher.launchEnhanced (Launcher.java:282)
    at org.codehaus.plexus.classworlds.launcher.Launcher.launch (Launcher.java:225)
    at jenkins.maven3.agent.Maven35Main.launch (Maven35Main.java:178)
    at sun.reflect.NativeMethodAccessorImpl.invoke0 (Native Method)
    at sun.reflect.NativeMethodAccessorImpl.invoke (NativeMethodAccessorImpl.java:62)
    at sun.reflect.DelegatingMethodAccessorImpl.invoke (DelegatingMethodAccessorImpl.java:43)
    at java.lang.reflect.Method.invoke (Method.java:498)
    at hudson.maven.Maven3Builder.call (Maven3Builder.java:139)
    at hudson.maven.Maven3Builder.call (Maven3Builder.java:70)
    at hudson.remoting.UserRequest.perform (UserRequest.java:212)
    at hudson.remoting.UserRequest.perform (UserRequest.java:54)
    at hudson.remoting.Request$2.run (Request.java:369)
    at hudson.remoting.InterceptingExecutorService$1.call (InterceptingExecutorService.java:72)
    at java.util.concurrent.FutureTask.run (FutureTask.java:266)
    at java.util.concurrent.ThreadPoolExecutor.runWorker (ThreadPoolExecutor.java:1149)
    at java.util.concurrent.ThreadPoolExecutor$Worker.run (ThreadPoolExecutor.java:624)
    at java.lang.Thread.run (Thread.java:748)
Caused by: org.apache.maven.reporting.MavenReportException: Dist Tool> Checks found inconsistencies in some released artifacts, see https://builds.apache.org/job/dist-tool-plugin/site/dist-tool-check-errors.html for more information
    at org.apache.maven.dist.tools.DistCheckErrorsMojo.executeReport (DistCheckErrorsMojo.java:113)
    at org.apache.maven.reporting.AbstractMavenReport.generate (AbstractMavenReport.java:251)
    at org.apache.maven.plugins.site.render.ReportDocumentRenderer.renderDocument (ReportDocumentRenderer.java:230)
    at org.apache.maven.doxia.siterenderer.DefaultSiteRenderer.render (DefaultSiteRenderer.java:349)
    at org.apache.maven.plugins.site.render.SiteMojo.renderLocale (SiteMojo.java:198)
    at org.apache.maven.plugins.site.render.SiteMojo.execute (SiteMojo.java:147)
    at org.apache.maven.plugin.DefaultBuildPluginManager.executeMojo (DefaultBuildPluginManager.java:137)
    at org.apache.maven.lifecycle.internal.MojoExecutor.execute (MojoExecutor.java:210)
    at org.apache.maven.lifecycle.internal.MojoExecutor.execute (MojoExecutor.java:156)
    at org.apache.maven.lifecycle.internal.MojoExecutor.execute (MojoExecutor.java:148)
    at org.apache.maven.lifecycle.internal.LifecycleModuleBuilder.buildProject (LifecycleModuleBuilder.java:117)
    at org.apache.maven.lifecycle.internal.LifecycleModuleBuilder.buildProject (LifecycleModuleBuilder.java:81)
    at org.apache.maven.lifecycle.internal.builder.singlethreaded.SingleThreadedBuilder.build (SingleThreadedBuilder.java:56)
    at org.apache.maven.lifecycle.internal.LifecycleStarter.execute (LifecycleStarter.java:128)
    at org.apache.maven.DefaultMaven.doExecute (DefaultMaven.java:305)
    at org.apache.maven.DefaultMaven.doExecute (DefaultMaven.java:192)
    at org.apache.maven.DefaultMaven.execute (DefaultMaven.java:105)
    at org.jvnet.hudson.maven3.launcher.Maven35Launcher.main (Maven35Launcher.java:130)
    at sun.reflect.NativeMethodAccessorImpl.invoke0 (Native Method)
    at sun.reflect.NativeMethodAccessorImpl.invoke (NativeMethodAccessorImpl.java:62)
    at sun.reflect.DelegatingMethodAccessorImpl.invoke (DelegatingMethodAccessorImpl.java:43)
    at java.lang.reflect.Method.invoke (Method.java:498)
    at org.codehaus.plexus.classworlds.launcher.Launcher.launchEnhanced (Launcher.java:282)
    at org.codehaus.plexus.classworlds.launcher.Launcher.launch (Launcher.java:225)
    at jenkins.maven3.agent.Maven35Main.launch (Maven35Main.java:178)
    at sun.reflect.NativeMethodAccessorImpl.invoke0 (Native Method)
    at sun.reflect.NativeMethodAccessorImpl.invoke (NativeMethodAccessorImpl.java:62)
    at sun.reflect.DelegatingMethodAccessorImpl.invoke (DelegatingMethodAccessorImpl.java:43)
    at java.lang.reflect.Method.invoke (Method.java:498)
    at hudson.maven.Maven3Builder.call (Maven3Builder.java:139)
    at hudson.maven.Maven3Builder.call (Maven3Builder.java:70)
    at hudson.remoting.UserRequest.perform (UserRequest.java:212)
    at hudson.remoting.UserRequest.perform (UserRequest.java:54)
    at hudson.remoting.Request$2.run (Request.java:369)
    at hudson.remoting.InterceptingExecutorService$1.call (InterceptingExecutorService.java:72)
    at java.util.concurrent.FutureTask.run (FutureTask.java:266)
    at java.util.concurrent.ThreadPoolExecutor.runWorker (ThreadPoolExecutor.java:1149)
    at java.util.concurrent.ThreadPoolExecutor$Worker.run (ThreadPoolExecutor.java:624)
    at java.lang.Thread.run (Thread.java:748)
[ERROR]
[ERROR] Re-run Maven using the -X switch to enable full debug logging.
[ERROR]
[ERROR] For more information about the errors and possible solutions, please read the following articles:
[ERROR] [Help 1] http://cwiki.apache.org/confluence/display/MAVEN/MojoExecutionException
[JENKINS] Archiving <https://builds.apache.org/job/dist-tool-plugin/ws/pom.xml> to org.apache.maven.dist.tools/dist-tool-plugin/1.0-SNAPSHOT/dist-tool-plugin-1.0-SNAPSHOT.pom
[JENKINS] Archiving <https://builds.apache.org/job/dist-tool-plugin/ws/target/dist-tool-plugin-1.0-SNAPSHOT.jar> to org.apache.maven.dist.tools/dist-tool-plugin/1.0-SNAPSHOT/dist-tool-plugin-1.0-SNAPSHOT.jar
[Fast Archiver] Compressed 87.80 KB of artifacts by 72.9% relative to #2969
channel stopped
Reply | Threaded
Open this post in threaded view
|

Build failed in Jenkins: dist-tool-plugin #2974

Apache Jenkins Server-2
See <https://builds.apache.org/job/dist-tool-plugin/2974/display/redirect>

Changes:


------------------------------------------
[...truncated 229.99 KB...]
[INFO]   maven-help-plugin
[INFO]   maven-install-plugin
[INFO]   maven-invoker-plugin
[INFO]   maven-jar-plugin
[INFO]   maven-jarsigner-plugin
[INFO]   maven-javadoc-plugin
[INFO]   maven-jdeps-plugin
[INFO]   maven-jdeprscan-plugin
[INFO]   maven-jlink-plugin
[INFO]   maven-jmod-plugin
[INFO]   * maven-jxr-plugin
[INFO]   maven-linkcheck-plugin
[INFO]   maven-patch-plugin
[INFO]   maven-pdf-plugin
[INFO]   * maven-plugin-plugin
[INFO]   maven-pmd-plugin
[INFO]   maven-project-info-reports-plugin
[INFO]   maven-rar-plugin
[INFO]   * maven-release-plugin  
[INFO]   maven-remote-resources-plugin
[INFO]   maven-resources-plugin
[INFO]   * maven-scm-plugin
[INFO]   maven-scm-publish-plugin
[INFO]   maven-shade-plugin
[INFO]   maven-site-plugin
[INFO]   maven-source-plugin
[INFO]   maven-stage-plugin
[INFO]   * maven-surefire-plugin
[INFO]   * maven-surefire-report-plugin
[INFO]   maven-toolchains-plugin
[INFO]   maven-verifier-plugin
[INFO]   maven-war-plugin
[INFO] /pom: org.apache https://maven.apache.org/pom/
[INFO] > apache index-path = /asf/
[INFO] > apache site = https://maven.apache.org/pom/asf/
[INFO]   apache
[INFO] /pom: org.apache.maven https://maven.apache.org/pom/
[INFO] > maven-parent index-path = /maven/
[INFO] > maven-parent site = https://maven.apache.org/pom/maven/
[INFO]   maven-parent
[INFO] /release: org.apache.maven.release
[INFO]   maven-release (,3)
[INFO] /reporting: org.apache.maven.reporting https://maven.apache.org/shared/
[INFO]   maven-reporting-api
[INFO]   maven-reporting-exec
[INFO]   maven-reporting-impl
[INFO] /resolver: org.apache.maven.resolver
[INFO]   maven-resolver
[INFO] /resources: org.apache.apache.resources
[INFO] > apache-source-release-assembly-descriptor site = http://maven.apache.org/apache-resource-bundles/
[INFO]   apache-source-release-assembly-descriptor
[INFO] /resources: org.apache
[INFO] > apache-incubator-disclaimer-resource-bundle site = http://maven.apache.org/apache-resource-bundles/
[INFO]   apache-incubator-disclaimer-resource-bundle (,1.1]
[INFO] > apache-jar-resource-bundle site = http://maven.apache.org/apache-resource-bundles/
[INFO]   apache-jar-resource-bundle (,1.4]
[INFO] > apache-license-header-resource-bundle site = http://maven.apache.org/apache-resource-bundles/
[INFO]   apache-license-header-resource-bundle (,1.1]
[INFO] /scm: org.apache.maven.scm
[INFO]   maven-scm
[INFO] /shared: org.apache.maven.shared https://maven.apache.org/shared/
[INFO]   file-management
[INFO]   maven-artifact-transfer
[INFO]   maven-common-artifact-filters
[INFO]   maven-dependency-analyzer
[INFO]   maven-dependency-tree
[INFO]   maven-filtering
[INFO]   maven-invoker
[INFO]   maven-jarsigner
[INFO]   maven-mapping
[INFO]   maven-script-interpreter
[INFO]   maven-shared-incremental
[INFO]   maven-shared-jar
[INFO]   maven-shared-resources
[INFO]   maven-shared-utils
[INFO]   maven-shared-io
[INFO]   maven-verifier
[INFO] /shared: org.apache.maven https://maven.apache.org/shared/
[INFO]   maven-archiver
[INFO] > maven-skins index-path = /skins/
[INFO] /skins: org.apache.maven.skins https://maven.apache.org/skins/
[INFO]   maven-default-skin
[INFO]   maven-fluido-skin
[INFO] /surefire: org.apache.maven.surefire
[INFO]   surefire
[INFO] /wagon: org.apache.maven.wagon
[INFO]   wagon
[INFO]
[ERROR] maven-project-info-reports-plugin: found 3.1.0 instead of 3.0.0 in https://maven.apache.org/plugins/
[INFO] Generating "Dist Tool> Check Errors" report --- dist-tool-plugin:1.0-SNAPSHOT:check-errors
[INFO] Generating "Dist Tool> List Plugins Prerequisites" report --- dist-tool-plugin:1.0-SNAPSHOT:list-plugins-prerequisites
[INFO] Generating "Dist Tool> List Master Jobs" report --- dist-tool-plugin:1.0-SNAPSHOT:list-master-jobs
IOException try 1 while reading https://builds.apache.org/job/maven-box/job/maven-metric: class org.jsoup.HttpStatusException HTTP error fetching URL
IOException try 2 while reading https://builds.apache.org/job/maven-box/job/maven-metric: class org.jsoup.HttpStatusException HTTP error fetching URL
IOException try 3 while reading https://builds.apache.org/job/maven-box/job/maven-metric: class org.jsoup.HttpStatusException HTTP error fetching URL
[WARNING] Failed to read status for maven-metric Jenkins job https://builds.apache.org/job/maven-box/job/maven-metric
IOException try 1 while reading https://builds.apache.org/job/maven-box/job/maven-metric-extension: class org.jsoup.HttpStatusException HTTP error fetching URL
IOException try 2 while reading https://builds.apache.org/job/maven-box/job/maven-metric-extension: class org.jsoup.HttpStatusException HTTP error fetching URL
IOException try 3 while reading https://builds.apache.org/job/maven-box/job/maven-metric-extension: class org.jsoup.HttpStatusException HTTP error fetching URL
[WARNING] Failed to read status for maven-metric-extension Jenkins job https://builds.apache.org/job/maven-box/job/maven-metric-extension
[INFO] Generating "Dist Tool> Failure Hack" report --- dist-tool-plugin:1.0-SNAPSHOT:failure-report
[ERROR] check-source-release.log error log not empty:
Missing file for maven-project-info-reports-plugin in http://www.apache.org/dist/maven/plugins
 > maven-project-info-reports-plugin-3.0.0-source-release.zip <
 > maven-project-info-reports-plugin-3.0.0-source-release.zip.asc <
 > maven-project-info-reports-plugin-3.0.0-source-release.zip.sha1 or .sha512 <
Different version than 3.0.0 for maven-project-info-reports-plugin available in http://www.apache.org/dist/maven/plugins
 > maven-project-info-reports-plugin-3.1.0-source-release.zip <
 > maven-project-info-reports-plugin-3.1.0-source-release.zip.asc <
 > maven-project-info-reports-plugin-3.1.0-source-release.zip.sha512 <
Missing file for wagon in http://www.apache.org/dist/maven/wagon
 > wagon-3.4.0-source-release.zip <
 > wagon-3.4.0-source-release.zip.asc <
 > wagon-3.4.0-source-release.zip.sha1 or .sha512 <
Different version than 3.4.0 for wagon available in http://www.apache.org/dist/maven/wagon
 > wagon-3.4.1-source-release.zip <
 > wagon-3.4.1-source-release.zip.asc <
 > wagon-3.4.1-source-release.zip.sha512 <

[ERROR] check-index-page.log error log not empty:
maven-project-info-reports-plugin: found 3.1.0 instead of 3.0.0 in https://maven.apache.org/plugins/

[JENKINS] Archiving site from <https://builds.apache.org/job/dist-tool-plugin/ws/target/site> to /x1/jenkins/jenkins-home/jobs/dist-tool-plugin/site
[INFO] ------------------------------------------------------------------------
[INFO] BUILD FAILURE
[INFO] ------------------------------------------------------------------------
[INFO] Total time:  06:14 min
[INFO] Finished at: 2020-05-31T09:57:39Z
[INFO] ------------------------------------------------------------------------
[WARNING] The requested profile "apache.snapshots" could not be activated because it does not exist.
Waiting for Jenkins to finish collecting data
[ERROR] Failed to execute goal org.apache.maven.plugins:maven-site-plugin:3.7.1:site (default-site) on project dist-tool-plugin: Error generating dist-tool-plugin:1.0-SNAPSHOT:failure-report report: Dist Tool> Checks found inconsistencies in some released artifacts, see https://builds.apache.org/job/dist-tool-plugin/site/dist-tool-check-errors.html for more information -> [Help 1]
org.apache.maven.lifecycle.LifecycleExecutionException: Failed to execute goal org.apache.maven.plugins:maven-site-plugin:3.7.1:site (default-site) on project dist-tool-plugin: Error generating dist-tool-plugin:1.0-SNAPSHOT:failure-report report
    at org.apache.maven.lifecycle.internal.MojoExecutor.execute (MojoExecutor.java:215)
    at org.apache.maven.lifecycle.internal.MojoExecutor.execute (MojoExecutor.java:156)
    at org.apache.maven.lifecycle.internal.MojoExecutor.execute (MojoExecutor.java:148)
    at org.apache.maven.lifecycle.internal.LifecycleModuleBuilder.buildProject (LifecycleModuleBuilder.java:117)
    at org.apache.maven.lifecycle.internal.LifecycleModuleBuilder.buildProject (LifecycleModuleBuilder.java:81)
    at org.apache.maven.lifecycle.internal.builder.singlethreaded.SingleThreadedBuilder.build (SingleThreadedBuilder.java:56)
    at org.apache.maven.lifecycle.internal.LifecycleStarter.execute (LifecycleStarter.java:128)
    at org.apache.maven.DefaultMaven.doExecute (DefaultMaven.java:305)
    at org.apache.maven.DefaultMaven.doExecute (DefaultMaven.java:192)
    at org.apache.maven.DefaultMaven.execute (DefaultMaven.java:105)
    at org.jvnet.hudson.maven3.launcher.Maven35Launcher.main (Maven35Launcher.java:130)
    at sun.reflect.NativeMethodAccessorImpl.invoke0 (Native Method)
    at sun.reflect.NativeMethodAccessorImpl.invoke (NativeMethodAccessorImpl.java:62)
    at sun.reflect.DelegatingMethodAccessorImpl.invoke (DelegatingMethodAccessorImpl.java:43)
    at java.lang.reflect.Method.invoke (Method.java:498)
    at org.codehaus.plexus.classworlds.launcher.Launcher.launchEnhanced (Launcher.java:282)
    at org.codehaus.plexus.classworlds.launcher.Launcher.launch (Launcher.java:225)
    at jenkins.maven3.agent.Maven35Main.launch (Maven35Main.java:178)
    at sun.reflect.NativeMethodAccessorImpl.invoke0 (Native Method)
    at sun.reflect.NativeMethodAccessorImpl.invoke (NativeMethodAccessorImpl.java:62)
    at sun.reflect.DelegatingMethodAccessorImpl.invoke (DelegatingMethodAccessorImpl.java:43)
    at java.lang.reflect.Method.invoke (Method.java:498)
    at hudson.maven.Maven3Builder.call (Maven3Builder.java:139)
    at hudson.maven.Maven3Builder.call (Maven3Builder.java:70)
    at hudson.remoting.UserRequest.perform (UserRequest.java:212)
    at hudson.remoting.UserRequest.perform (UserRequest.java:54)
    at hudson.remoting.Request$2.run (Request.java:369)
    at hudson.remoting.InterceptingExecutorService$1.call (InterceptingExecutorService.java:72)
    at java.util.concurrent.FutureTask.run (FutureTask.java:266)
    at java.util.concurrent.ThreadPoolExecutor.runWorker (ThreadPoolExecutor.java:1149)
    at java.util.concurrent.ThreadPoolExecutor$Worker.run (ThreadPoolExecutor.java:624)
    at java.lang.Thread.run (Thread.java:748)
Caused by: org.apache.maven.plugin.MojoExecutionException: Error generating dist-tool-plugin:1.0-SNAPSHOT:failure-report report
    at org.apache.maven.plugins.site.render.SiteMojo.execute (SiteMojo.java:155)
    at org.apache.maven.plugin.DefaultBuildPluginManager.executeMojo (DefaultBuildPluginManager.java:137)
    at org.apache.maven.lifecycle.internal.MojoExecutor.execute (MojoExecutor.java:210)
    at org.apache.maven.lifecycle.internal.MojoExecutor.execute (MojoExecutor.java:156)
    at org.apache.maven.lifecycle.internal.MojoExecutor.execute (MojoExecutor.java:148)
    at org.apache.maven.lifecycle.internal.LifecycleModuleBuilder.buildProject (LifecycleModuleBuilder.java:117)
    at org.apache.maven.lifecycle.internal.LifecycleModuleBuilder.buildProject (LifecycleModuleBuilder.java:81)
    at org.apache.maven.lifecycle.internal.builder.singlethreaded.SingleThreadedBuilder.build (SingleThreadedBuilder.java:56)
    at org.apache.maven.lifecycle.internal.LifecycleStarter.execute (LifecycleStarter.java:128)
    at org.apache.maven.DefaultMaven.doExecute (DefaultMaven.java:305)
    at org.apache.maven.DefaultMaven.doExecute (DefaultMaven.java:192)
    at org.apache.maven.DefaultMaven.execute (DefaultMaven.java:105)
    at org.jvnet.hudson.maven3.launcher.Maven35Launcher.main (Maven35Launcher.java:130)
    at sun.reflect.NativeMethodAccessorImpl.invoke0 (Native Method)
    at sun.reflect.NativeMethodAccessorImpl.invoke (NativeMethodAccessorImpl.java:62)
    at sun.reflect.DelegatingMethodAccessorImpl.invoke (DelegatingMethodAccessorImpl.java:43)
    at java.lang.reflect.Method.invoke (Method.java:498)
    at org.codehaus.plexus.classworlds.launcher.Launcher.launchEnhanced (Launcher.java:282)
    at org.codehaus.plexus.classworlds.launcher.Launcher.launch (Launcher.java:225)
    at jenkins.maven3.agent.Maven35Main.launch (Maven35Main.java:178)
    at sun.reflect.NativeMethodAccessorImpl.invoke0 (Native Method)
    at sun.reflect.NativeMethodAccessorImpl.invoke (NativeMethodAccessorImpl.java:62)
    at sun.reflect.DelegatingMethodAccessorImpl.invoke (DelegatingMethodAccessorImpl.java:43)
    at java.lang.reflect.Method.invoke (Method.java:498)
    at hudson.maven.Maven3Builder.call (Maven3Builder.java:139)
    at hudson.maven.Maven3Builder.call (Maven3Builder.java:70)
    at hudson.remoting.UserRequest.perform (UserRequest.java:212)
    at hudson.remoting.UserRequest.perform (UserRequest.java:54)
    at hudson.remoting.Request$2.run (Request.java:369)
    at hudson.remoting.InterceptingExecutorService$1.call (InterceptingExecutorService.java:72)
    at java.util.concurrent.FutureTask.run (FutureTask.java:266)
    at java.util.concurrent.ThreadPoolExecutor.runWorker (ThreadPoolExecutor.java:1149)
    at java.util.concurrent.ThreadPoolExecutor$Worker.run (ThreadPoolExecutor.java:624)
    at java.lang.Thread.run (Thread.java:748)
Caused by: org.apache.maven.reporting.MavenReportException: Dist Tool> Checks found inconsistencies in some released artifacts, see https://builds.apache.org/job/dist-tool-plugin/site/dist-tool-check-errors.html for more information
    at org.apache.maven.dist.tools.DistCheckErrorsMojo.executeReport (DistCheckErrorsMojo.java:113)
    at org.apache.maven.reporting.AbstractMavenReport.generate (AbstractMavenReport.java:251)
    at org.apache.maven.plugins.site.render.ReportDocumentRenderer.renderDocument (ReportDocumentRenderer.java:230)
    at org.apache.maven.doxia.siterenderer.DefaultSiteRenderer.render (DefaultSiteRenderer.java:349)
    at org.apache.maven.plugins.site.render.SiteMojo.renderLocale (SiteMojo.java:198)
    at org.apache.maven.plugins.site.render.SiteMojo.execute (SiteMojo.java:147)
    at org.apache.maven.plugin.DefaultBuildPluginManager.executeMojo (DefaultBuildPluginManager.java:137)
    at org.apache.maven.lifecycle.internal.MojoExecutor.execute (MojoExecutor.java:210)
    at org.apache.maven.lifecycle.internal.MojoExecutor.execute (MojoExecutor.java:156)
    at org.apache.maven.lifecycle.internal.MojoExecutor.execute (MojoExecutor.java:148)
    at org.apache.maven.lifecycle.internal.LifecycleModuleBuilder.buildProject (LifecycleModuleBuilder.java:117)
    at org.apache.maven.lifecycle.internal.LifecycleModuleBuilder.buildProject (LifecycleModuleBuilder.java:81)
    at org.apache.maven.lifecycle.internal.builder.singlethreaded.SingleThreadedBuilder.build (SingleThreadedBuilder.java:56)
    at org.apache.maven.lifecycle.internal.LifecycleStarter.execute (LifecycleStarter.java:128)
    at org.apache.maven.DefaultMaven.doExecute (DefaultMaven.java:305)
    at org.apache.maven.DefaultMaven.doExecute (DefaultMaven.java:192)
    at org.apache.maven.DefaultMaven.execute (DefaultMaven.java:105)
    at org.jvnet.hudson.maven3.launcher.Maven35Launcher.main (Maven35Launcher.java:130)
    at sun.reflect.NativeMethodAccessorImpl.invoke0 (Native Method)
    at sun.reflect.NativeMethodAccessorImpl.invoke (NativeMethodAccessorImpl.java:62)
    at sun.reflect.DelegatingMethodAccessorImpl.invoke (DelegatingMethodAccessorImpl.java:43)
    at java.lang.reflect.Method.invoke (Method.java:498)
    at org.codehaus.plexus.classworlds.launcher.Launcher.launchEnhanced (Launcher.java:282)
    at org.codehaus.plexus.classworlds.launcher.Launcher.launch (Launcher.java:225)
    at jenkins.maven3.agent.Maven35Main.launch (Maven35Main.java:178)
    at sun.reflect.NativeMethodAccessorImpl.invoke0 (Native Method)
    at sun.reflect.NativeMethodAccessorImpl.invoke (NativeMethodAccessorImpl.java:62)
    at sun.reflect.DelegatingMethodAccessorImpl.invoke (DelegatingMethodAccessorImpl.java:43)
    at java.lang.reflect.Method.invoke (Method.java:498)
    at hudson.maven.Maven3Builder.call (Maven3Builder.java:139)
    at hudson.maven.Maven3Builder.call (Maven3Builder.java:70)
    at hudson.remoting.UserRequest.perform (UserRequest.java:212)
    at hudson.remoting.UserRequest.perform (UserRequest.java:54)
    at hudson.remoting.Request$2.run (Request.java:369)
    at hudson.remoting.InterceptingExecutorService$1.call (InterceptingExecutorService.java:72)
    at java.util.concurrent.FutureTask.run (FutureTask.java:266)
    at java.util.concurrent.ThreadPoolExecutor.runWorker (ThreadPoolExecutor.java:1149)
    at java.util.concurrent.ThreadPoolExecutor$Worker.run (ThreadPoolExecutor.java:624)
    at java.lang.Thread.run (Thread.java:748)
[ERROR]
[ERROR] Re-run Maven using the -X switch to enable full debug logging.
[ERROR]
[ERROR] For more information about the errors and possible solutions, please read the following articles:
[ERROR] [Help 1] http://cwiki.apache.org/confluence/display/MAVEN/MojoExecutionException
[JENKINS] Archiving <https://builds.apache.org/job/dist-tool-plugin/ws/pom.xml> to org.apache.maven.dist.tools/dist-tool-plugin/1.0-SNAPSHOT/dist-tool-plugin-1.0-SNAPSHOT.pom
[JENKINS] Archiving <https://builds.apache.org/job/dist-tool-plugin/ws/target/dist-tool-plugin-1.0-SNAPSHOT.jar> to org.apache.maven.dist.tools/dist-tool-plugin/1.0-SNAPSHOT/dist-tool-plugin-1.0-SNAPSHOT.jar
[Fast Archiver] Compressed 87.80 KB of artifacts by 72.9% relative to #2969
channel stopped
Reply | Threaded
Open this post in threaded view
|

Build failed in Jenkins: dist-tool-plugin #2975

Apache Jenkins Server-2
See <https://builds.apache.org/job/dist-tool-plugin/2975/display/redirect>

Changes:


------------------------------------------
[...truncated 263.21 KB...]
[INFO]   * maven-jxr-plugin
[INFO]   maven-linkcheck-plugin
[INFO]   maven-patch-plugin
[INFO]   maven-pdf-plugin
[INFO]   * maven-plugin-plugin
[INFO]   maven-pmd-plugin
[INFO]   maven-project-info-reports-plugin
[INFO]   maven-rar-plugin
[INFO]   * maven-release-plugin  
[INFO]   maven-remote-resources-plugin
[INFO]   maven-resources-plugin
[INFO]   * maven-scm-plugin
[INFO]   maven-scm-publish-plugin
[INFO]   maven-shade-plugin
[INFO]   maven-site-plugin
[INFO]   maven-source-plugin
[INFO]   maven-stage-plugin
[INFO]   * maven-surefire-plugin
[INFO]   * maven-surefire-report-plugin
[INFO]   maven-toolchains-plugin
[INFO]   maven-verifier-plugin
[INFO]   maven-war-plugin
[INFO] /pom: org.apache https://maven.apache.org/pom/
[INFO] > apache index-path = /asf/
[INFO] > apache site = https://maven.apache.org/pom/asf/
[INFO]   apache
[INFO] /pom: org.apache.maven https://maven.apache.org/pom/
[INFO] > maven-parent index-path = /maven/
[INFO] > maven-parent site = https://maven.apache.org/pom/maven/
[INFO]   maven-parent
[INFO] /release: org.apache.maven.release
[INFO]   maven-release (,3)
[INFO] /reporting: org.apache.maven.reporting https://maven.apache.org/shared/
[INFO]   maven-reporting-api
[INFO]   maven-reporting-exec
[INFO]   maven-reporting-impl
[INFO] /resolver: org.apache.maven.resolver
[INFO]   maven-resolver
[INFO] /resources: org.apache.apache.resources
[INFO] > apache-source-release-assembly-descriptor site = http://maven.apache.org/apache-resource-bundles/
[INFO]   apache-source-release-assembly-descriptor
[INFO] /resources: org.apache
[INFO] > apache-incubator-disclaimer-resource-bundle site = http://maven.apache.org/apache-resource-bundles/
[INFO]   apache-incubator-disclaimer-resource-bundle (,1.1]
[INFO] > apache-jar-resource-bundle site = http://maven.apache.org/apache-resource-bundles/
[INFO]   apache-jar-resource-bundle (,1.4]
[INFO] > apache-license-header-resource-bundle site = http://maven.apache.org/apache-resource-bundles/
[INFO]   apache-license-header-resource-bundle (,1.1]
[INFO] /scm: org.apache.maven.scm
[INFO]   maven-scm
[INFO] /shared: org.apache.maven.shared https://maven.apache.org/shared/
[INFO]   file-management
[INFO]   maven-artifact-transfer
[INFO]   maven-common-artifact-filters
[INFO]   maven-dependency-analyzer
[INFO]   maven-dependency-tree
[INFO]   maven-filtering
[INFO]   maven-invoker
[INFO]   maven-jarsigner
[INFO]   maven-mapping
[INFO]   maven-script-interpreter
[INFO]   maven-shared-incremental
[INFO]   maven-shared-jar
[INFO]   maven-shared-resources
[INFO]   maven-shared-utils
[INFO]   maven-shared-io
[INFO]   maven-verifier
[INFO] /shared: org.apache.maven https://maven.apache.org/shared/
[INFO]   maven-archiver
[INFO] > maven-skins index-path = /skins/
[INFO] /skins: org.apache.maven.skins https://maven.apache.org/skins/
[INFO]   maven-default-skin
[INFO]   maven-fluido-skin
[INFO] /surefire: org.apache.maven.surefire
[INFO]   surefire
[INFO] /wagon: org.apache.maven.wagon
[INFO]   wagon
[INFO]
[ERROR] maven-project-info-reports-plugin: found 3.1.0 instead of 3.0.0 in https://maven.apache.org/plugins/
[ERROR] maven-shade-plugin: found 3.2.4 instead of 3.2.3 in https://maven.apache.org/plugins/
[INFO] Generating "Dist Tool> Check Errors" report --- dist-tool-plugin:1.0-SNAPSHOT:check-errors
[INFO] Generating "Dist Tool> List Plugins Prerequisites" report --- dist-tool-plugin:1.0-SNAPSHOT:list-plugins-prerequisites
[INFO] Generating "Dist Tool> List Master Jobs" report --- dist-tool-plugin:1.0-SNAPSHOT:list-master-jobs
IOException try 1 while reading https://builds.apache.org/job/maven-box/job/maven-metric: class org.jsoup.HttpStatusException HTTP error fetching URL
IOException try 2 while reading https://builds.apache.org/job/maven-box/job/maven-metric: class org.jsoup.HttpStatusException HTTP error fetching URL
IOException try 3 while reading https://builds.apache.org/job/maven-box/job/maven-metric: class org.jsoup.HttpStatusException HTTP error fetching URL
[WARNING] Failed to read status for maven-metric Jenkins job https://builds.apache.org/job/maven-box/job/maven-metric
IOException try 1 while reading https://builds.apache.org/job/maven-box/job/maven-metric-extension: class org.jsoup.HttpStatusException HTTP error fetching URL
IOException try 2 while reading https://builds.apache.org/job/maven-box/job/maven-metric-extension: class org.jsoup.HttpStatusException HTTP error fetching URL
IOException try 3 while reading https://builds.apache.org/job/maven-box/job/maven-metric-extension: class org.jsoup.HttpStatusException HTTP error fetching URL
[WARNING] Failed to read status for maven-metric-extension Jenkins job https://builds.apache.org/job/maven-box/job/maven-metric-extension
[INFO] Generating "Dist Tool> Failure Hack" report --- dist-tool-plugin:1.0-SNAPSHOT:failure-report
[ERROR] check-source-release.log error log not empty:
Missing file for maven-project-info-reports-plugin in http://www.apache.org/dist/maven/plugins
 > maven-project-info-reports-plugin-3.0.0-source-release.zip <
 > maven-project-info-reports-plugin-3.0.0-source-release.zip.asc <
 > maven-project-info-reports-plugin-3.0.0-source-release.zip.sha1 or .sha512 <
Different version than 3.0.0 for maven-project-info-reports-plugin available in http://www.apache.org/dist/maven/plugins
 > maven-project-info-reports-plugin-3.1.0-source-release.zip <
 > maven-project-info-reports-plugin-3.1.0-source-release.zip.asc <
 > maven-project-info-reports-plugin-3.1.0-source-release.zip.sha512 <
Missing file for maven-shade-plugin in http://www.apache.org/dist/maven/plugins
 > maven-shade-plugin-3.2.3-source-release.zip <
 > maven-shade-plugin-3.2.3-source-release.zip.asc <
 > maven-shade-plugin-3.2.3-source-release.zip.sha1 or .sha512 <
Different version than 3.2.3 for maven-shade-plugin available in http://www.apache.org/dist/maven/plugins
 > maven-shade-plugin-3.2.4-source-release.zip <
 > maven-shade-plugin-3.2.4-source-release.zip.asc <
 > maven-shade-plugin-3.2.4-source-release.zip.sha512 <
Missing file for wagon in http://www.apache.org/dist/maven/wagon
 > wagon-3.4.0-source-release.zip <
 > wagon-3.4.0-source-release.zip.asc <
 > wagon-3.4.0-source-release.zip.sha1 or .sha512 <
Different version than 3.4.0 for wagon available in http://www.apache.org/dist/maven/wagon
 > wagon-3.4.1-source-release.zip <
 > wagon-3.4.1-source-release.zip.asc <
 > wagon-3.4.1-source-release.zip.sha512 <

[ERROR] check-index-page.log error log not empty:
maven-project-info-reports-plugin: found 3.1.0 instead of 3.0.0 in https://maven.apache.org/plugins/
maven-shade-plugin: found 3.2.4 instead of 3.2.3 in https://maven.apache.org/plugins/

[JENKINS] Archiving site from <https://builds.apache.org/job/dist-tool-plugin/ws/target/site> to /x1/jenkins/jenkins-home/jobs/dist-tool-plugin/site
[INFO] ------------------------------------------------------------------------
[INFO] BUILD FAILURE
[INFO] ------------------------------------------------------------------------
[INFO] Total time:  06:19 min
[INFO] Finished at: 2020-06-01T09:57:42Z
[INFO] ------------------------------------------------------------------------
[WARNING] The requested profile "apache.snapshots" could not be activated because it does not exist.
Waiting for Jenkins to finish collecting data
[ERROR] Failed to execute goal org.apache.maven.plugins:maven-site-plugin:3.7.1:site (default-site) on project dist-tool-plugin: Error generating dist-tool-plugin:1.0-SNAPSHOT:failure-report report: Dist Tool> Checks found inconsistencies in some released artifacts, see https://builds.apache.org/job/dist-tool-plugin/site/dist-tool-check-errors.html for more information -> [Help 1]
org.apache.maven.lifecycle.LifecycleExecutionException: Failed to execute goal org.apache.maven.plugins:maven-site-plugin:3.7.1:site (default-site) on project dist-tool-plugin: Error generating dist-tool-plugin:1.0-SNAPSHOT:failure-report report
    at org.apache.maven.lifecycle.internal.MojoExecutor.execute (MojoExecutor.java:215)
    at org.apache.maven.lifecycle.internal.MojoExecutor.execute (MojoExecutor.java:156)
    at org.apache.maven.lifecycle.internal.MojoExecutor.execute (MojoExecutor.java:148)
    at org.apache.maven.lifecycle.internal.LifecycleModuleBuilder.buildProject (LifecycleModuleBuilder.java:117)
    at org.apache.maven.lifecycle.internal.LifecycleModuleBuilder.buildProject (LifecycleModuleBuilder.java:81)
    at org.apache.maven.lifecycle.internal.builder.singlethreaded.SingleThreadedBuilder.build (SingleThreadedBuilder.java:56)
    at org.apache.maven.lifecycle.internal.LifecycleStarter.execute (LifecycleStarter.java:128)
    at org.apache.maven.DefaultMaven.doExecute (DefaultMaven.java:305)
    at org.apache.maven.DefaultMaven.doExecute (DefaultMaven.java:192)
    at org.apache.maven.DefaultMaven.execute (DefaultMaven.java:105)
    at org.jvnet.hudson.maven3.launcher.Maven35Launcher.main (Maven35Launcher.java:130)
    at sun.reflect.NativeMethodAccessorImpl.invoke0 (Native Method)
    at sun.reflect.NativeMethodAccessorImpl.invoke (NativeMethodAccessorImpl.java:62)
    at sun.reflect.DelegatingMethodAccessorImpl.invoke (DelegatingMethodAccessorImpl.java:43)
    at java.lang.reflect.Method.invoke (Method.java:498)
    at org.codehaus.plexus.classworlds.launcher.Launcher.launchEnhanced (Launcher.java:282)
    at org.codehaus.plexus.classworlds.launcher.Launcher.launch (Launcher.java:225)
    at jenkins.maven3.agent.Maven35Main.launch (Maven35Main.java:178)
    at sun.reflect.NativeMethodAccessorImpl.invoke0 (Native Method)
    at sun.reflect.NativeMethodAccessorImpl.invoke (NativeMethodAccessorImpl.java:62)
    at sun.reflect.DelegatingMethodAccessorImpl.invoke (DelegatingMethodAccessorImpl.java:43)
    at java.lang.reflect.Method.invoke (Method.java:498)
    at hudson.maven.Maven3Builder.call (Maven3Builder.java:139)
    at hudson.maven.Maven3Builder.call (Maven3Builder.java:70)
    at hudson.remoting.UserRequest.perform (UserRequest.java:212)
    at hudson.remoting.UserRequest.perform (UserRequest.java:54)
    at hudson.remoting.Request$2.run (Request.java:369)
    at hudson.remoting.InterceptingExecutorService$1.call (InterceptingExecutorService.java:72)
    at java.util.concurrent.FutureTask.run (FutureTask.java:266)
    at java.util.concurrent.ThreadPoolExecutor.runWorker (ThreadPoolExecutor.java:1149)
    at java.util.concurrent.ThreadPoolExecutor$Worker.run (ThreadPoolExecutor.java:624)
    at java.lang.Thread.run (Thread.java:748)
Caused by: org.apache.maven.plugin.MojoExecutionException: Error generating dist-tool-plugin:1.0-SNAPSHOT:failure-report report
    at org.apache.maven.plugins.site.render.SiteMojo.execute (SiteMojo.java:155)
    at org.apache.maven.plugin.DefaultBuildPluginManager.executeMojo (DefaultBuildPluginManager.java:137)
    at org.apache.maven.lifecycle.internal.MojoExecutor.execute (MojoExecutor.java:210)
    at org.apache.maven.lifecycle.internal.MojoExecutor.execute (MojoExecutor.java:156)
    at org.apache.maven.lifecycle.internal.MojoExecutor.execute (MojoExecutor.java:148)
    at org.apache.maven.lifecycle.internal.LifecycleModuleBuilder.buildProject (LifecycleModuleBuilder.java:117)
    at org.apache.maven.lifecycle.internal.LifecycleModuleBuilder.buildProject (LifecycleModuleBuilder.java:81)
    at org.apache.maven.lifecycle.internal.builder.singlethreaded.SingleThreadedBuilder.build (SingleThreadedBuilder.java:56)
    at org.apache.maven.lifecycle.internal.LifecycleStarter.execute (LifecycleStarter.java:128)
    at org.apache.maven.DefaultMaven.doExecute (DefaultMaven.java:305)
    at org.apache.maven.DefaultMaven.doExecute (DefaultMaven.java:192)
    at org.apache.maven.DefaultMaven.execute (DefaultMaven.java:105)
    at org.jvnet.hudson.maven3.launcher.Maven35Launcher.main (Maven35Launcher.java:130)
    at sun.reflect.NativeMethodAccessorImpl.invoke0 (Native Method)
    at sun.reflect.NativeMethodAccessorImpl.invoke (NativeMethodAccessorImpl.java:62)
    at sun.reflect.DelegatingMethodAccessorImpl.invoke (DelegatingMethodAccessorImpl.java:43)
    at java.lang.reflect.Method.invoke (Method.java:498)
    at org.codehaus.plexus.classworlds.launcher.Launcher.launchEnhanced (Launcher.java:282)
    at org.codehaus.plexus.classworlds.launcher.Launcher.launch (Launcher.java:225)
    at jenkins.maven3.agent.Maven35Main.launch (Maven35Main.java:178)
    at sun.reflect.NativeMethodAccessorImpl.invoke0 (Native Method)
    at sun.reflect.NativeMethodAccessorImpl.invoke (NativeMethodAccessorImpl.java:62)
    at sun.reflect.DelegatingMethodAccessorImpl.invoke (DelegatingMethodAccessorImpl.java:43)
    at java.lang.reflect.Method.invoke (Method.java:498)
    at hudson.maven.Maven3Builder.call (Maven3Builder.java:139)
    at hudson.maven.Maven3Builder.call (Maven3Builder.java:70)
    at hudson.remoting.UserRequest.perform (UserRequest.java:212)
    at hudson.remoting.UserRequest.perform (UserRequest.java:54)
    at hudson.remoting.Request$2.run (Request.java:369)
    at hudson.remoting.InterceptingExecutorService$1.call (InterceptingExecutorService.java:72)
    at java.util.concurrent.FutureTask.run (FutureTask.java:266)
    at java.util.concurrent.ThreadPoolExecutor.runWorker (ThreadPoolExecutor.java:1149)
    at java.util.concurrent.ThreadPoolExecutor$Worker.run (ThreadPoolExecutor.java:624)
    at java.lang.Thread.run (Thread.java:748)
Caused by: org.apache.maven.reporting.MavenReportException: Dist Tool> Checks found inconsistencies in some released artifacts, see https://builds.apache.org/job/dist-tool-plugin/site/dist-tool-check-errors.html for more information
    at org.apache.maven.dist.tools.DistCheckErrorsMojo.executeReport (DistCheckErrorsMojo.java:113)
    at org.apache.maven.reporting.AbstractMavenReport.generate (AbstractMavenReport.java:251)
    at org.apache.maven.plugins.site.render.ReportDocumentRenderer.renderDocument (ReportDocumentRenderer.java:230)
    at org.apache.maven.doxia.siterenderer.DefaultSiteRenderer.render (DefaultSiteRenderer.java:349)
    at org.apache.maven.plugins.site.render.SiteMojo.renderLocale (SiteMojo.java:198)
    at org.apache.maven.plugins.site.render.SiteMojo.execute (SiteMojo.java:147)
    at org.apache.maven.plugin.DefaultBuildPluginManager.executeMojo (DefaultBuildPluginManager.java:137)
    at org.apache.maven.lifecycle.internal.MojoExecutor.execute (MojoExecutor.java:210)
    at org.apache.maven.lifecycle.internal.MojoExecutor.execute (MojoExecutor.java:156)
    at org.apache.maven.lifecycle.internal.MojoExecutor.execute (MojoExecutor.java:148)
    at org.apache.maven.lifecycle.internal.LifecycleModuleBuilder.buildProject (LifecycleModuleBuilder.java:117)
    at org.apache.maven.lifecycle.internal.LifecycleModuleBuilder.buildProject (LifecycleModuleBuilder.java:81)
    at org.apache.maven.lifecycle.internal.builder.singlethreaded.SingleThreadedBuilder.build (SingleThreadedBuilder.java:56)
    at org.apache.maven.lifecycle.internal.LifecycleStarter.execute (LifecycleStarter.java:128)
    at org.apache.maven.DefaultMaven.doExecute (DefaultMaven.java:305)
    at org.apache.maven.DefaultMaven.doExecute (DefaultMaven.java:192)
    at org.apache.maven.DefaultMaven.execute (DefaultMaven.java:105)
    at org.jvnet.hudson.maven3.launcher.Maven35Launcher.main (Maven35Launcher.java:130)
    at sun.reflect.NativeMethodAccessorImpl.invoke0 (Native Method)
    at sun.reflect.NativeMethodAccessorImpl.invoke (NativeMethodAccessorImpl.java:62)
    at sun.reflect.DelegatingMethodAccessorImpl.invoke (DelegatingMethodAccessorImpl.java:43)
    at java.lang.reflect.Method.invoke (Method.java:498)
    at org.codehaus.plexus.classworlds.launcher.Launcher.launchEnhanced (Launcher.java:282)
    at org.codehaus.plexus.classworlds.launcher.Launcher.launch (Launcher.java:225)
    at jenkins.maven3.agent.Maven35Main.launch (Maven35Main.java:178)
    at sun.reflect.NativeMethodAccessorImpl.invoke0 (Native Method)
    at sun.reflect.NativeMethodAccessorImpl.invoke (NativeMethodAccessorImpl.java:62)
    at sun.reflect.DelegatingMethodAccessorImpl.invoke (DelegatingMethodAccessorImpl.java:43)
    at java.lang.reflect.Method.invoke (Method.java:498)
    at hudson.maven.Maven3Builder.call (Maven3Builder.java:139)
    at hudson.maven.Maven3Builder.call (Maven3Builder.java:70)
    at hudson.remoting.UserRequest.perform (UserRequest.java:212)
    at hudson.remoting.UserRequest.perform (UserRequest.java:54)
    at hudson.remoting.Request$2.run (Request.java:369)
    at hudson.remoting.InterceptingExecutorService$1.call (InterceptingExecutorService.java:72)
    at java.util.concurrent.FutureTask.run (FutureTask.java:266)
    at java.util.concurrent.ThreadPoolExecutor.runWorker (ThreadPoolExecutor.java:1149)
    at java.util.concurrent.ThreadPoolExecutor$Worker.run (ThreadPoolExecutor.java:624)
    at java.lang.Thread.run (Thread.java:748)
[ERROR]
[ERROR] Re-run Maven using the -X switch to enable full debug logging.
[ERROR]
[ERROR] For more information about the errors and possible solutions, please read the following articles:
[ERROR] [Help 1] http://cwiki.apache.org/confluence/display/MAVEN/MojoExecutionException
[JENKINS] Archiving <https://builds.apache.org/job/dist-tool-plugin/ws/pom.xml> to org.apache.maven.dist.tools/dist-tool-plugin/1.0-SNAPSHOT/dist-tool-plugin-1.0-SNAPSHOT.pom
[JENKINS] Archiving <https://builds.apache.org/job/dist-tool-plugin/ws/target/dist-tool-plugin-1.0-SNAPSHOT.jar> to org.apache.maven.dist.tools/dist-tool-plugin/1.0-SNAPSHOT/dist-tool-plugin-1.0-SNAPSHOT.jar
[Fast Archiver] Compressed 87.80 KB of artifacts by 72.9% relative to #2969
channel stopped
Reply | Threaded
Open this post in threaded view
|

Build failed in Jenkins: dist-tool-plugin #2976

Apache Jenkins Server-2
See <https://builds.apache.org/job/dist-tool-plugin/2976/display/redirect>

Changes:


------------------------------------------
[...truncated 263.21 KB...]
[INFO]   * maven-jxr-plugin
[INFO]   maven-linkcheck-plugin
[INFO]   maven-patch-plugin
[INFO]   maven-pdf-plugin
[INFO]   * maven-plugin-plugin
[INFO]   maven-pmd-plugin
[INFO]   maven-project-info-reports-plugin
[INFO]   maven-rar-plugin
[INFO]   * maven-release-plugin  
[INFO]   maven-remote-resources-plugin
[INFO]   maven-resources-plugin
[INFO]   * maven-scm-plugin
[INFO]   maven-scm-publish-plugin
[INFO]   maven-shade-plugin
[INFO]   maven-site-plugin
[INFO]   maven-source-plugin
[INFO]   maven-stage-plugin
[INFO]   * maven-surefire-plugin
[INFO]   * maven-surefire-report-plugin
[INFO]   maven-toolchains-plugin
[INFO]   maven-verifier-plugin
[INFO]   maven-war-plugin
[INFO] /pom: org.apache https://maven.apache.org/pom/
[INFO] > apache index-path = /asf/
[INFO] > apache site = https://maven.apache.org/pom/asf/
[INFO]   apache
[INFO] /pom: org.apache.maven https://maven.apache.org/pom/
[INFO] > maven-parent index-path = /maven/
[INFO] > maven-parent site = https://maven.apache.org/pom/maven/
[INFO]   maven-parent
[INFO] /release: org.apache.maven.release
[INFO]   maven-release (,3)
[INFO] /reporting: org.apache.maven.reporting https://maven.apache.org/shared/
[INFO]   maven-reporting-api
[INFO]   maven-reporting-exec
[INFO]   maven-reporting-impl
[INFO] /resolver: org.apache.maven.resolver
[INFO]   maven-resolver
[INFO] /resources: org.apache.apache.resources
[INFO] > apache-source-release-assembly-descriptor site = http://maven.apache.org/apache-resource-bundles/
[INFO]   apache-source-release-assembly-descriptor
[INFO] /resources: org.apache
[INFO] > apache-incubator-disclaimer-resource-bundle site = http://maven.apache.org/apache-resource-bundles/
[INFO]   apache-incubator-disclaimer-resource-bundle (,1.1]
[INFO] > apache-jar-resource-bundle site = http://maven.apache.org/apache-resource-bundles/
[INFO]   apache-jar-resource-bundle (,1.4]
[INFO] > apache-license-header-resource-bundle site = http://maven.apache.org/apache-resource-bundles/
[INFO]   apache-license-header-resource-bundle (,1.1]
[INFO] /scm: org.apache.maven.scm
[INFO]   maven-scm
[INFO] /shared: org.apache.maven.shared https://maven.apache.org/shared/
[INFO]   file-management
[INFO]   maven-artifact-transfer
[INFO]   maven-common-artifact-filters
[INFO]   maven-dependency-analyzer
[INFO]   maven-dependency-tree
[INFO]   maven-filtering
[INFO]   maven-invoker
[INFO]   maven-jarsigner
[INFO]   maven-mapping
[INFO]   maven-script-interpreter
[INFO]   maven-shared-incremental
[INFO]   maven-shared-jar
[INFO]   maven-shared-resources
[INFO]   maven-shared-utils
[INFO]   maven-shared-io
[INFO]   maven-verifier
[INFO] /shared: org.apache.maven https://maven.apache.org/shared/
[INFO]   maven-archiver
[INFO] > maven-skins index-path = /skins/
[INFO] /skins: org.apache.maven.skins https://maven.apache.org/skins/
[INFO]   maven-default-skin
[INFO]   maven-fluido-skin
[INFO] /surefire: org.apache.maven.surefire
[INFO]   surefire
[INFO] /wagon: org.apache.maven.wagon
[INFO]   wagon
[INFO]
[ERROR] maven-project-info-reports-plugin: found 3.1.0 instead of 3.0.0 in https://maven.apache.org/plugins/
[ERROR] maven-shade-plugin: found 3.2.4 instead of 3.2.3 in https://maven.apache.org/plugins/
[INFO] Generating "Dist Tool> Check Errors" report --- dist-tool-plugin:1.0-SNAPSHOT:check-errors
[INFO] Generating "Dist Tool> List Plugins Prerequisites" report --- dist-tool-plugin:1.0-SNAPSHOT:list-plugins-prerequisites
[INFO] Generating "Dist Tool> List Master Jobs" report --- dist-tool-plugin:1.0-SNAPSHOT:list-master-jobs
IOException try 1 while reading https://builds.apache.org/job/maven-box/job/maven-metric: class org.jsoup.HttpStatusException HTTP error fetching URL
IOException try 2 while reading https://builds.apache.org/job/maven-box/job/maven-metric: class org.jsoup.HttpStatusException HTTP error fetching URL
IOException try 3 while reading https://builds.apache.org/job/maven-box/job/maven-metric: class org.jsoup.HttpStatusException HTTP error fetching URL
[WARNING] Failed to read status for maven-metric Jenkins job https://builds.apache.org/job/maven-box/job/maven-metric
IOException try 1 while reading https://builds.apache.org/job/maven-box/job/maven-metric-extension: class org.jsoup.HttpStatusException HTTP error fetching URL
IOException try 2 while reading https://builds.apache.org/job/maven-box/job/maven-metric-extension: class org.jsoup.HttpStatusException HTTP error fetching URL
IOException try 3 while reading https://builds.apache.org/job/maven-box/job/maven-metric-extension: class org.jsoup.HttpStatusException HTTP error fetching URL
[WARNING] Failed to read status for maven-metric-extension Jenkins job https://builds.apache.org/job/maven-box/job/maven-metric-extension
[INFO] Generating "Dist Tool> Failure Hack" report --- dist-tool-plugin:1.0-SNAPSHOT:failure-report
[ERROR] check-source-release.log error log not empty:
Missing file for maven-project-info-reports-plugin in http://www.apache.org/dist/maven/plugins
 > maven-project-info-reports-plugin-3.0.0-source-release.zip <
 > maven-project-info-reports-plugin-3.0.0-source-release.zip.asc <
 > maven-project-info-reports-plugin-3.0.0-source-release.zip.sha1 or .sha512 <
Different version than 3.0.0 for maven-project-info-reports-plugin available in http://www.apache.org/dist/maven/plugins
 > maven-project-info-reports-plugin-3.1.0-source-release.zip <
 > maven-project-info-reports-plugin-3.1.0-source-release.zip.asc <
 > maven-project-info-reports-plugin-3.1.0-source-release.zip.sha512 <
Missing file for maven-shade-plugin in http://www.apache.org/dist/maven/plugins
 > maven-shade-plugin-3.2.3-source-release.zip <
 > maven-shade-plugin-3.2.3-source-release.zip.asc <
 > maven-shade-plugin-3.2.3-source-release.zip.sha1 or .sha512 <
Different version than 3.2.3 for maven-shade-plugin available in http://www.apache.org/dist/maven/plugins
 > maven-shade-plugin-3.2.4-source-release.zip <
 > maven-shade-plugin-3.2.4-source-release.zip.asc <
 > maven-shade-plugin-3.2.4-source-release.zip.sha512 <
Missing file for wagon in http://www.apache.org/dist/maven/wagon
 > wagon-3.4.0-source-release.zip <
 > wagon-3.4.0-source-release.zip.asc <
 > wagon-3.4.0-source-release.zip.sha1 or .sha512 <
Different version than 3.4.0 for wagon available in http://www.apache.org/dist/maven/wagon
 > wagon-3.4.1-source-release.zip <
 > wagon-3.4.1-source-release.zip.asc <
 > wagon-3.4.1-source-release.zip.sha512 <

[ERROR] check-index-page.log error log not empty:
maven-project-info-reports-plugin: found 3.1.0 instead of 3.0.0 in https://maven.apache.org/plugins/
maven-shade-plugin: found 3.2.4 instead of 3.2.3 in https://maven.apache.org/plugins/

[JENKINS] Archiving site from <https://builds.apache.org/job/dist-tool-plugin/ws/target/site> to /x1/jenkins/jenkins-home/jobs/dist-tool-plugin/site
[INFO] ------------------------------------------------------------------------
[INFO] BUILD FAILURE
[INFO] ------------------------------------------------------------------------
[INFO] Total time:  05:32 min
[INFO] Finished at: 2020-06-02T09:56:55Z
[INFO] ------------------------------------------------------------------------
[WARNING] The requested profile "apache.snapshots" could not be activated because it does not exist.
Waiting for Jenkins to finish collecting data
[ERROR] Failed to execute goal org.apache.maven.plugins:maven-site-plugin:3.7.1:site (default-site) on project dist-tool-plugin: Error generating dist-tool-plugin:1.0-SNAPSHOT:failure-report report: Dist Tool> Checks found inconsistencies in some released artifacts, see https://builds.apache.org/job/dist-tool-plugin/site/dist-tool-check-errors.html for more information -> [Help 1]
org.apache.maven.lifecycle.LifecycleExecutionException: Failed to execute goal org.apache.maven.plugins:maven-site-plugin:3.7.1:site (default-site) on project dist-tool-plugin: Error generating dist-tool-plugin:1.0-SNAPSHOT:failure-report report
    at org.apache.maven.lifecycle.internal.MojoExecutor.execute (MojoExecutor.java:215)
    at org.apache.maven.lifecycle.internal.MojoExecutor.execute (MojoExecutor.java:156)
    at org.apache.maven.lifecycle.internal.MojoExecutor.execute (MojoExecutor.java:148)
    at org.apache.maven.lifecycle.internal.LifecycleModuleBuilder.buildProject (LifecycleModuleBuilder.java:117)
    at org.apache.maven.lifecycle.internal.LifecycleModuleBuilder.buildProject (LifecycleModuleBuilder.java:81)
    at org.apache.maven.lifecycle.internal.builder.singlethreaded.SingleThreadedBuilder.build (SingleThreadedBuilder.java:56)
    at org.apache.maven.lifecycle.internal.LifecycleStarter.execute (LifecycleStarter.java:128)
    at org.apache.maven.DefaultMaven.doExecute (DefaultMaven.java:305)
    at org.apache.maven.DefaultMaven.doExecute (DefaultMaven.java:192)
    at org.apache.maven.DefaultMaven.execute (DefaultMaven.java:105)
    at org.jvnet.hudson.maven3.launcher.Maven35Launcher.main (Maven35Launcher.java:130)
    at sun.reflect.NativeMethodAccessorImpl.invoke0 (Native Method)
    at sun.reflect.NativeMethodAccessorImpl.invoke (NativeMethodAccessorImpl.java:62)
    at sun.reflect.DelegatingMethodAccessorImpl.invoke (DelegatingMethodAccessorImpl.java:43)
    at java.lang.reflect.Method.invoke (Method.java:498)
    at org.codehaus.plexus.classworlds.launcher.Launcher.launchEnhanced (Launcher.java:282)
    at org.codehaus.plexus.classworlds.launcher.Launcher.launch (Launcher.java:225)
    at jenkins.maven3.agent.Maven35Main.launch (Maven35Main.java:178)
    at sun.reflect.NativeMethodAccessorImpl.invoke0 (Native Method)
    at sun.reflect.NativeMethodAccessorImpl.invoke (NativeMethodAccessorImpl.java:62)
    at sun.reflect.DelegatingMethodAccessorImpl.invoke (DelegatingMethodAccessorImpl.java:43)
    at java.lang.reflect.Method.invoke (Method.java:498)
    at hudson.maven.Maven3Builder.call (Maven3Builder.java:139)
    at hudson.maven.Maven3Builder.call (Maven3Builder.java:70)
    at hudson.remoting.UserRequest.perform (UserRequest.java:212)
    at hudson.remoting.UserRequest.perform (UserRequest.java:54)
    at hudson.remoting.Request$2.run (Request.java:369)
    at hudson.remoting.InterceptingExecutorService$1.call (InterceptingExecutorService.java:72)
    at java.util.concurrent.FutureTask.run (FutureTask.java:266)
    at java.util.concurrent.ThreadPoolExecutor.runWorker (ThreadPoolExecutor.java:1149)
    at java.util.concurrent.ThreadPoolExecutor$Worker.run (ThreadPoolExecutor.java:624)
    at java.lang.Thread.run (Thread.java:748)
Caused by: org.apache.maven.plugin.MojoExecutionException: Error generating dist-tool-plugin:1.0-SNAPSHOT:failure-report report
    at org.apache.maven.plugins.site.render.SiteMojo.execute (SiteMojo.java:155)
    at org.apache.maven.plugin.DefaultBuildPluginManager.executeMojo (DefaultBuildPluginManager.java:137)
    at org.apache.maven.lifecycle.internal.MojoExecutor.execute (MojoExecutor.java:210)
    at org.apache.maven.lifecycle.internal.MojoExecutor.execute (MojoExecutor.java:156)
    at org.apache.maven.lifecycle.internal.MojoExecutor.execute (MojoExecutor.java:148)
    at org.apache.maven.lifecycle.internal.LifecycleModuleBuilder.buildProject (LifecycleModuleBuilder.java:117)
    at org.apache.maven.lifecycle.internal.LifecycleModuleBuilder.buildProject (LifecycleModuleBuilder.java:81)
    at org.apache.maven.lifecycle.internal.builder.singlethreaded.SingleThreadedBuilder.build (SingleThreadedBuilder.java:56)
    at org.apache.maven.lifecycle.internal.LifecycleStarter.execute (LifecycleStarter.java:128)
    at org.apache.maven.DefaultMaven.doExecute (DefaultMaven.java:305)
    at org.apache.maven.DefaultMaven.doExecute (DefaultMaven.java:192)
    at org.apache.maven.DefaultMaven.execute (DefaultMaven.java:105)
    at org.jvnet.hudson.maven3.launcher.Maven35Launcher.main (Maven35Launcher.java:130)
    at sun.reflect.NativeMethodAccessorImpl.invoke0 (Native Method)
    at sun.reflect.NativeMethodAccessorImpl.invoke (NativeMethodAccessorImpl.java:62)
    at sun.reflect.DelegatingMethodAccessorImpl.invoke (DelegatingMethodAccessorImpl.java:43)
    at java.lang.reflect.Method.invoke (Method.java:498)
    at org.codehaus.plexus.classworlds.launcher.Launcher.launchEnhanced (Launcher.java:282)
    at org.codehaus.plexus.classworlds.launcher.Launcher.launch (Launcher.java:225)
    at jenkins.maven3.agent.Maven35Main.launch (Maven35Main.java:178)
    at sun.reflect.NativeMethodAccessorImpl.invoke0 (Native Method)
    at sun.reflect.NativeMethodAccessorImpl.invoke (NativeMethodAccessorImpl.java:62)
    at sun.reflect.DelegatingMethodAccessorImpl.invoke (DelegatingMethodAccessorImpl.java:43)
    at java.lang.reflect.Method.invoke (Method.java:498)
    at hudson.maven.Maven3Builder.call (Maven3Builder.java:139)
    at hudson.maven.Maven3Builder.call (Maven3Builder.java:70)
    at hudson.remoting.UserRequest.perform (UserRequest.java:212)
    at hudson.remoting.UserRequest.perform (UserRequest.java:54)
    at hudson.remoting.Request$2.run (Request.java:369)
    at hudson.remoting.InterceptingExecutorService$1.call (InterceptingExecutorService.java:72)
    at java.util.concurrent.FutureTask.run (FutureTask.java:266)
    at java.util.concurrent.ThreadPoolExecutor.runWorker (ThreadPoolExecutor.java:1149)
    at java.util.concurrent.ThreadPoolExecutor$Worker.run (ThreadPoolExecutor.java:624)
    at java.lang.Thread.run (Thread.java:748)
Caused by: org.apache.maven.reporting.MavenReportException: Dist Tool> Checks found inconsistencies in some released artifacts, see https://builds.apache.org/job/dist-tool-plugin/site/dist-tool-check-errors.html for more information
    at org.apache.maven.dist.tools.DistCheckErrorsMojo.executeReport (DistCheckErrorsMojo.java:113)
    at org.apache.maven.reporting.AbstractMavenReport.generate (AbstractMavenReport.java:251)
    at org.apache.maven.plugins.site.render.ReportDocumentRenderer.renderDocument (ReportDocumentRenderer.java:230)
    at org.apache.maven.doxia.siterenderer.DefaultSiteRenderer.render (DefaultSiteRenderer.java:349)
    at org.apache.maven.plugins.site.render.SiteMojo.renderLocale (SiteMojo.java:198)
    at org.apache.maven.plugins.site.render.SiteMojo.execute (SiteMojo.java:147)
    at org.apache.maven.plugin.DefaultBuildPluginManager.executeMojo (DefaultBuildPluginManager.java:137)
    at org.apache.maven.lifecycle.internal.MojoExecutor.execute (MojoExecutor.java:210)
    at org.apache.maven.lifecycle.internal.MojoExecutor.execute (MojoExecutor.java:156)
    at org.apache.maven.lifecycle.internal.MojoExecutor.execute (MojoExecutor.java:148)
    at org.apache.maven.lifecycle.internal.LifecycleModuleBuilder.buildProject (LifecycleModuleBuilder.java:117)
    at org.apache.maven.lifecycle.internal.LifecycleModuleBuilder.buildProject (LifecycleModuleBuilder.java:81)
    at org.apache.maven.lifecycle.internal.builder.singlethreaded.SingleThreadedBuilder.build (SingleThreadedBuilder.java:56)
    at org.apache.maven.lifecycle.internal.LifecycleStarter.execute (LifecycleStarter.java:128)
    at org.apache.maven.DefaultMaven.doExecute (DefaultMaven.java:305)
    at org.apache.maven.DefaultMaven.doExecute (DefaultMaven.java:192)
    at org.apache.maven.DefaultMaven.execute (DefaultMaven.java:105)
    at org.jvnet.hudson.maven3.launcher.Maven35Launcher.main (Maven35Launcher.java:130)
    at sun.reflect.NativeMethodAccessorImpl.invoke0 (Native Method)
    at sun.reflect.NativeMethodAccessorImpl.invoke (NativeMethodAccessorImpl.java:62)
    at sun.reflect.DelegatingMethodAccessorImpl.invoke (DelegatingMethodAccessorImpl.java:43)
    at java.lang.reflect.Method.invoke (Method.java:498)
    at org.codehaus.plexus.classworlds.launcher.Launcher.launchEnhanced (Launcher.java:282)
    at org.codehaus.plexus.classworlds.launcher.Launcher.launch (Launcher.java:225)
    at jenkins.maven3.agent.Maven35Main.launch (Maven35Main.java:178)
    at sun.reflect.NativeMethodAccessorImpl.invoke0 (Native Method)
    at sun.reflect.NativeMethodAccessorImpl.invoke (NativeMethodAccessorImpl.java:62)
    at sun.reflect.DelegatingMethodAccessorImpl.invoke (DelegatingMethodAccessorImpl.java:43)
    at java.lang.reflect.Method.invoke (Method.java:498)
    at hudson.maven.Maven3Builder.call (Maven3Builder.java:139)
    at hudson.maven.Maven3Builder.call (Maven3Builder.java:70)
    at hudson.remoting.UserRequest.perform (UserRequest.java:212)
    at hudson.remoting.UserRequest.perform (UserRequest.java:54)
    at hudson.remoting.Request$2.run (Request.java:369)
    at hudson.remoting.InterceptingExecutorService$1.call (InterceptingExecutorService.java:72)
    at java.util.concurrent.FutureTask.run (FutureTask.java:266)
    at java.util.concurrent.ThreadPoolExecutor.runWorker (ThreadPoolExecutor.java:1149)
    at java.util.concurrent.ThreadPoolExecutor$Worker.run (ThreadPoolExecutor.java:624)
    at java.lang.Thread.run (Thread.java:748)
[ERROR]
[ERROR] Re-run Maven using the -X switch to enable full debug logging.
[ERROR]
[ERROR] For more information about the errors and possible solutions, please read the following articles:
[ERROR] [Help 1] http://cwiki.apache.org/confluence/display/MAVEN/MojoExecutionException
[JENKINS] Archiving <https://builds.apache.org/job/dist-tool-plugin/ws/pom.xml> to org.apache.maven.dist.tools/dist-tool-plugin/1.0-SNAPSHOT/dist-tool-plugin-1.0-SNAPSHOT.pom
[JENKINS] Archiving <https://builds.apache.org/job/dist-tool-plugin/ws/target/dist-tool-plugin-1.0-SNAPSHOT.jar> to org.apache.maven.dist.tools/dist-tool-plugin/1.0-SNAPSHOT/dist-tool-plugin-1.0-SNAPSHOT.jar
[Fast Archiver] Compressed 87.80 KB of artifacts by 72.9% relative to #2969
channel stopped
Reply | Threaded
Open this post in threaded view
|

Jenkins build is back to normal : dist-tool-plugin #2977

Apache Jenkins Server-2