Build failed in Jenkins: dist-tool-plugin #2138

Next Topic
 
classic Classic list List threaded Threaded
15 messages Options
Reply | Threaded
Open this post in threaded view
|

Build failed in Jenkins: dist-tool-plugin #2138

Apache Jenkins Server-2
See <https://builds.apache.org/job/dist-tool-plugin/2138/display/redirect>

------------------------------------------
[...truncated 56.56 KB...]
[WARNING]  > apache-license-header-resource-bundle-1.1-source-release.zip.asc <
[WARNING]  > apache-license-header-resource-bundle-1.1-source-release.zip.md5 <
[WARNING] Missing file for apache-license-header-resource-bundle in http://www.apache.org/dist/maven/resources
[WARNING]  > apache-license-header-resource-bundle-1.1-source-release.zip <
[WARNING]  > apache-license-header-resource-bundle-1.1-source-release.zip.asc <
[WARNING]  > apache-license-header-resource-bundle-1.1-source-release.zip.md5 <
[INFO] /scm: org.apache.maven.scm
[INFO]   maven-scm
[INFO] /shared: org.apache.maven.shared http://maven.apache.org/shared/
[INFO]   file-management
[INFO]   maven-artifact-resolver
[INFO]   maven-common-artifact-filters
[INFO]   maven-dependency-analyzer
[INFO]   maven-dependency-tree
[INFO]   maven-filtering
[INFO]   maven-invoker
[INFO]   maven-jarsigner
[INFO]   maven-mapping
[INFO]   maven-repository-builder
[INFO]   maven-runtime
[INFO]   maven-script-interpreter
[INFO]   maven-shared-incremental
[INFO]   maven-shared-jar
[INFO]   maven-shared-resources
[INFO]   maven-shared-utils
[INFO]   maven-shared-io
[INFO]   maven-verifier
[INFO] /shared: org.apache.maven http://maven.apache.org/shared/
[INFO]   maven-archiver
[INFO] > maven-skins index-path = /skins/
[INFO] /skins: org.apache.maven.skins http://maven.apache.org/skins/
[INFO]   maven-default-skin
[INFO]   maven-fluido-skin
[INFO] /surefire: org.apache.maven.surefire
[INFO]   surefire
[INFO] /wagon: org.apache.maven.wagon
[INFO]   wagon
[INFO]
[INFO] Generating "Dist Tool> Check Index Pages" report --- dist-tool-plugin:1.0-SNAPSHOT:check-index-page
[INFO] > dist-area = http://www.apache.org/dist/maven/
[INFO] /archetype: org.apache.maven.archetype
[INFO]   maven-archetype
[INFO] /binaries: content.not.checked
[INFO] /doxia: org.apache.maven.doxia
[INFO]   doxia
[INFO]   doxia-converter
[INFO]   doxia-linkcheck
[INFO]   doxia-sitetools
[INFO] /enforcer: org.apache.maven.enforcer
[INFO]   enforcer
[INFO] /indexer: org.apache.maven.indexer
[INFO]   maven-indexer
[INFO] /maven-3: org.apache.maven src+bin
[INFO]   apache-maven [3.0,3.1.0-alpha-1)
[INFO]   apache-maven [3.1.0,3.2.0-alpha-1)
[INFO]   apache-maven
[INFO] /jxr: org.apache.maven.jxr
[INFO]   jxr
[INFO] /plugin-testing: org.apache.maven.plugin-testing
[INFO]   maven-plugin-testing
[INFO] /plugin-tools: org.apache.maven.plugin-tools
[INFO]   maven-plugin-tools
[INFO] /plugins: org.apache.maven.plugins http://maven.apache.org/plugins/
[INFO]   maven-acr-plugin
[INFO]   maven-ant-plugin
[INFO]   maven-antrun-plugin
[INFO]   * maven-archetype-plugin
[INFO]   maven-assembly-plugin
[INFO]   maven-changelog-plugin
[INFO]   maven-changes-plugin
[INFO]   maven-checkstyle-plugin
[INFO]   maven-clean-plugin
[INFO]   maven-compiler-plugin
[INFO]   maven-dependency-plugin
[INFO]   maven-deploy-plugin
[INFO]   maven-doap-plugin
[INFO]   maven-docck-plugin
[INFO]   maven-ear-plugin
[INFO]   maven-ejb-plugin
[INFO]   * maven-enforcer-plugin
[INFO]   * maven-failsafe-plugin
[INFO]   maven-gpg-plugin
[INFO]   maven-help-plugin
[INFO]   maven-install-plugin
[INFO]   maven-invoker-plugin
[INFO]   maven-jar-plugin
[INFO]   maven-jarsigner-plugin
[INFO]   maven-javadoc-plugin
[INFO]   maven-jdeps-plugin
[INFO]   maven-jdeprscan-plugin
[INFO]   maven-jlink-plugin
[INFO]   maven-jmod-plugin
[INFO]   * maven-jxr-plugin
[INFO]   maven-linkcheck-plugin
[INFO]   maven-patch-plugin
[INFO]   maven-pdf-plugin
[INFO]   * maven-plugin-plugin
[INFO]   maven-pmd-plugin
[INFO]   maven-project-info-reports-plugin
[INFO]   maven-rar-plugin
[INFO]   * maven-release-plugin  
[INFO]   maven-remote-resources-plugin
[INFO]   maven-repository-plugin
[INFO]   maven-resources-plugin
[INFO]   * maven-scm-plugin
[INFO]   maven-scm-publish-plugin
[INFO]   maven-shade-plugin
[INFO]   maven-site-plugin
[INFO]   maven-source-plugin
[INFO]   maven-stage-plugin
[INFO]   * maven-surefire-plugin
[INFO]   * maven-surefire-report-plugin
[INFO]   maven-toolchains-plugin
[INFO]   maven-verifier-plugin
[INFO]   maven-war-plugin
[INFO] /pom: org.apache http://maven.apache.org/pom/
[INFO] > apache index-path = /asf/
[INFO] > apache site = http://maven.apache.org/pom/asf/
[INFO]   apache
[INFO] /pom: org.apache.maven http://maven.apache.org/pom/
[INFO] > maven-parent index-path = /maven/
[INFO] > maven-parent site = http://maven.apache.org/pom/maven/
[INFO]   maven-parent
[INFO] /release: org.apache.maven.release
[INFO]   maven-release (,3)
[INFO] /reporting: org.apache.maven.reporting http://maven.apache.org/shared/
[INFO]   maven-reporting-api
[INFO]   maven-reporting-exec
[INFO]   maven-reporting-impl
[INFO] /resolver: org.apache.maven.resolver
[INFO]   maven-resolver
[INFO] /resources: org.apache.apache.resources
[INFO] > apache-source-release-assembly-descriptor site = http://maven.apache.org/apache-resource-bundles/
[INFO]   apache-source-release-assembly-descriptor
[INFO] /resources: org.apache
[INFO] > apache-incubator-disclaimer-resource-bundle site = http://maven.apache.org/apache-resource-bundles/
[INFO]   apache-incubator-disclaimer-resource-bundle (,1.1]
[INFO] > apache-jar-resource-bundle site = http://maven.apache.org/apache-resource-bundles/
[INFO]   apache-jar-resource-bundle (,1.4]
[INFO] > apache-license-header-resource-bundle site = http://maven.apache.org/apache-resource-bundles/
[INFO]   apache-license-header-resource-bundle (,1.1]
[INFO] /scm: org.apache.maven.scm
[INFO]   maven-scm
[INFO] /shared: org.apache.maven.shared http://maven.apache.org/shared/
[INFO]   file-management
[INFO]   maven-artifact-resolver
[INFO]   maven-common-artifact-filters
[INFO]   maven-dependency-analyzer
[INFO]   maven-dependency-tree
[INFO]   maven-filtering
[INFO]   maven-invoker
[INFO]   maven-jarsigner
[INFO]   maven-mapping
[INFO]   maven-repository-builder
[INFO]   maven-runtime
[INFO]   maven-script-interpreter
[INFO]   maven-shared-incremental
[INFO]   maven-shared-jar
[INFO]   maven-shared-resources
[INFO]   maven-shared-utils
[INFO]   maven-shared-io
[INFO]   maven-verifier
[INFO] /shared: org.apache.maven http://maven.apache.org/shared/
[INFO]   maven-archiver
[INFO] > maven-skins index-path = /skins/
[INFO] /skins: org.apache.maven.skins http://maven.apache.org/skins/
[INFO]   maven-default-skin
[INFO]   maven-fluido-skin
[INFO] /surefire: org.apache.maven.surefire
[INFO]   surefire
[INFO] /wagon: org.apache.maven.wagon
[INFO]   wagon
[INFO]
[INFO] Generating "Dist Tool> Check Errors" report --- dist-tool-plugin:1.0-SNAPSHOT:check-errors
[INFO] Generating "Dist Tool> List Plugins Prerequisites" report --- dist-tool-plugin:1.0-SNAPSHOT:list-plugins-prerequisites
[INFO] Generating "Dist Tool> Failure Hack" report --- dist-tool-plugin:1.0-SNAPSHOT:failure-report
[ERROR] check-source-release.log error log not empty:
Missing file for apache-maven in http://www.apache.org/dist/maven/maven-3/3.0.5/source
 > apache-maven-3.0.5-src.zip.md5 <
Missing file for apache-maven in http://www.apache.org/dist/maven/maven-3/3.1.1/source
 > apache-maven-3.1.1-src.zip.md5 <
Missing file for apache-maven in http://www.apache.org/dist/maven/maven-3/3.5.3/source
 > apache-maven-3.5.3-src.zip.md5 <

[JENKINS] Archiving site from <https://builds.apache.org/job/dist-tool-plugin/ws/target/site> to /x1/jenkins/jenkins-home/jobs/dist-tool-plugin/site
[INFO] ------------------------------------------------------------------------
[INFO] BUILD FAILURE
[INFO] ------------------------------------------------------------------------
[INFO] Total time: 06:47 min
[INFO] Finished at: 2018-04-08T09:59:05+00:00
[INFO] Final Memory: 97M/765M
[INFO] ------------------------------------------------------------------------
[WARNING] The requested profile "apache.snapshots" could not be activated because it does not exist.
Waiting for Jenkins to finish collecting data
[ERROR] Failed to execute goal org.apache.maven.plugins:maven-site-plugin:3.7:site (default-site) on project dist-tool-plugin: Error generating dist-tool-plugin:1.0-SNAPSHOT:failure-report report: Dist Tool> Checks found inconsistencies in some released artifacts, see https://builds.apache.org/job/dist-tool-plugin/site/dist-tool-check-errors.html for more information -> [Help 1]
org.apache.maven.lifecycle.LifecycleExecutionException: Failed to execute goal org.apache.maven.plugins:maven-site-plugin:3.7:site (default-site) on project dist-tool-plugin: Error generating dist-tool-plugin:1.0-SNAPSHOT:failure-report report
        at org.apache.maven.lifecycle.internal.MojoExecutor.execute(MojoExecutor.java:212)
        at org.apache.maven.lifecycle.internal.MojoExecutor.execute(MojoExecutor.java:153)
        at org.apache.maven.lifecycle.internal.MojoExecutor.execute(MojoExecutor.java:145)
        at org.apache.maven.lifecycle.internal.LifecycleModuleBuilder.buildProject(LifecycleModuleBuilder.java:116)
        at org.apache.maven.lifecycle.internal.LifecycleModuleBuilder.buildProject(LifecycleModuleBuilder.java:80)
        at org.apache.maven.lifecycle.internal.builder.singlethreaded.SingleThreadedBuilder.build(SingleThreadedBuilder.java:51)
        at org.apache.maven.lifecycle.internal.LifecycleStarter.execute(LifecycleStarter.java:128)
        at org.apache.maven.DefaultMaven.doExecute(DefaultMaven.java:307)
        at org.apache.maven.DefaultMaven.doExecute(DefaultMaven.java:193)
        at org.apache.maven.DefaultMaven.execute(DefaultMaven.java:106)
        at org.jvnet.hudson.maven3.launcher.Maven33Launcher.main(Maven33Launcher.java:129)
        at sun.reflect.NativeMethodAccessorImpl.invoke0(Native Method)
        at sun.reflect.NativeMethodAccessorImpl.invoke(NativeMethodAccessorImpl.java:62)
        at sun.reflect.DelegatingMethodAccessorImpl.invoke(DelegatingMethodAccessorImpl.java:43)
        at java.lang.reflect.Method.invoke(Method.java:498)
        at org.codehaus.plexus.classworlds.launcher.Launcher.launchStandard(Launcher.java:330)
        at org.codehaus.plexus.classworlds.launcher.Launcher.launch(Launcher.java:238)
        at jenkins.maven3.agent.Maven33Main.launch(Maven33Main.java:176)
        at sun.reflect.NativeMethodAccessorImpl.invoke0(Native Method)
        at sun.reflect.NativeMethodAccessorImpl.invoke(NativeMethodAccessorImpl.java:62)
        at sun.reflect.DelegatingMethodAccessorImpl.invoke(DelegatingMethodAccessorImpl.java:43)
        at java.lang.reflect.Method.invoke(Method.java:498)
        at hudson.maven.Maven3Builder.call(Maven3Builder.java:139)
        at hudson.maven.Maven3Builder.call(Maven3Builder.java:70)
        at hudson.remoting.UserRequest.perform(UserRequest.java:207)
        at hudson.remoting.UserRequest.perform(UserRequest.java:53)
        at hudson.remoting.Request$2.run(Request.java:358)
        at hudson.remoting.InterceptingExecutorService$1.call(InterceptingExecutorService.java:72)
        at java.util.concurrent.FutureTask.run(FutureTask.java:266)
        at java.util.concurrent.ThreadPoolExecutor.runWorker(ThreadPoolExecutor.java:1149)
        at java.util.concurrent.ThreadPoolExecutor$Worker.run(ThreadPoolExecutor.java:624)
        at java.lang.Thread.run(Thread.java:748)
Caused by: org.apache.maven.plugin.MojoExecutionException: Error generating dist-tool-plugin:1.0-SNAPSHOT:failure-report report
        at org.apache.maven.plugins.site.render.SiteMojo.execute(SiteMojo.java:141)
        at org.apache.maven.plugin.DefaultBuildPluginManager.executeMojo(DefaultBuildPluginManager.java:134)
        at org.apache.maven.lifecycle.internal.MojoExecutor.execute(MojoExecutor.java:207)
        ... 31 more
Caused by: org.apache.maven.reporting.MavenReportException: Dist Tool> Checks found inconsistencies in some released artifacts, see https://builds.apache.org/job/dist-tool-plugin/site/dist-tool-check-errors.html for more information
        at org.apache.maven.dist.tools.DistCheckErrorsMojo.executeReport(DistCheckErrorsMojo.java:112)
        at org.apache.maven.reporting.AbstractMavenReport.generate(AbstractMavenReport.java:255)
        at org.apache.maven.plugins.site.render.ReportDocumentRenderer.renderDocument(ReportDocumentRenderer.java:230)
        at org.apache.maven.doxia.siterenderer.DefaultSiteRenderer.render(DefaultSiteRenderer.java:349)
        at org.apache.maven.plugins.site.render.SiteMojo.renderLocale(SiteMojo.java:184)
        at org.apache.maven.plugins.site.render.SiteMojo.execute(SiteMojo.java:133)
        ... 33 more
[ERROR]
[ERROR] Re-run Maven using the -X switch to enable full debug logging.
[ERROR]
[ERROR] For more information about the errors and possible solutions, please read the following articles:
[ERROR] [Help 1] http://cwiki.apache.org/confluence/display/MAVEN/MojoExecutionException
[JENKINS] Archiving <https://builds.apache.org/job/dist-tool-plugin/ws/pom.xml> to org.apache.maven.dist.tools/dist-tool-plugin/1.0-SNAPSHOT/dist-tool-plugin-1.0-SNAPSHOT.pom
[JENKINS] Archiving <https://builds.apache.org/job/dist-tool-plugin/ws/target/dist-tool-plugin-1.0-SNAPSHOT.jar> to org.apache.maven.dist.tools/dist-tool-plugin/1.0-SNAPSHOT/dist-tool-plugin-1.0-SNAPSHOT.jar
channel stopped
Reply | Threaded
Open this post in threaded view
|

Build failed in Jenkins: dist-tool-plugin #2139

Apache Jenkins Server-2
See <https://builds.apache.org/job/dist-tool-plugin/2139/display/redirect>

------------------------------------------
[...truncated 56.87 KB...]
[WARNING]  > apache-license-header-resource-bundle-1.1-source-release.zip.asc <
[WARNING]  > apache-license-header-resource-bundle-1.1-source-release.zip.md5 <
[WARNING] Missing file for apache-license-header-resource-bundle in http://www.apache.org/dist/maven/resources
[WARNING]  > apache-license-header-resource-bundle-1.1-source-release.zip <
[WARNING]  > apache-license-header-resource-bundle-1.1-source-release.zip.asc <
[WARNING]  > apache-license-header-resource-bundle-1.1-source-release.zip.md5 <
[INFO] /scm: org.apache.maven.scm
[INFO]   maven-scm
[INFO] /shared: org.apache.maven.shared http://maven.apache.org/shared/
[INFO]   file-management
[INFO]   maven-artifact-resolver
[INFO]   maven-common-artifact-filters
[INFO]   maven-dependency-analyzer
[INFO]   maven-dependency-tree
[INFO]   maven-filtering
[INFO]   maven-invoker
[INFO]   maven-jarsigner
[INFO]   maven-mapping
[INFO]   maven-repository-builder
[INFO]   maven-runtime
[INFO]   maven-script-interpreter
[INFO]   maven-shared-incremental
[INFO]   maven-shared-jar
[INFO]   maven-shared-resources
[INFO]   maven-shared-utils
[INFO]   maven-shared-io
[INFO]   maven-verifier
[INFO] /shared: org.apache.maven http://maven.apache.org/shared/
[INFO]   maven-archiver
[INFO] > maven-skins index-path = /skins/
[INFO] /skins: org.apache.maven.skins http://maven.apache.org/skins/
[INFO]   maven-default-skin
[INFO]   maven-fluido-skin
[INFO] /surefire: org.apache.maven.surefire
[INFO]   surefire
[INFO] /wagon: org.apache.maven.wagon
[INFO]   wagon
[INFO]
[INFO] Generating "Dist Tool> Check Index Pages" report --- dist-tool-plugin:1.0-SNAPSHOT:check-index-page
[INFO] > dist-area = http://www.apache.org/dist/maven/
[INFO] /archetype: org.apache.maven.archetype
[INFO]   maven-archetype
[INFO] /binaries: content.not.checked
[INFO] /doxia: org.apache.maven.doxia
[INFO]   doxia
[INFO]   doxia-converter
[INFO]   doxia-linkcheck
[INFO]   doxia-sitetools
[INFO] /enforcer: org.apache.maven.enforcer
[INFO]   enforcer
[INFO] /indexer: org.apache.maven.indexer
[INFO]   maven-indexer
[INFO] /maven-3: org.apache.maven src+bin
[INFO]   apache-maven [3.0,3.1.0-alpha-1)
[INFO]   apache-maven [3.1.0,3.2.0-alpha-1)
[INFO]   apache-maven
[INFO] /jxr: org.apache.maven.jxr
[INFO]   jxr
[INFO] /plugin-testing: org.apache.maven.plugin-testing
[INFO]   maven-plugin-testing
[INFO] /plugin-tools: org.apache.maven.plugin-tools
[INFO]   maven-plugin-tools
[INFO] /plugins: org.apache.maven.plugins http://maven.apache.org/plugins/
[INFO]   maven-acr-plugin
[INFO]   maven-ant-plugin
[INFO]   maven-antrun-plugin
[INFO]   * maven-archetype-plugin
[INFO]   maven-assembly-plugin
[INFO]   maven-changelog-plugin
[INFO]   maven-changes-plugin
[INFO]   maven-checkstyle-plugin
[INFO]   maven-clean-plugin
[INFO]   maven-compiler-plugin
[INFO]   maven-dependency-plugin
[INFO]   maven-deploy-plugin
[INFO]   maven-doap-plugin
[INFO]   maven-docck-plugin
[INFO]   maven-ear-plugin
[INFO]   maven-ejb-plugin
[INFO]   * maven-enforcer-plugin
[INFO]   * maven-failsafe-plugin
[INFO]   maven-gpg-plugin
[INFO]   maven-help-plugin
[INFO]   maven-install-plugin
[INFO]   maven-invoker-plugin
[INFO]   maven-jar-plugin
[INFO]   maven-jarsigner-plugin
[INFO]   maven-javadoc-plugin
[INFO]   maven-jdeps-plugin
[INFO]   maven-jdeprscan-plugin
[INFO]   maven-jlink-plugin
[INFO]   maven-jmod-plugin
[INFO]   * maven-jxr-plugin
[INFO]   maven-linkcheck-plugin
[INFO]   maven-patch-plugin
[INFO]   maven-pdf-plugin
[INFO]   * maven-plugin-plugin
[INFO]   maven-pmd-plugin
[INFO]   maven-project-info-reports-plugin
[INFO]   maven-rar-plugin
[INFO]   * maven-release-plugin  
[INFO]   maven-remote-resources-plugin
[INFO]   maven-repository-plugin
[INFO]   maven-resources-plugin
[INFO]   * maven-scm-plugin
[INFO]   maven-scm-publish-plugin
[INFO]   maven-shade-plugin
[INFO]   maven-site-plugin
[INFO]   maven-source-plugin
[INFO]   maven-stage-plugin
[INFO]   * maven-surefire-plugin
[INFO]   * maven-surefire-report-plugin
[INFO]   maven-toolchains-plugin
[INFO]   maven-verifier-plugin
[INFO]   maven-war-plugin
[INFO] /pom: org.apache http://maven.apache.org/pom/
[INFO] > apache index-path = /asf/
[INFO] > apache site = http://maven.apache.org/pom/asf/
[INFO]   apache
[INFO] /pom: org.apache.maven http://maven.apache.org/pom/
[INFO] > maven-parent index-path = /maven/
[INFO] > maven-parent site = http://maven.apache.org/pom/maven/
[INFO]   maven-parent
[INFO] /release: org.apache.maven.release
[INFO]   maven-release (,3)
[INFO] /reporting: org.apache.maven.reporting http://maven.apache.org/shared/
[INFO]   maven-reporting-api
[INFO]   maven-reporting-exec
[INFO]   maven-reporting-impl
[INFO] /resolver: org.apache.maven.resolver
[INFO]   maven-resolver
[INFO] /resources: org.apache.apache.resources
[INFO] > apache-source-release-assembly-descriptor site = http://maven.apache.org/apache-resource-bundles/
[INFO]   apache-source-release-assembly-descriptor
[INFO] /resources: org.apache
[INFO] > apache-incubator-disclaimer-resource-bundle site = http://maven.apache.org/apache-resource-bundles/
[INFO]   apache-incubator-disclaimer-resource-bundle (,1.1]
[INFO] > apache-jar-resource-bundle site = http://maven.apache.org/apache-resource-bundles/
[INFO]   apache-jar-resource-bundle (,1.4]
[INFO] > apache-license-header-resource-bundle site = http://maven.apache.org/apache-resource-bundles/
[INFO]   apache-license-header-resource-bundle (,1.1]
[INFO] /scm: org.apache.maven.scm
[INFO]   maven-scm
[INFO] /shared: org.apache.maven.shared http://maven.apache.org/shared/
[INFO]   file-management
[INFO]   maven-artifact-resolver
[INFO]   maven-common-artifact-filters
[INFO]   maven-dependency-analyzer
[INFO]   maven-dependency-tree
[INFO]   maven-filtering
[INFO]   maven-invoker
[INFO]   maven-jarsigner
[INFO]   maven-mapping
[INFO]   maven-repository-builder
[INFO]   maven-runtime
[INFO]   maven-script-interpreter
[INFO]   maven-shared-incremental
[INFO]   maven-shared-jar
[INFO]   maven-shared-resources
[INFO]   maven-shared-utils
[INFO]   maven-shared-io
[INFO]   maven-verifier
[INFO] /shared: org.apache.maven http://maven.apache.org/shared/
[INFO]   maven-archiver
[INFO] > maven-skins index-path = /skins/
[INFO] /skins: org.apache.maven.skins http://maven.apache.org/skins/
[INFO]   maven-default-skin
[INFO]   maven-fluido-skin
[INFO] /surefire: org.apache.maven.surefire
[INFO]   surefire
[INFO] /wagon: org.apache.maven.wagon
[INFO]   wagon
[INFO]
[INFO] Generating "Dist Tool> Check Errors" report --- dist-tool-plugin:1.0-SNAPSHOT:check-errors
[INFO] Generating "Dist Tool> List Plugins Prerequisites" report --- dist-tool-plugin:1.0-SNAPSHOT:list-plugins-prerequisites
[INFO] Generating "Dist Tool> Failure Hack" report --- dist-tool-plugin:1.0-SNAPSHOT:failure-report
[ERROR] check-source-release.log error log not empty:
Missing file for apache-maven in http://www.apache.org/dist/maven/maven-3/3.0.5/source
 > apache-maven-3.0.5-src.zip.md5 <
Missing file for apache-maven in http://www.apache.org/dist/maven/maven-3/3.1.1/source
 > apache-maven-3.1.1-src.zip.md5 <
Missing file for apache-maven in http://www.apache.org/dist/maven/maven-3/3.5.3/source
 > apache-maven-3.5.3-src.zip.md5 <

[JENKINS] Archiving site from <https://builds.apache.org/job/dist-tool-plugin/ws/target/site> to /x1/jenkins/jenkins-home/jobs/dist-tool-plugin/site
[INFO] ------------------------------------------------------------------------
[INFO] BUILD FAILURE
[INFO] ------------------------------------------------------------------------
[INFO] Total time: 03:51 min
[INFO] Finished at: 2018-04-09T09:55:20+00:00
[INFO] Final Memory: 97M/794M
[INFO] ------------------------------------------------------------------------
[WARNING] The requested profile "apache.snapshots" could not be activated because it does not exist.
Waiting for Jenkins to finish collecting data
[ERROR] Failed to execute goal org.apache.maven.plugins:maven-site-plugin:3.7:site (default-site) on project dist-tool-plugin: Error generating dist-tool-plugin:1.0-SNAPSHOT:failure-report report: Dist Tool> Checks found inconsistencies in some released artifacts, see https://builds.apache.org/job/dist-tool-plugin/site/dist-tool-check-errors.html for more information -> [Help 1]
org.apache.maven.lifecycle.LifecycleExecutionException: Failed to execute goal org.apache.maven.plugins:maven-site-plugin:3.7:site (default-site) on project dist-tool-plugin: Error generating dist-tool-plugin:1.0-SNAPSHOT:failure-report report
        at org.apache.maven.lifecycle.internal.MojoExecutor.execute(MojoExecutor.java:212)
        at org.apache.maven.lifecycle.internal.MojoExecutor.execute(MojoExecutor.java:153)
        at org.apache.maven.lifecycle.internal.MojoExecutor.execute(MojoExecutor.java:145)
        at org.apache.maven.lifecycle.internal.LifecycleModuleBuilder.buildProject(LifecycleModuleBuilder.java:116)
        at org.apache.maven.lifecycle.internal.LifecycleModuleBuilder.buildProject(LifecycleModuleBuilder.java:80)
        at org.apache.maven.lifecycle.internal.builder.singlethreaded.SingleThreadedBuilder.build(SingleThreadedBuilder.java:51)
        at org.apache.maven.lifecycle.internal.LifecycleStarter.execute(LifecycleStarter.java:128)
        at org.apache.maven.DefaultMaven.doExecute(DefaultMaven.java:307)
        at org.apache.maven.DefaultMaven.doExecute(DefaultMaven.java:193)
        at org.apache.maven.DefaultMaven.execute(DefaultMaven.java:106)
        at org.jvnet.hudson.maven3.launcher.Maven33Launcher.main(Maven33Launcher.java:129)
        at sun.reflect.NativeMethodAccessorImpl.invoke0(Native Method)
        at sun.reflect.NativeMethodAccessorImpl.invoke(NativeMethodAccessorImpl.java:62)
        at sun.reflect.DelegatingMethodAccessorImpl.invoke(DelegatingMethodAccessorImpl.java:43)
        at java.lang.reflect.Method.invoke(Method.java:498)
        at org.codehaus.plexus.classworlds.launcher.Launcher.launchStandard(Launcher.java:330)
        at org.codehaus.plexus.classworlds.launcher.Launcher.launch(Launcher.java:238)
        at jenkins.maven3.agent.Maven33Main.launch(Maven33Main.java:176)
        at sun.reflect.NativeMethodAccessorImpl.invoke0(Native Method)
        at sun.reflect.NativeMethodAccessorImpl.invoke(NativeMethodAccessorImpl.java:62)
        at sun.reflect.DelegatingMethodAccessorImpl.invoke(DelegatingMethodAccessorImpl.java:43)
        at java.lang.reflect.Method.invoke(Method.java:498)
        at hudson.maven.Maven3Builder.call(Maven3Builder.java:139)
        at hudson.maven.Maven3Builder.call(Maven3Builder.java:70)
        at hudson.remoting.UserRequest.perform(UserRequest.java:207)
        at hudson.remoting.UserRequest.perform(UserRequest.java:53)
        at hudson.remoting.Request$2.run(Request.java:358)
        at hudson.remoting.InterceptingExecutorService$1.call(InterceptingExecutorService.java:72)
        at java.util.concurrent.FutureTask.run(FutureTask.java:266)
        at java.util.concurrent.ThreadPoolExecutor.runWorker(ThreadPoolExecutor.java:1149)
        at java.util.concurrent.ThreadPoolExecutor$Worker.run(ThreadPoolExecutor.java:624)
        at java.lang.Thread.run(Thread.java:748)
Caused by: org.apache.maven.plugin.MojoExecutionException: Error generating dist-tool-plugin:1.0-SNAPSHOT:failure-report report
        at org.apache.maven.plugins.site.render.SiteMojo.execute(SiteMojo.java:141)
        at org.apache.maven.plugin.DefaultBuildPluginManager.executeMojo(DefaultBuildPluginManager.java:134)
        at org.apache.maven.lifecycle.internal.MojoExecutor.execute(MojoExecutor.java:207)
        ... 31 more
Caused by: org.apache.maven.reporting.MavenReportException: Dist Tool> Checks found inconsistencies in some released artifacts, see https://builds.apache.org/job/dist-tool-plugin/site/dist-tool-check-errors.html for more information
        at org.apache.maven.dist.tools.DistCheckErrorsMojo.executeReport(DistCheckErrorsMojo.java:112)
        at org.apache.maven.reporting.AbstractMavenReport.generate(AbstractMavenReport.java:255)
        at org.apache.maven.plugins.site.render.ReportDocumentRenderer.renderDocument(ReportDocumentRenderer.java:230)
        at org.apache.maven.doxia.siterenderer.DefaultSiteRenderer.render(DefaultSiteRenderer.java:349)
        at org.apache.maven.plugins.site.render.SiteMojo.renderLocale(SiteMojo.java:184)
        at org.apache.maven.plugins.site.render.SiteMojo.execute(SiteMojo.java:133)
        ... 33 more
[ERROR]
[ERROR] Re-run Maven using the -X switch to enable full debug logging.
[ERROR]
[ERROR] For more information about the errors and possible solutions, please read the following articles:
[ERROR] [Help 1] http://cwiki.apache.org/confluence/display/MAVEN/MojoExecutionException
[JENKINS] Archiving <https://builds.apache.org/job/dist-tool-plugin/ws/pom.xml> to org.apache.maven.dist.tools/dist-tool-plugin/1.0-SNAPSHOT/dist-tool-plugin-1.0-SNAPSHOT.pom
[JENKINS] Archiving <https://builds.apache.org/job/dist-tool-plugin/ws/target/dist-tool-plugin-1.0-SNAPSHOT.jar> to org.apache.maven.dist.tools/dist-tool-plugin/1.0-SNAPSHOT/dist-tool-plugin-1.0-SNAPSHOT.jar
channel stopped
Reply | Threaded
Open this post in threaded view
|

Build failed in Jenkins: dist-tool-plugin #2140

Apache Jenkins Server-2
See <https://builds.apache.org/job/dist-tool-plugin/2140/display/redirect>

------------------------------------------
[...truncated 65.92 KB...]
[INFO]   maven-filtering
[INFO]   maven-invoker
[INFO]   maven-jarsigner
[INFO]   maven-mapping
[INFO]   maven-repository-builder
[INFO]   maven-runtime
[INFO]   maven-script-interpreter
[INFO]   maven-shared-incremental
[INFO]   maven-shared-jar
[INFO]   maven-shared-resources
[INFO]   maven-shared-utils
[INFO]   maven-shared-io
[INFO]   maven-verifier
[INFO] /shared: org.apache.maven http://maven.apache.org/shared/
[INFO]   maven-archiver
[INFO] > maven-skins index-path = /skins/
[INFO] /skins: org.apache.maven.skins http://maven.apache.org/skins/
[INFO]   maven-default-skin
[INFO]   maven-fluido-skin
[INFO] /surefire: org.apache.maven.surefire
[INFO]   surefire
[INFO] /wagon: org.apache.maven.wagon
[INFO]   wagon
[INFO]
[INFO] Generating "Dist Tool> Check Index Pages" report --- dist-tool-plugin:1.0-SNAPSHOT:check-index-page
[INFO] > dist-area = http://www.apache.org/dist/maven/
[INFO] /archetype: org.apache.maven.archetype
[INFO]   maven-archetype
[INFO] /binaries: content.not.checked
[INFO] /doxia: org.apache.maven.doxia
[INFO]   doxia
[INFO]   doxia-converter
[INFO]   doxia-linkcheck
[INFO]   doxia-sitetools
[INFO] /enforcer: org.apache.maven.enforcer
[INFO]   enforcer
[INFO] /indexer: org.apache.maven.indexer
[INFO]   maven-indexer
[INFO] /maven-3: org.apache.maven src+bin
[INFO]   apache-maven [3.0,3.1.0-alpha-1)
[INFO]   apache-maven [3.1.0,3.2.0-alpha-1)
[INFO]   apache-maven
[INFO] /jxr: org.apache.maven.jxr
[INFO]   jxr
[INFO] /plugin-testing: org.apache.maven.plugin-testing
[INFO]   maven-plugin-testing
[INFO] /plugin-tools: org.apache.maven.plugin-tools
[INFO]   maven-plugin-tools
[INFO] /plugins: org.apache.maven.plugins http://maven.apache.org/plugins/
[INFO]   maven-acr-plugin
[INFO]   maven-ant-plugin
[INFO]   maven-antrun-plugin
[INFO]   * maven-archetype-plugin
[INFO]   maven-assembly-plugin
[INFO]   maven-changelog-plugin
[INFO]   maven-changes-plugin
[INFO]   maven-checkstyle-plugin
[INFO]   maven-clean-plugin
[INFO]   maven-compiler-plugin
[INFO]   maven-dependency-plugin
[INFO]   maven-deploy-plugin
[INFO]   maven-doap-plugin
[INFO]   maven-docck-plugin
[INFO]   maven-ear-plugin
[INFO]   maven-ejb-plugin
[INFO]   * maven-enforcer-plugin
[INFO]   * maven-failsafe-plugin
[INFO]   maven-gpg-plugin
[INFO]   maven-help-plugin
[INFO]   maven-install-plugin
[INFO]   maven-invoker-plugin
[INFO]   maven-jar-plugin
[INFO]   maven-jarsigner-plugin
[INFO]   maven-javadoc-plugin
[INFO]   maven-jdeps-plugin
[INFO]   maven-jdeprscan-plugin
[INFO]   maven-jlink-plugin
[INFO]   maven-jmod-plugin
[INFO]   * maven-jxr-plugin
[INFO]   maven-linkcheck-plugin
[INFO]   maven-patch-plugin
[INFO]   maven-pdf-plugin
[INFO]   * maven-plugin-plugin
[INFO]   maven-pmd-plugin
[INFO]   maven-project-info-reports-plugin
[INFO]   maven-rar-plugin
[INFO]   * maven-release-plugin  
[INFO]   maven-remote-resources-plugin
[INFO]   maven-repository-plugin
[INFO]   maven-resources-plugin
[INFO]   * maven-scm-plugin
[INFO]   maven-scm-publish-plugin
[INFO]   maven-shade-plugin
[INFO]   maven-site-plugin
[INFO]   maven-source-plugin
[INFO]   maven-stage-plugin
[INFO]   * maven-surefire-plugin
[INFO]   * maven-surefire-report-plugin
[INFO]   maven-toolchains-plugin
[INFO]   maven-verifier-plugin
[INFO]   maven-war-plugin
[INFO] /pom: org.apache http://maven.apache.org/pom/
[INFO] > apache index-path = /asf/
[INFO] > apache site = http://maven.apache.org/pom/asf/
[INFO]   apache
[INFO] /pom: org.apache.maven http://maven.apache.org/pom/
[INFO] > maven-parent index-path = /maven/
[INFO] > maven-parent site = http://maven.apache.org/pom/maven/
[INFO]   maven-parent
[INFO] /release: org.apache.maven.release
[INFO]   maven-release (,3)
[INFO] /reporting: org.apache.maven.reporting http://maven.apache.org/shared/
[INFO]   maven-reporting-api
[INFO]   maven-reporting-exec
[INFO]   maven-reporting-impl
[INFO] /resolver: org.apache.maven.resolver
[INFO]   maven-resolver
[INFO] /resources: org.apache.apache.resources
[INFO] > apache-source-release-assembly-descriptor site = http://maven.apache.org/apache-resource-bundles/
[INFO]   apache-source-release-assembly-descriptor
[INFO] /resources: org.apache
[INFO] > apache-incubator-disclaimer-resource-bundle site = http://maven.apache.org/apache-resource-bundles/
[INFO]   apache-incubator-disclaimer-resource-bundle (,1.1]
[INFO] > apache-jar-resource-bundle site = http://maven.apache.org/apache-resource-bundles/
[INFO]   apache-jar-resource-bundle (,1.4]
[INFO] > apache-license-header-resource-bundle site = http://maven.apache.org/apache-resource-bundles/
[INFO]   apache-license-header-resource-bundle (,1.1]
[INFO] /scm: org.apache.maven.scm
[INFO]   maven-scm
[INFO] /shared: org.apache.maven.shared http://maven.apache.org/shared/
[INFO]   file-management
[INFO]   maven-artifact-resolver
[INFO]   maven-common-artifact-filters
[INFO]   maven-dependency-analyzer
[INFO]   maven-dependency-tree
[INFO]   maven-filtering
[INFO]   maven-invoker
[INFO]   maven-jarsigner
[INFO]   maven-mapping
[INFO]   maven-repository-builder
[INFO]   maven-runtime
[INFO]   maven-script-interpreter
[INFO]   maven-shared-incremental
[INFO]   maven-shared-jar
[INFO]   maven-shared-resources
[INFO]   maven-shared-utils
[INFO]   maven-shared-io
[INFO]   maven-verifier
[INFO] /shared: org.apache.maven http://maven.apache.org/shared/
[INFO]   maven-archiver
[INFO] > maven-skins index-path = /skins/
[INFO] /skins: org.apache.maven.skins http://maven.apache.org/skins/
[INFO]   maven-default-skin
[INFO]   maven-fluido-skin
[INFO] /surefire: org.apache.maven.surefire
[INFO]   surefire
[INFO] /wagon: org.apache.maven.wagon
[INFO]   wagon
[INFO]
[ERROR] maven-jar-plugin: found 3.0.2 instead of 3.1.0 in http://maven.apache.org/plugins/
[INFO] Generating "Dist Tool> Check Errors" report --- dist-tool-plugin:1.0-SNAPSHOT:check-errors
[INFO] Generating "Dist Tool> List Plugins Prerequisites" report --- dist-tool-plugin:1.0-SNAPSHOT:list-plugins-prerequisites
[INFO] Generating "Dist Tool> Failure Hack" report --- dist-tool-plugin:1.0-SNAPSHOT:failure-report
[ERROR] check-source-release.log error log not empty:
Missing file for apache-maven in http://www.apache.org/dist/maven/maven-3/3.0.5/source
 > apache-maven-3.0.5-src.zip.md5 <
Missing file for apache-maven in http://www.apache.org/dist/maven/maven-3/3.1.1/source
 > apache-maven-3.1.1-src.zip.md5 <
Missing file for apache-maven in http://www.apache.org/dist/maven/maven-3/3.5.3/source
 > apache-maven-3.5.3-src.zip.md5 <
Missing file for maven-jar-plugin in http://www.apache.org/dist/maven/plugins
 > maven-jar-plugin-3.1.0-source-release.zip <
 > maven-jar-plugin-3.1.0-source-release.zip.asc <
 > maven-jar-plugin-3.1.0-source-release.zip.md5 <
Different version than 3.1.0 for maven-jar-plugin available in http://www.apache.org/dist/maven/plugins
 > maven-jar-plugin-3.0.2-source-release.zip <
 > maven-jar-plugin-3.0.2-source-release.zip.asc <
 > maven-jar-plugin-3.0.2-source-release.zip.md5 <
 > maven-jar-plugin-3.0.2-source-release.zip.sha256 <
 > maven-jar-plugin-3.0.2-source-release.zip.sha512 <

[ERROR] check-index-page.log error log not empty:
maven-jar-plugin: found 3.0.2 instead of 3.1.0 in http://maven.apache.org/plugins/

[JENKINS] Archiving site from <https://builds.apache.org/job/dist-tool-plugin/ws/target/site> to /x1/jenkins/jenkins-home/jobs/dist-tool-plugin/site
[INFO] ------------------------------------------------------------------------
[INFO] BUILD FAILURE
[INFO] ------------------------------------------------------------------------
[INFO] Total time: 03:59 min
[INFO] Finished at: 2018-04-10T09:55:24+00:00
[INFO] Final Memory: 93M/920M
[INFO] ------------------------------------------------------------------------
[WARNING] The requested profile "apache.snapshots" could not be activated because it does not exist.
Waiting for Jenkins to finish collecting data
[ERROR] Failed to execute goal org.apache.maven.plugins:maven-site-plugin:3.7:site (default-site) on project dist-tool-plugin: Error generating dist-tool-plugin:1.0-SNAPSHOT:failure-report report: Dist Tool> Checks found inconsistencies in some released artifacts, see https://builds.apache.org/job/dist-tool-plugin/site/dist-tool-check-errors.html for more information -> [Help 1]
org.apache.maven.lifecycle.LifecycleExecutionException: Failed to execute goal org.apache.maven.plugins:maven-site-plugin:3.7:site (default-site) on project dist-tool-plugin: Error generating dist-tool-plugin:1.0-SNAPSHOT:failure-report report
        at org.apache.maven.lifecycle.internal.MojoExecutor.execute(MojoExecutor.java:212)
        at org.apache.maven.lifecycle.internal.MojoExecutor.execute(MojoExecutor.java:153)
        at org.apache.maven.lifecycle.internal.MojoExecutor.execute(MojoExecutor.java:145)
        at org.apache.maven.lifecycle.internal.LifecycleModuleBuilder.buildProject(LifecycleModuleBuilder.java:116)
        at org.apache.maven.lifecycle.internal.LifecycleModuleBuilder.buildProject(LifecycleModuleBuilder.java:80)
        at org.apache.maven.lifecycle.internal.builder.singlethreaded.SingleThreadedBuilder.build(SingleThreadedBuilder.java:51)
        at org.apache.maven.lifecycle.internal.LifecycleStarter.execute(LifecycleStarter.java:128)
        at org.apache.maven.DefaultMaven.doExecute(DefaultMaven.java:307)
        at org.apache.maven.DefaultMaven.doExecute(DefaultMaven.java:193)
        at org.apache.maven.DefaultMaven.execute(DefaultMaven.java:106)
        at org.jvnet.hudson.maven3.launcher.Maven33Launcher.main(Maven33Launcher.java:129)
        at sun.reflect.NativeMethodAccessorImpl.invoke0(Native Method)
        at sun.reflect.NativeMethodAccessorImpl.invoke(NativeMethodAccessorImpl.java:62)
        at sun.reflect.DelegatingMethodAccessorImpl.invoke(DelegatingMethodAccessorImpl.java:43)
        at java.lang.reflect.Method.invoke(Method.java:498)
        at org.codehaus.plexus.classworlds.launcher.Launcher.launchStandard(Launcher.java:330)
        at org.codehaus.plexus.classworlds.launcher.Launcher.launch(Launcher.java:238)
        at jenkins.maven3.agent.Maven33Main.launch(Maven33Main.java:176)
        at sun.reflect.NativeMethodAccessorImpl.invoke0(Native Method)
        at sun.reflect.NativeMethodAccessorImpl.invoke(NativeMethodAccessorImpl.java:62)
        at sun.reflect.DelegatingMethodAccessorImpl.invoke(DelegatingMethodAccessorImpl.java:43)
        at java.lang.reflect.Method.invoke(Method.java:498)
        at hudson.maven.Maven3Builder.call(Maven3Builder.java:139)
        at hudson.maven.Maven3Builder.call(Maven3Builder.java:70)
        at hudson.remoting.UserRequest.perform(UserRequest.java:207)
        at hudson.remoting.UserRequest.perform(UserRequest.java:53)
        at hudson.remoting.Request$2.run(Request.java:358)
        at hudson.remoting.InterceptingExecutorService$1.call(InterceptingExecutorService.java:72)
        at java.util.concurrent.FutureTask.run(FutureTask.java:266)
        at java.util.concurrent.ThreadPoolExecutor.runWorker(ThreadPoolExecutor.java:1149)
        at java.util.concurrent.ThreadPoolExecutor$Worker.run(ThreadPoolExecutor.java:624)
        at java.lang.Thread.run(Thread.java:748)
Caused by: org.apache.maven.plugin.MojoExecutionException: Error generating dist-tool-plugin:1.0-SNAPSHOT:failure-report report
        at org.apache.maven.plugins.site.render.SiteMojo.execute(SiteMojo.java:141)
        at org.apache.maven.plugin.DefaultBuildPluginManager.executeMojo(DefaultBuildPluginManager.java:134)
        at org.apache.maven.lifecycle.internal.MojoExecutor.execute(MojoExecutor.java:207)
        ... 31 more
Caused by: org.apache.maven.reporting.MavenReportException: Dist Tool> Checks found inconsistencies in some released artifacts, see https://builds.apache.org/job/dist-tool-plugin/site/dist-tool-check-errors.html for more information
        at org.apache.maven.dist.tools.DistCheckErrorsMojo.executeReport(DistCheckErrorsMojo.java:112)
        at org.apache.maven.reporting.AbstractMavenReport.generate(AbstractMavenReport.java:255)
        at org.apache.maven.plugins.site.render.ReportDocumentRenderer.renderDocument(ReportDocumentRenderer.java:230)
        at org.apache.maven.doxia.siterenderer.DefaultSiteRenderer.render(DefaultSiteRenderer.java:349)
        at org.apache.maven.plugins.site.render.SiteMojo.renderLocale(SiteMojo.java:184)
        at org.apache.maven.plugins.site.render.SiteMojo.execute(SiteMojo.java:133)
        ... 33 more
[ERROR]
[ERROR] Re-run Maven using the -X switch to enable full debug logging.
[ERROR]
[ERROR] For more information about the errors and possible solutions, please read the following articles:
[ERROR] [Help 1] http://cwiki.apache.org/confluence/display/MAVEN/MojoExecutionException
[JENKINS] Archiving <https://builds.apache.org/job/dist-tool-plugin/ws/pom.xml> to org.apache.maven.dist.tools/dist-tool-plugin/1.0-SNAPSHOT/dist-tool-plugin-1.0-SNAPSHOT.pom
[JENKINS] Archiving <https://builds.apache.org/job/dist-tool-plugin/ws/target/dist-tool-plugin-1.0-SNAPSHOT.jar> to org.apache.maven.dist.tools/dist-tool-plugin/1.0-SNAPSHOT/dist-tool-plugin-1.0-SNAPSHOT.jar
channel stopped
Reply | Threaded
Open this post in threaded view
|

Build failed in Jenkins: dist-tool-plugin #2141

Apache Jenkins Server-2
See <https://builds.apache.org/job/dist-tool-plugin/2141/display/redirect>

------------------------------------------
[...truncated 61.65 KB...]
[INFO]   maven-filtering
[INFO]   maven-invoker
[INFO]   maven-jarsigner
[INFO]   maven-mapping
[INFO]   maven-repository-builder
[INFO]   maven-runtime
[INFO]   maven-script-interpreter
[INFO]   maven-shared-incremental
[INFO]   maven-shared-jar
[INFO]   maven-shared-resources
[INFO]   maven-shared-utils
[INFO]   maven-shared-io
[INFO]   maven-verifier
[INFO] /shared: org.apache.maven http://maven.apache.org/shared/
[INFO]   maven-archiver
[INFO] > maven-skins index-path = /skins/
[INFO] /skins: org.apache.maven.skins http://maven.apache.org/skins/
[INFO]   maven-default-skin
[INFO]   maven-fluido-skin
[INFO] /surefire: org.apache.maven.surefire
[INFO]   surefire
[INFO] /wagon: org.apache.maven.wagon
[INFO]   wagon
[INFO]
[INFO] Generating "Dist Tool> Check Index Pages" report --- dist-tool-plugin:1.0-SNAPSHOT:check-index-page
[INFO] > dist-area = http://www.apache.org/dist/maven/
[INFO] /archetype: org.apache.maven.archetype
[INFO]   maven-archetype
[INFO] /binaries: content.not.checked
[INFO] /doxia: org.apache.maven.doxia
[INFO]   doxia
[INFO]   doxia-converter
[INFO]   doxia-linkcheck
[INFO]   doxia-sitetools
[INFO] /enforcer: org.apache.maven.enforcer
[INFO]   enforcer
[INFO] /indexer: org.apache.maven.indexer
[INFO]   maven-indexer
[INFO] /maven-3: org.apache.maven src+bin
[INFO]   apache-maven [3.0,3.1.0-alpha-1)
[INFO]   apache-maven [3.1.0,3.2.0-alpha-1)
[INFO]   apache-maven
[INFO] /jxr: org.apache.maven.jxr
[INFO]   jxr
[INFO] /plugin-testing: org.apache.maven.plugin-testing
[INFO]   maven-plugin-testing
[INFO] /plugin-tools: org.apache.maven.plugin-tools
[INFO]   maven-plugin-tools
[INFO] /plugins: org.apache.maven.plugins http://maven.apache.org/plugins/
[INFO]   maven-acr-plugin
[INFO]   maven-ant-plugin
[INFO]   maven-antrun-plugin
[INFO]   * maven-archetype-plugin
[INFO]   maven-assembly-plugin
[INFO]   maven-changelog-plugin
[INFO]   maven-changes-plugin
[INFO]   maven-checkstyle-plugin
[INFO]   maven-clean-plugin
[INFO]   maven-compiler-plugin
[INFO]   maven-dependency-plugin
[INFO]   maven-deploy-plugin
[INFO]   maven-doap-plugin
[INFO]   maven-docck-plugin
[INFO]   maven-ear-plugin
[INFO]   maven-ejb-plugin
[INFO]   * maven-enforcer-plugin
[INFO]   * maven-failsafe-plugin
[INFO]   maven-gpg-plugin
[INFO]   maven-help-plugin
[INFO]   maven-install-plugin
[INFO]   maven-invoker-plugin
[INFO]   maven-jar-plugin
[INFO]   maven-jarsigner-plugin
[INFO]   maven-javadoc-plugin
[INFO]   maven-jdeps-plugin
[INFO]   maven-jdeprscan-plugin
[INFO]   maven-jlink-plugin
[INFO]   maven-jmod-plugin
[INFO]   * maven-jxr-plugin
[INFO]   maven-linkcheck-plugin
[INFO]   maven-patch-plugin
[INFO]   maven-pdf-plugin
[INFO]   * maven-plugin-plugin
[INFO]   maven-pmd-plugin
[INFO]   maven-project-info-reports-plugin
[INFO]   maven-rar-plugin
[INFO]   * maven-release-plugin  
[INFO]   maven-remote-resources-plugin
[INFO]   maven-repository-plugin
[INFO]   maven-resources-plugin
[INFO]   * maven-scm-plugin
[INFO]   maven-scm-publish-plugin
[INFO]   maven-shade-plugin
[INFO]   maven-site-plugin
[INFO]   maven-source-plugin
[INFO]   maven-stage-plugin
[INFO]   * maven-surefire-plugin
[INFO]   * maven-surefire-report-plugin
[INFO]   maven-toolchains-plugin
[INFO]   maven-verifier-plugin
[INFO]   maven-war-plugin
[INFO] /pom: org.apache http://maven.apache.org/pom/
[INFO] > apache index-path = /asf/
[INFO] > apache site = http://maven.apache.org/pom/asf/
[INFO]   apache
[INFO] /pom: org.apache.maven http://maven.apache.org/pom/
[INFO] > maven-parent index-path = /maven/
[INFO] > maven-parent site = http://maven.apache.org/pom/maven/
[INFO]   maven-parent
[INFO] /release: org.apache.maven.release
[INFO]   maven-release (,3)
[INFO] /reporting: org.apache.maven.reporting http://maven.apache.org/shared/
[INFO]   maven-reporting-api
[INFO]   maven-reporting-exec
[INFO]   maven-reporting-impl
[INFO] /resolver: org.apache.maven.resolver
[INFO]   maven-resolver
[INFO] /resources: org.apache.apache.resources
[INFO] > apache-source-release-assembly-descriptor site = http://maven.apache.org/apache-resource-bundles/
[INFO]   apache-source-release-assembly-descriptor
[INFO] /resources: org.apache
[INFO] > apache-incubator-disclaimer-resource-bundle site = http://maven.apache.org/apache-resource-bundles/
[INFO]   apache-incubator-disclaimer-resource-bundle (,1.1]
[INFO] > apache-jar-resource-bundle site = http://maven.apache.org/apache-resource-bundles/
[INFO]   apache-jar-resource-bundle (,1.4]
[INFO] > apache-license-header-resource-bundle site = http://maven.apache.org/apache-resource-bundles/
[INFO]   apache-license-header-resource-bundle (,1.1]
[INFO] /scm: org.apache.maven.scm
[INFO]   maven-scm
[INFO] /shared: org.apache.maven.shared http://maven.apache.org/shared/
[INFO]   file-management
[INFO]   maven-artifact-resolver
[INFO]   maven-common-artifact-filters
[INFO]   maven-dependency-analyzer
[INFO]   maven-dependency-tree
[INFO]   maven-filtering
[INFO]   maven-invoker
[INFO]   maven-jarsigner
[INFO]   maven-mapping
[INFO]   maven-repository-builder
[INFO]   maven-runtime
[INFO]   maven-script-interpreter
[INFO]   maven-shared-incremental
[INFO]   maven-shared-jar
[INFO]   maven-shared-resources
[INFO]   maven-shared-utils
[INFO]   maven-shared-io
[INFO]   maven-verifier
[INFO] /shared: org.apache.maven http://maven.apache.org/shared/
[INFO]   maven-archiver
[INFO] > maven-skins index-path = /skins/
[INFO] /skins: org.apache.maven.skins http://maven.apache.org/skins/
[INFO]   maven-default-skin
[INFO]   maven-fluido-skin
[INFO] /surefire: org.apache.maven.surefire
[INFO]   surefire
[INFO] /wagon: org.apache.maven.wagon
[INFO]   wagon
[INFO]
[ERROR] maven-jar-plugin: found 3.0.2 instead of 3.1.0 in http://maven.apache.org/plugins/
[INFO] Generating "Dist Tool> Check Errors" report --- dist-tool-plugin:1.0-SNAPSHOT:check-errors
[INFO] Generating "Dist Tool> List Plugins Prerequisites" report --- dist-tool-plugin:1.0-SNAPSHOT:list-plugins-prerequisites
[INFO] Generating "Dist Tool> Failure Hack" report --- dist-tool-plugin:1.0-SNAPSHOT:failure-report
[ERROR] check-source-release.log error log not empty:
Missing file for apache-maven in http://www.apache.org/dist/maven/maven-3/3.0.5/source
 > apache-maven-3.0.5-src.zip.md5 <
Missing file for apache-maven in http://www.apache.org/dist/maven/maven-3/3.1.1/source
 > apache-maven-3.1.1-src.zip.md5 <
Missing file for apache-maven in http://www.apache.org/dist/maven/maven-3/3.5.3/source
 > apache-maven-3.5.3-src.zip.md5 <
Missing file for maven-jar-plugin in http://www.apache.org/dist/maven/plugins
 > maven-jar-plugin-3.1.0-source-release.zip <
 > maven-jar-plugin-3.1.0-source-release.zip.asc <
 > maven-jar-plugin-3.1.0-source-release.zip.md5 <
Different version than 3.1.0 for maven-jar-plugin available in http://www.apache.org/dist/maven/plugins
 > maven-jar-plugin-3.0.2-source-release.zip <
 > maven-jar-plugin-3.0.2-source-release.zip.asc <
 > maven-jar-plugin-3.0.2-source-release.zip.md5 <
 > maven-jar-plugin-3.0.2-source-release.zip.sha256 <
 > maven-jar-plugin-3.0.2-source-release.zip.sha512 <

[ERROR] check-index-page.log error log not empty:
maven-jar-plugin: found 3.0.2 instead of 3.1.0 in http://maven.apache.org/plugins/

[JENKINS] Archiving site from <https://builds.apache.org/job/dist-tool-plugin/ws/target/site> to /x1/jenkins/jenkins-home/jobs/dist-tool-plugin/site
[INFO] ------------------------------------------------------------------------
[INFO] BUILD FAILURE
[INFO] ------------------------------------------------------------------------
[INFO] Total time: 03:58 min
[INFO] Finished at: 2018-04-11T09:55:23+00:00
[INFO] Final Memory: 97M/814M
[INFO] ------------------------------------------------------------------------
[WARNING] The requested profile "apache.snapshots" could not be activated because it does not exist.
[ERROR] Failed to execute goal org.apache.maven.plugins:maven-site-plugin:3.7:site (default-site) on project dist-tool-plugin: Error generating dist-tool-plugin:1.0-SNAPSHOT:failure-report report: Dist Tool> Checks found inconsistencies in some released artifacts, see https://builds.apache.org/job/dist-tool-plugin/site/dist-tool-check-errors.html for more information -> [Help 1]
org.apache.maven.lifecycle.LifecycleExecutionException: Failed to execute goal org.apache.maven.plugins:maven-site-plugin:3.7:site (default-site) on project dist-tool-plugin: Error generating dist-tool-plugin:1.0-SNAPSHOT:failure-report report
        at org.apache.maven.lifecycle.internal.MojoExecutor.execute(MojoExecutor.java:212)
        at org.apache.maven.lifecycle.internal.MojoExecutor.execute(MojoExecutor.java:153)
        at org.apache.maven.lifecycle.internal.MojoExecutor.execute(MojoExecutor.java:145)
        at org.apache.maven.lifecycle.internal.LifecycleModuleBuilder.buildProject(LifecycleModuleBuilder.java:116)
        at org.apache.maven.lifecycle.internal.LifecycleModuleBuilder.buildProject(LifecycleModuleBuilder.java:80)
        at org.apache.maven.lifecycle.internal.builder.singlethreaded.SingleThreadedBuilder.build(SingleThreadedBuilder.java:51)
        at org.apache.maven.lifecycle.internal.LifecycleStarter.execute(LifecycleStarter.java:128)
        at org.apache.maven.DefaultMaven.doExecute(DefaultMaven.java:307)
        at org.apache.maven.DefaultMaven.doExecute(DefaultMaven.java:193)
        at org.apache.maven.DefaultMaven.execute(DefaultMaven.java:106)
        at org.jvnet.hudson.maven3.launcher.Maven33Launcher.main(Maven33Launcher.java:129)
        at sun.reflect.NativeMethodAccessorImpl.invoke0(Native Method)
        at sun.reflect.NativeMethodAccessorImpl.invoke(NativeMethodAccessorImpl.java:62)
        at sun.reflect.DelegatingMethodAccessorImpl.invoke(DelegatingMethodAccessorImpl.java:43)
        at java.lang.reflect.Method.invoke(Method.java:498)
        at org.codehaus.plexus.classworlds.launcher.Launcher.launchStandard(Launcher.java:330)
        at org.codehaus.plexus.classworlds.launcher.Launcher.launch(Launcher.java:238)
        at jenkins.maven3.agent.Maven33Main.launch(Maven33Main.java:176)
        at sun.reflect.NativeMethodAccessorImpl.invoke0(Native Method)
        at sun.reflect.NativeMethodAccessorImpl.invoke(NativeMethodAccessorImpl.java:62)
        at sun.reflect.DelegatingMethodAccessorImpl.invoke(DelegatingMethodAccessorImpl.java:43)
        at java.lang.reflect.Method.invoke(Method.java:498)
        at hudson.maven.Maven3Builder.call(Maven3Builder.java:139)
        at hudson.maven.Maven3Builder.call(Maven3Builder.java:70)
        at hudson.remoting.UserRequest.perform(UserRequest.java:207)
        at hudson.remoting.UserRequest.perform(UserRequest.java:53)
        at hudson.remoting.Request$2.run(Request.java:358)
        at hudson.remoting.InterceptingExecutorService$1.call(InterceptingExecutorService.java:72)
        at java.util.concurrent.FutureTask.run(FutureTask.java:266)
        at java.util.concurrent.ThreadPoolExecutor.runWorker(ThreadPoolExecutor.java:1149)
        at java.util.concurrent.ThreadPoolExecutor$Worker.run(ThreadPoolExecutor.java:624)
        at java.lang.Thread.run(Thread.java:748)
Caused by: org.apache.maven.plugin.MojoExecutionException: Error generating dist-tool-plugin:1.0-SNAPSHOT:failure-report report
        at org.apache.maven.plugins.site.render.SiteMojo.execute(SiteMojo.java:141)
        at org.apache.maven.plugin.DefaultBuildPluginManager.executeMojo(DefaultBuildPluginManager.java:134)
        at org.apache.maven.lifecycle.internal.MojoExecutor.execute(MojoExecutor.java:207)
        ... 31 more
Caused by: org.apache.maven.reporting.MavenReportException: Dist Tool> Checks found inconsistencies in some released artifacts, see https://builds.apache.org/job/dist-tool-plugin/site/dist-tool-check-errors.html for more information
        at org.apache.maven.dist.tools.DistCheckErrorsMojo.executeReport(DistCheckErrorsMojo.java:112)
        at org.apache.maven.reporting.AbstractMavenReport.generate(AbstractMavenReport.java:255)
        at org.apache.maven.plugins.site.render.ReportDocumentRenderer.renderDocument(ReportDocumentRenderer.java:230)
        at org.apache.maven.doxia.siterenderer.DefaultSiteRenderer.render(DefaultSiteRenderer.java:349)
        at org.apache.maven.plugins.site.render.SiteMojo.renderLocale(SiteMojo.java:184)
        at org.apache.maven.plugins.site.render.SiteMojo.execute(SiteMojo.java:133)
        ... 33 more
[ERROR]
[ERROR] Re-run Maven using the -X switch to enable full debug logging.
[ERROR]
[ERROR] For more information about the errors and possible solutions, please read the following articles:
[ERROR] [Help 1] http://cwiki.apache.org/confluence/display/MAVEN/MojoExecutionException
Waiting for Jenkins to finish collecting data
[JENKINS] Archiving <https://builds.apache.org/job/dist-tool-plugin/ws/pom.xml> to org.apache.maven.dist.tools/dist-tool-plugin/1.0-SNAPSHOT/dist-tool-plugin-1.0-SNAPSHOT.pom
[JENKINS] Archiving <https://builds.apache.org/job/dist-tool-plugin/ws/target/dist-tool-plugin-1.0-SNAPSHOT.jar> to org.apache.maven.dist.tools/dist-tool-plugin/1.0-SNAPSHOT/dist-tool-plugin-1.0-SNAPSHOT.jar
channel stopped
Reply | Threaded
Open this post in threaded view
|

Build failed in Jenkins: dist-tool-plugin #2142

Apache Jenkins Server-2
See <https://builds.apache.org/job/dist-tool-plugin/2142/display/redirect>

------------------------------------------
[...truncated 62.77 KB...]
[INFO]   maven-filtering
[INFO]   maven-invoker
[INFO]   maven-jarsigner
[INFO]   maven-mapping
[INFO]   maven-repository-builder
[INFO]   maven-runtime
[INFO]   maven-script-interpreter
[INFO]   maven-shared-incremental
[INFO]   maven-shared-jar
[INFO]   maven-shared-resources
[INFO]   maven-shared-utils
[INFO]   maven-shared-io
[INFO]   maven-verifier
[INFO] /shared: org.apache.maven http://maven.apache.org/shared/
[INFO]   maven-archiver
[INFO] > maven-skins index-path = /skins/
[INFO] /skins: org.apache.maven.skins http://maven.apache.org/skins/
[INFO]   maven-default-skin
[INFO]   maven-fluido-skin
[INFO] /surefire: org.apache.maven.surefire
[INFO]   surefire
[INFO] /wagon: org.apache.maven.wagon
[INFO]   wagon
[INFO]
[INFO] Generating "Dist Tool> Check Index Pages" report --- dist-tool-plugin:1.0-SNAPSHOT:check-index-page
[INFO] > dist-area = http://www.apache.org/dist/maven/
[INFO] /archetype: org.apache.maven.archetype
[INFO]   maven-archetype
[INFO] /binaries: content.not.checked
[INFO] /doxia: org.apache.maven.doxia
[INFO]   doxia
[INFO]   doxia-converter
[INFO]   doxia-linkcheck
[INFO]   doxia-sitetools
[INFO] /enforcer: org.apache.maven.enforcer
[INFO]   enforcer
[INFO] /indexer: org.apache.maven.indexer
[INFO]   maven-indexer
[INFO] /maven-3: org.apache.maven src+bin
[INFO]   apache-maven [3.0,3.1.0-alpha-1)
[INFO]   apache-maven [3.1.0,3.2.0-alpha-1)
[INFO]   apache-maven
[INFO] /jxr: org.apache.maven.jxr
[INFO]   jxr
[INFO] /plugin-testing: org.apache.maven.plugin-testing
[INFO]   maven-plugin-testing
[INFO] /plugin-tools: org.apache.maven.plugin-tools
[INFO]   maven-plugin-tools
[INFO] /plugins: org.apache.maven.plugins http://maven.apache.org/plugins/
[INFO]   maven-acr-plugin
[INFO]   maven-ant-plugin
[INFO]   maven-antrun-plugin
[INFO]   * maven-archetype-plugin
[INFO]   maven-assembly-plugin
[INFO]   maven-changelog-plugin
[INFO]   maven-changes-plugin
[INFO]   maven-checkstyle-plugin
[INFO]   maven-clean-plugin
[INFO]   maven-compiler-plugin
[INFO]   maven-dependency-plugin
[INFO]   maven-deploy-plugin
[INFO]   maven-doap-plugin
[INFO]   maven-docck-plugin
[INFO]   maven-ear-plugin
[INFO]   maven-ejb-plugin
[INFO]   * maven-enforcer-plugin
[INFO]   * maven-failsafe-plugin
[INFO]   maven-gpg-plugin
[INFO]   maven-help-plugin
[INFO]   maven-install-plugin
[INFO]   maven-invoker-plugin
[INFO]   maven-jar-plugin
[INFO]   maven-jarsigner-plugin
[INFO]   maven-javadoc-plugin
[INFO]   maven-jdeps-plugin
[INFO]   maven-jdeprscan-plugin
[INFO]   maven-jlink-plugin
[INFO]   maven-jmod-plugin
[INFO]   * maven-jxr-plugin
[INFO]   maven-linkcheck-plugin
[INFO]   maven-patch-plugin
[INFO]   maven-pdf-plugin
[INFO]   * maven-plugin-plugin
[INFO]   maven-pmd-plugin
[INFO]   maven-project-info-reports-plugin
[INFO]   maven-rar-plugin
[INFO]   * maven-release-plugin  
[INFO]   maven-remote-resources-plugin
[INFO]   maven-repository-plugin
[INFO]   maven-resources-plugin
[INFO]   * maven-scm-plugin
[INFO]   maven-scm-publish-plugin
[INFO]   maven-shade-plugin
[INFO]   maven-site-plugin
[INFO]   maven-source-plugin
[INFO]   maven-stage-plugin
[INFO]   * maven-surefire-plugin
[INFO]   * maven-surefire-report-plugin
[INFO]   maven-toolchains-plugin
[INFO]   maven-verifier-plugin
[INFO]   maven-war-plugin
[INFO] /pom: org.apache http://maven.apache.org/pom/
[INFO] > apache index-path = /asf/
[INFO] > apache site = http://maven.apache.org/pom/asf/
[INFO]   apache
[INFO] /pom: org.apache.maven http://maven.apache.org/pom/
[INFO] > maven-parent index-path = /maven/
[INFO] > maven-parent site = http://maven.apache.org/pom/maven/
[INFO]   maven-parent
[INFO] /release: org.apache.maven.release
[INFO]   maven-release (,3)
[INFO] /reporting: org.apache.maven.reporting http://maven.apache.org/shared/
[INFO]   maven-reporting-api
[INFO]   maven-reporting-exec
[INFO]   maven-reporting-impl
[INFO] /resolver: org.apache.maven.resolver
[INFO]   maven-resolver
[INFO] /resources: org.apache.apache.resources
[INFO] > apache-source-release-assembly-descriptor site = http://maven.apache.org/apache-resource-bundles/
[INFO]   apache-source-release-assembly-descriptor
[INFO] /resources: org.apache
[INFO] > apache-incubator-disclaimer-resource-bundle site = http://maven.apache.org/apache-resource-bundles/
[INFO]   apache-incubator-disclaimer-resource-bundle (,1.1]
[INFO] > apache-jar-resource-bundle site = http://maven.apache.org/apache-resource-bundles/
[INFO]   apache-jar-resource-bundle (,1.4]
[INFO] > apache-license-header-resource-bundle site = http://maven.apache.org/apache-resource-bundles/
[INFO]   apache-license-header-resource-bundle (,1.1]
[INFO] /scm: org.apache.maven.scm
[INFO]   maven-scm
[INFO] /shared: org.apache.maven.shared http://maven.apache.org/shared/
[INFO]   file-management
[INFO]   maven-artifact-resolver
[INFO]   maven-common-artifact-filters
[INFO]   maven-dependency-analyzer
[INFO]   maven-dependency-tree
[INFO]   maven-filtering
[INFO]   maven-invoker
[INFO]   maven-jarsigner
[INFO]   maven-mapping
[INFO]   maven-repository-builder
[INFO]   maven-runtime
[INFO]   maven-script-interpreter
[INFO]   maven-shared-incremental
[INFO]   maven-shared-jar
[INFO]   maven-shared-resources
[INFO]   maven-shared-utils
[INFO]   maven-shared-io
[INFO]   maven-verifier
[INFO] /shared: org.apache.maven http://maven.apache.org/shared/
[INFO]   maven-archiver
[INFO] > maven-skins index-path = /skins/
[INFO] /skins: org.apache.maven.skins http://maven.apache.org/skins/
[INFO]   maven-default-skin
[INFO]   maven-fluido-skin
[INFO] /surefire: org.apache.maven.surefire
[INFO]   surefire
[INFO] /wagon: org.apache.maven.wagon
[INFO]   wagon
[INFO]
[ERROR] maven-jar-plugin: found 3.0.2 instead of 3.1.0 in http://maven.apache.org/plugins/
[INFO] Generating "Dist Tool> Check Errors" report --- dist-tool-plugin:1.0-SNAPSHOT:check-errors
[INFO] Generating "Dist Tool> List Plugins Prerequisites" report --- dist-tool-plugin:1.0-SNAPSHOT:list-plugins-prerequisites
[INFO] Generating "Dist Tool> Failure Hack" report --- dist-tool-plugin:1.0-SNAPSHOT:failure-report
[ERROR] check-source-release.log error log not empty:
Missing file for apache-maven in http://www.apache.org/dist/maven/maven-3/3.0.5/source
 > apache-maven-3.0.5-src.zip.md5 <
Missing file for apache-maven in http://www.apache.org/dist/maven/maven-3/3.1.1/source
 > apache-maven-3.1.1-src.zip.md5 <
Missing file for apache-maven in http://www.apache.org/dist/maven/maven-3/3.5.3/source
 > apache-maven-3.5.3-src.zip.md5 <
Missing file for maven-jar-plugin in http://www.apache.org/dist/maven/plugins
 > maven-jar-plugin-3.1.0-source-release.zip <
 > maven-jar-plugin-3.1.0-source-release.zip.asc <
 > maven-jar-plugin-3.1.0-source-release.zip.md5 <
Different version than 3.1.0 for maven-jar-plugin available in http://www.apache.org/dist/maven/plugins
 > maven-jar-plugin-3.0.2-source-release.zip <
 > maven-jar-plugin-3.0.2-source-release.zip.asc <
 > maven-jar-plugin-3.0.2-source-release.zip.md5 <
 > maven-jar-plugin-3.0.2-source-release.zip.sha256 <
 > maven-jar-plugin-3.0.2-source-release.zip.sha512 <

[ERROR] check-index-page.log error log not empty:
maven-jar-plugin: found 3.0.2 instead of 3.1.0 in http://maven.apache.org/plugins/

[JENKINS] Archiving site from <https://builds.apache.org/job/dist-tool-plugin/ws/target/site> to /x1/jenkins/jenkins-home/jobs/dist-tool-plugin/site
[INFO] ------------------------------------------------------------------------
[INFO] BUILD FAILURE
[INFO] ------------------------------------------------------------------------
[INFO] Total time: 03:51 min
[INFO] Finished at: 2018-04-12T09:55:16+00:00
[INFO] Final Memory: 97M/800M
[INFO] ------------------------------------------------------------------------
[WARNING] The requested profile "apache.snapshots" could not be activated because it does not exist.
Waiting for Jenkins to finish collecting data
[ERROR] Failed to execute goal org.apache.maven.plugins:maven-site-plugin:3.7:site (default-site) on project dist-tool-plugin: Error generating dist-tool-plugin:1.0-SNAPSHOT:failure-report report: Dist Tool> Checks found inconsistencies in some released artifacts, see https://builds.apache.org/job/dist-tool-plugin/site/dist-tool-check-errors.html for more information -> [Help 1]
org.apache.maven.lifecycle.LifecycleExecutionException: Failed to execute goal org.apache.maven.plugins:maven-site-plugin:3.7:site (default-site) on project dist-tool-plugin: Error generating dist-tool-plugin:1.0-SNAPSHOT:failure-report report
        at org.apache.maven.lifecycle.internal.MojoExecutor.execute(MojoExecutor.java:212)
        at org.apache.maven.lifecycle.internal.MojoExecutor.execute(MojoExecutor.java:153)
        at org.apache.maven.lifecycle.internal.MojoExecutor.execute(MojoExecutor.java:145)
        at org.apache.maven.lifecycle.internal.LifecycleModuleBuilder.buildProject(LifecycleModuleBuilder.java:116)
        at org.apache.maven.lifecycle.internal.LifecycleModuleBuilder.buildProject(LifecycleModuleBuilder.java:80)
        at org.apache.maven.lifecycle.internal.builder.singlethreaded.SingleThreadedBuilder.build(SingleThreadedBuilder.java:51)
        at org.apache.maven.lifecycle.internal.LifecycleStarter.execute(LifecycleStarter.java:128)
        at org.apache.maven.DefaultMaven.doExecute(DefaultMaven.java:307)
        at org.apache.maven.DefaultMaven.doExecute(DefaultMaven.java:193)
        at org.apache.maven.DefaultMaven.execute(DefaultMaven.java:106)
        at org.jvnet.hudson.maven3.launcher.Maven33Launcher.main(Maven33Launcher.java:129)
        at sun.reflect.NativeMethodAccessorImpl.invoke0(Native Method)
        at sun.reflect.NativeMethodAccessorImpl.invoke(NativeMethodAccessorImpl.java:62)
        at sun.reflect.DelegatingMethodAccessorImpl.invoke(DelegatingMethodAccessorImpl.java:43)
        at java.lang.reflect.Method.invoke(Method.java:498)
        at org.codehaus.plexus.classworlds.launcher.Launcher.launchStandard(Launcher.java:330)
        at org.codehaus.plexus.classworlds.launcher.Launcher.launch(Launcher.java:238)
        at jenkins.maven3.agent.Maven33Main.launch(Maven33Main.java:176)
        at sun.reflect.NativeMethodAccessorImpl.invoke0(Native Method)
        at sun.reflect.NativeMethodAccessorImpl.invoke(NativeMethodAccessorImpl.java:62)
        at sun.reflect.DelegatingMethodAccessorImpl.invoke(DelegatingMethodAccessorImpl.java:43)
        at java.lang.reflect.Method.invoke(Method.java:498)
        at hudson.maven.Maven3Builder.call(Maven3Builder.java:139)
        at hudson.maven.Maven3Builder.call(Maven3Builder.java:70)
        at hudson.remoting.UserRequest.perform(UserRequest.java:207)
        at hudson.remoting.UserRequest.perform(UserRequest.java:53)
        at hudson.remoting.Request$2.run(Request.java:358)
        at hudson.remoting.InterceptingExecutorService$1.call(InterceptingExecutorService.java:72)
        at java.util.concurrent.FutureTask.run(FutureTask.java:266)
        at java.util.concurrent.ThreadPoolExecutor.runWorker(ThreadPoolExecutor.java:1149)
        at java.util.concurrent.ThreadPoolExecutor$Worker.run(ThreadPoolExecutor.java:624)
        at java.lang.Thread.run(Thread.java:748)
Caused by: org.apache.maven.plugin.MojoExecutionException: Error generating dist-tool-plugin:1.0-SNAPSHOT:failure-report report
        at org.apache.maven.plugins.site.render.SiteMojo.execute(SiteMojo.java:141)
        at org.apache.maven.plugin.DefaultBuildPluginManager.executeMojo(DefaultBuildPluginManager.java:134)
        at org.apache.maven.lifecycle.internal.MojoExecutor.execute(MojoExecutor.java:207)
        ... 31 more
Caused by: org.apache.maven.reporting.MavenReportException: Dist Tool> Checks found inconsistencies in some released artifacts, see https://builds.apache.org/job/dist-tool-plugin/site/dist-tool-check-errors.html for more information
        at org.apache.maven.dist.tools.DistCheckErrorsMojo.executeReport(DistCheckErrorsMojo.java:112)
        at org.apache.maven.reporting.AbstractMavenReport.generate(AbstractMavenReport.java:255)
        at org.apache.maven.plugins.site.render.ReportDocumentRenderer.renderDocument(ReportDocumentRenderer.java:230)
        at org.apache.maven.doxia.siterenderer.DefaultSiteRenderer.render(DefaultSiteRenderer.java:349)
        at org.apache.maven.plugins.site.render.SiteMojo.renderLocale(SiteMojo.java:184)
        at org.apache.maven.plugins.site.render.SiteMojo.execute(SiteMojo.java:133)
        ... 33 more
[ERROR]
[ERROR] Re-run Maven using the -X switch to enable full debug logging.
[ERROR]
[ERROR] For more information about the errors and possible solutions, please read the following articles:
[ERROR] [Help 1] http://cwiki.apache.org/confluence/display/MAVEN/MojoExecutionException
[JENKINS] Archiving <https://builds.apache.org/job/dist-tool-plugin/ws/pom.xml> to org.apache.maven.dist.tools/dist-tool-plugin/1.0-SNAPSHOT/dist-tool-plugin-1.0-SNAPSHOT.pom
[JENKINS] Archiving <https://builds.apache.org/job/dist-tool-plugin/ws/target/dist-tool-plugin-1.0-SNAPSHOT.jar> to org.apache.maven.dist.tools/dist-tool-plugin/1.0-SNAPSHOT/dist-tool-plugin-1.0-SNAPSHOT.jar
channel stopped
Reply | Threaded
Open this post in threaded view
|

Build failed in Jenkins: dist-tool-plugin #2143

Apache Jenkins Server-2
See <https://builds.apache.org/job/dist-tool-plugin/2143/display/redirect>

------------------------------------------
[...truncated 63.79 KB...]
[INFO]   maven-filtering
[INFO]   maven-invoker
[INFO]   maven-jarsigner
[INFO]   maven-mapping
[INFO]   maven-repository-builder
[INFO]   maven-runtime
[INFO]   maven-script-interpreter
[INFO]   maven-shared-incremental
[INFO]   maven-shared-jar
[INFO]   maven-shared-resources
[INFO]   maven-shared-utils
[INFO]   maven-shared-io
[INFO]   maven-verifier
[INFO] /shared: org.apache.maven http://maven.apache.org/shared/
[INFO]   maven-archiver
[INFO] > maven-skins index-path = /skins/
[INFO] /skins: org.apache.maven.skins http://maven.apache.org/skins/
[INFO]   maven-default-skin
[INFO]   maven-fluido-skin
[INFO] /surefire: org.apache.maven.surefire
[INFO]   surefire
[INFO] /wagon: org.apache.maven.wagon
[INFO]   wagon
[INFO]
[INFO] Generating "Dist Tool> Check Index Pages" report --- dist-tool-plugin:1.0-SNAPSHOT:check-index-page
[INFO] > dist-area = http://www.apache.org/dist/maven/
[INFO] /archetype: org.apache.maven.archetype
[INFO]   maven-archetype
[INFO] /binaries: content.not.checked
[INFO] /doxia: org.apache.maven.doxia
[INFO]   doxia
[INFO]   doxia-converter
[INFO]   doxia-linkcheck
[INFO]   doxia-sitetools
[INFO] /enforcer: org.apache.maven.enforcer
[INFO]   enforcer
[INFO] /indexer: org.apache.maven.indexer
[INFO]   maven-indexer
[INFO] /maven-3: org.apache.maven src+bin
[INFO]   apache-maven [3.0,3.1.0-alpha-1)
[INFO]   apache-maven [3.1.0,3.2.0-alpha-1)
[INFO]   apache-maven
[INFO] /jxr: org.apache.maven.jxr
[INFO]   jxr
[INFO] /plugin-testing: org.apache.maven.plugin-testing
[INFO]   maven-plugin-testing
[INFO] /plugin-tools: org.apache.maven.plugin-tools
[INFO]   maven-plugin-tools
[INFO] /plugins: org.apache.maven.plugins http://maven.apache.org/plugins/
[INFO]   maven-acr-plugin
[INFO]   maven-ant-plugin
[INFO]   maven-antrun-plugin
[INFO]   * maven-archetype-plugin
[INFO]   maven-assembly-plugin
[INFO]   maven-changelog-plugin
[INFO]   maven-changes-plugin
[INFO]   maven-checkstyle-plugin
[INFO]   maven-clean-plugin
[INFO]   maven-compiler-plugin
[INFO]   maven-dependency-plugin
[INFO]   maven-deploy-plugin
[INFO]   maven-doap-plugin
[INFO]   maven-docck-plugin
[INFO]   maven-ear-plugin
[INFO]   maven-ejb-plugin
[INFO]   * maven-enforcer-plugin
[INFO]   * maven-failsafe-plugin
[INFO]   maven-gpg-plugin
[INFO]   maven-help-plugin
[INFO]   maven-install-plugin
[INFO]   maven-invoker-plugin
[INFO]   maven-jar-plugin
[INFO]   maven-jarsigner-plugin
[INFO]   maven-javadoc-plugin
[INFO]   maven-jdeps-plugin
[INFO]   maven-jdeprscan-plugin
[INFO]   maven-jlink-plugin
[INFO]   maven-jmod-plugin
[INFO]   * maven-jxr-plugin
[INFO]   maven-linkcheck-plugin
[INFO]   maven-patch-plugin
[INFO]   maven-pdf-plugin
[INFO]   * maven-plugin-plugin
[INFO]   maven-pmd-plugin
[INFO]   maven-project-info-reports-plugin
[INFO]   maven-rar-plugin
[INFO]   * maven-release-plugin  
[INFO]   maven-remote-resources-plugin
[INFO]   maven-repository-plugin
[INFO]   maven-resources-plugin
[INFO]   * maven-scm-plugin
[INFO]   maven-scm-publish-plugin
[INFO]   maven-shade-plugin
[INFO]   maven-site-plugin
[INFO]   maven-source-plugin
[INFO]   maven-stage-plugin
[INFO]   * maven-surefire-plugin
[INFO]   * maven-surefire-report-plugin
[INFO]   maven-toolchains-plugin
[INFO]   maven-verifier-plugin
[INFO]   maven-war-plugin
[INFO] /pom: org.apache http://maven.apache.org/pom/
[INFO] > apache index-path = /asf/
[INFO] > apache site = http://maven.apache.org/pom/asf/
[INFO]   apache
[INFO] /pom: org.apache.maven http://maven.apache.org/pom/
[INFO] > maven-parent index-path = /maven/
[INFO] > maven-parent site = http://maven.apache.org/pom/maven/
[INFO]   maven-parent
[INFO] /release: org.apache.maven.release
[INFO]   maven-release (,3)
[INFO] /reporting: org.apache.maven.reporting http://maven.apache.org/shared/
[INFO]   maven-reporting-api
[INFO]   maven-reporting-exec
[INFO]   maven-reporting-impl
[INFO] /resolver: org.apache.maven.resolver
[INFO]   maven-resolver
[INFO] /resources: org.apache.apache.resources
[INFO] > apache-source-release-assembly-descriptor site = http://maven.apache.org/apache-resource-bundles/
[INFO]   apache-source-release-assembly-descriptor
[INFO] /resources: org.apache
[INFO] > apache-incubator-disclaimer-resource-bundle site = http://maven.apache.org/apache-resource-bundles/
[INFO]   apache-incubator-disclaimer-resource-bundle (,1.1]
[INFO] > apache-jar-resource-bundle site = http://maven.apache.org/apache-resource-bundles/
[INFO]   apache-jar-resource-bundle (,1.4]
[INFO] > apache-license-header-resource-bundle site = http://maven.apache.org/apache-resource-bundles/
[INFO]   apache-license-header-resource-bundle (,1.1]
[INFO] /scm: org.apache.maven.scm
[INFO]   maven-scm
[INFO] /shared: org.apache.maven.shared http://maven.apache.org/shared/
[INFO]   file-management
[INFO]   maven-artifact-resolver
[INFO]   maven-common-artifact-filters
[INFO]   maven-dependency-analyzer
[INFO]   maven-dependency-tree
[INFO]   maven-filtering
[INFO]   maven-invoker
[INFO]   maven-jarsigner
[INFO]   maven-mapping
[INFO]   maven-repository-builder
[INFO]   maven-runtime
[INFO]   maven-script-interpreter
[INFO]   maven-shared-incremental
[INFO]   maven-shared-jar
[INFO]   maven-shared-resources
[INFO]   maven-shared-utils
[INFO]   maven-shared-io
[INFO]   maven-verifier
[INFO] /shared: org.apache.maven http://maven.apache.org/shared/
[INFO]   maven-archiver
[INFO] > maven-skins index-path = /skins/
[INFO] /skins: org.apache.maven.skins http://maven.apache.org/skins/
[INFO]   maven-default-skin
[INFO]   maven-fluido-skin
[INFO] /surefire: org.apache.maven.surefire
[INFO]   surefire
[INFO] /wagon: org.apache.maven.wagon
[INFO]   wagon
[INFO]
[ERROR] maven-jar-plugin: found 3.0.2 instead of 3.1.0 in http://maven.apache.org/plugins/
[INFO] Generating "Dist Tool> Check Errors" report --- dist-tool-plugin:1.0-SNAPSHOT:check-errors
[INFO] Generating "Dist Tool> List Plugins Prerequisites" report --- dist-tool-plugin:1.0-SNAPSHOT:list-plugins-prerequisites
[INFO] Generating "Dist Tool> Failure Hack" report --- dist-tool-plugin:1.0-SNAPSHOT:failure-report
[ERROR] check-source-release.log error log not empty:
Missing file for apache-maven in http://www.apache.org/dist/maven/maven-3/3.0.5/source
 > apache-maven-3.0.5-src.zip.md5 <
Missing file for apache-maven in http://www.apache.org/dist/maven/maven-3/3.1.1/source
 > apache-maven-3.1.1-src.zip.md5 <
Missing file for apache-maven in http://www.apache.org/dist/maven/maven-3/3.5.3/source
 > apache-maven-3.5.3-src.zip.md5 <
Missing file for maven-jar-plugin in http://www.apache.org/dist/maven/plugins
 > maven-jar-plugin-3.1.0-source-release.zip <
 > maven-jar-plugin-3.1.0-source-release.zip.asc <
 > maven-jar-plugin-3.1.0-source-release.zip.md5 <
Different version than 3.1.0 for maven-jar-plugin available in http://www.apache.org/dist/maven/plugins
 > maven-jar-plugin-3.0.2-source-release.zip <
 > maven-jar-plugin-3.0.2-source-release.zip.asc <
 > maven-jar-plugin-3.0.2-source-release.zip.md5 <
 > maven-jar-plugin-3.0.2-source-release.zip.sha256 <
 > maven-jar-plugin-3.0.2-source-release.zip.sha512 <

[ERROR] check-index-page.log error log not empty:
maven-jar-plugin: found 3.0.2 instead of 3.1.0 in http://maven.apache.org/plugins/

[JENKINS] Archiving site from <https://builds.apache.org/job/dist-tool-plugin/ws/target/site> to /x1/jenkins/jenkins-home/jobs/dist-tool-plugin/site
[INFO] ------------------------------------------------------------------------
[INFO] BUILD FAILURE
[INFO] ------------------------------------------------------------------------
[INFO] Total time: 04:09 min
[INFO] Finished at: 2018-04-13T10:22:11+00:00
[INFO] Final Memory: 96M/772M
[INFO] ------------------------------------------------------------------------
[WARNING] The requested profile "apache.snapshots" could not be activated because it does not exist.
Waiting for Jenkins to finish collecting data
[ERROR] Failed to execute goal org.apache.maven.plugins:maven-site-plugin:3.7:site (default-site) on project dist-tool-plugin: Error generating dist-tool-plugin:1.0-SNAPSHOT:failure-report report: Dist Tool> Checks found inconsistencies in some released artifacts, see https://builds.apache.org/job/dist-tool-plugin/site/dist-tool-check-errors.html for more information -> [Help 1]
org.apache.maven.lifecycle.LifecycleExecutionException: Failed to execute goal org.apache.maven.plugins:maven-site-plugin:3.7:site (default-site) on project dist-tool-plugin: Error generating dist-tool-plugin:1.0-SNAPSHOT:failure-report report
        at org.apache.maven.lifecycle.internal.MojoExecutor.execute(MojoExecutor.java:212)
        at org.apache.maven.lifecycle.internal.MojoExecutor.execute(MojoExecutor.java:153)
        at org.apache.maven.lifecycle.internal.MojoExecutor.execute(MojoExecutor.java:145)
        at org.apache.maven.lifecycle.internal.LifecycleModuleBuilder.buildProject(LifecycleModuleBuilder.java:116)
        at org.apache.maven.lifecycle.internal.LifecycleModuleBuilder.buildProject(LifecycleModuleBuilder.java:80)
        at org.apache.maven.lifecycle.internal.builder.singlethreaded.SingleThreadedBuilder.build(SingleThreadedBuilder.java:51)
        at org.apache.maven.lifecycle.internal.LifecycleStarter.execute(LifecycleStarter.java:128)
        at org.apache.maven.DefaultMaven.doExecute(DefaultMaven.java:307)
        at org.apache.maven.DefaultMaven.doExecute(DefaultMaven.java:193)
        at org.apache.maven.DefaultMaven.execute(DefaultMaven.java:106)
        at org.jvnet.hudson.maven3.launcher.Maven33Launcher.main(Maven33Launcher.java:129)
        at sun.reflect.NativeMethodAccessorImpl.invoke0(Native Method)
        at sun.reflect.NativeMethodAccessorImpl.invoke(NativeMethodAccessorImpl.java:62)
        at sun.reflect.DelegatingMethodAccessorImpl.invoke(DelegatingMethodAccessorImpl.java:43)
        at java.lang.reflect.Method.invoke(Method.java:498)
        at org.codehaus.plexus.classworlds.launcher.Launcher.launchStandard(Launcher.java:330)
        at org.codehaus.plexus.classworlds.launcher.Launcher.launch(Launcher.java:238)
        at jenkins.maven3.agent.Maven33Main.launch(Maven33Main.java:176)
        at sun.reflect.NativeMethodAccessorImpl.invoke0(Native Method)
        at sun.reflect.NativeMethodAccessorImpl.invoke(NativeMethodAccessorImpl.java:62)
        at sun.reflect.DelegatingMethodAccessorImpl.invoke(DelegatingMethodAccessorImpl.java:43)
        at java.lang.reflect.Method.invoke(Method.java:498)
        at hudson.maven.Maven3Builder.call(Maven3Builder.java:139)
        at hudson.maven.Maven3Builder.call(Maven3Builder.java:70)
        at hudson.remoting.UserRequest.perform(UserRequest.java:207)
        at hudson.remoting.UserRequest.perform(UserRequest.java:53)
        at hudson.remoting.Request$2.run(Request.java:358)
        at hudson.remoting.InterceptingExecutorService$1.call(InterceptingExecutorService.java:72)
        at java.util.concurrent.FutureTask.run(FutureTask.java:266)
        at java.util.concurrent.ThreadPoolExecutor.runWorker(ThreadPoolExecutor.java:1149)
        at java.util.concurrent.ThreadPoolExecutor$Worker.run(ThreadPoolExecutor.java:624)
        at java.lang.Thread.run(Thread.java:748)
Caused by: org.apache.maven.plugin.MojoExecutionException: Error generating dist-tool-plugin:1.0-SNAPSHOT:failure-report report
        at org.apache.maven.plugins.site.render.SiteMojo.execute(SiteMojo.java:141)
        at org.apache.maven.plugin.DefaultBuildPluginManager.executeMojo(DefaultBuildPluginManager.java:134)
        at org.apache.maven.lifecycle.internal.MojoExecutor.execute(MojoExecutor.java:207)
        ... 31 more
Caused by: org.apache.maven.reporting.MavenReportException: Dist Tool> Checks found inconsistencies in some released artifacts, see https://builds.apache.org/job/dist-tool-plugin/site/dist-tool-check-errors.html for more information
        at org.apache.maven.dist.tools.DistCheckErrorsMojo.executeReport(DistCheckErrorsMojo.java:112)
        at org.apache.maven.reporting.AbstractMavenReport.generate(AbstractMavenReport.java:255)
        at org.apache.maven.plugins.site.render.ReportDocumentRenderer.renderDocument(ReportDocumentRenderer.java:230)
        at org.apache.maven.doxia.siterenderer.DefaultSiteRenderer.render(DefaultSiteRenderer.java:349)
        at org.apache.maven.plugins.site.render.SiteMojo.renderLocale(SiteMojo.java:184)
        at org.apache.maven.plugins.site.render.SiteMojo.execute(SiteMojo.java:133)
        ... 33 more
[ERROR]
[ERROR] Re-run Maven using the -X switch to enable full debug logging.
[ERROR]
[ERROR] For more information about the errors and possible solutions, please read the following articles:
[ERROR] [Help 1] http://cwiki.apache.org/confluence/display/MAVEN/MojoExecutionException
[JENKINS] Archiving <https://builds.apache.org/job/dist-tool-plugin/ws/pom.xml> to org.apache.maven.dist.tools/dist-tool-plugin/1.0-SNAPSHOT/dist-tool-plugin-1.0-SNAPSHOT.pom
[JENKINS] Archiving <https://builds.apache.org/job/dist-tool-plugin/ws/target/dist-tool-plugin-1.0-SNAPSHOT.jar> to org.apache.maven.dist.tools/dist-tool-plugin/1.0-SNAPSHOT/dist-tool-plugin-1.0-SNAPSHOT.jar
channel stopped
Reply | Threaded
Open this post in threaded view
|

Build failed in Jenkins: dist-tool-plugin #2144

Apache Jenkins Server-2
See <https://builds.apache.org/job/dist-tool-plugin/2144/display/redirect>

------------------------------------------
[...truncated 59.94 KB...]
[INFO]   maven-artifact-resolver
[INFO]   maven-common-artifact-filters
[INFO]   maven-dependency-analyzer
[INFO]   maven-dependency-tree
[INFO]   maven-filtering
[INFO]   maven-invoker
[INFO]   maven-jarsigner
[INFO]   maven-mapping
[INFO]   maven-repository-builder
[INFO]   maven-runtime
[INFO]   maven-script-interpreter
[INFO]   maven-shared-incremental
[INFO]   maven-shared-jar
[INFO]   maven-shared-resources
[INFO]   maven-shared-utils
[INFO]   maven-shared-io
[INFO]   maven-verifier
[INFO] /shared: org.apache.maven http://maven.apache.org/shared/
[INFO]   maven-archiver
[INFO] > maven-skins index-path = /skins/
[INFO] /skins: org.apache.maven.skins http://maven.apache.org/skins/
[INFO]   maven-default-skin
[INFO]   maven-fluido-skin
[INFO] /surefire: org.apache.maven.surefire
[INFO]   surefire
[INFO] /wagon: org.apache.maven.wagon
[INFO]   wagon
[INFO]
[INFO] Generating "Dist Tool> Check Index Pages" report --- dist-tool-plugin:1.0-SNAPSHOT:check-index-page
[INFO] > dist-area = http://www.apache.org/dist/maven/
[INFO] /archetype: org.apache.maven.archetype
[INFO]   maven-archetype
[INFO] /binaries: content.not.checked
[INFO] /doxia: org.apache.maven.doxia
[INFO]   doxia
[INFO]   doxia-converter
[INFO]   doxia-linkcheck
[INFO]   doxia-sitetools
[INFO] /enforcer: org.apache.maven.enforcer
[INFO]   enforcer
[INFO] /indexer: org.apache.maven.indexer
[INFO]   maven-indexer
[INFO] /maven-3: org.apache.maven src+bin
[INFO]   apache-maven [3.0,3.1.0-alpha-1)
[INFO]   apache-maven [3.1.0,3.2.0-alpha-1)
[INFO]   apache-maven
[INFO] /jxr: org.apache.maven.jxr
[INFO]   jxr
[INFO] /plugin-testing: org.apache.maven.plugin-testing
[INFO]   maven-plugin-testing
[INFO] /plugin-tools: org.apache.maven.plugin-tools
[INFO]   maven-plugin-tools
[INFO] /plugins: org.apache.maven.plugins http://maven.apache.org/plugins/
[INFO]   maven-acr-plugin
[INFO]   maven-ant-plugin
[INFO]   maven-antrun-plugin
[INFO]   * maven-archetype-plugin
[INFO]   maven-assembly-plugin
[INFO]   maven-changelog-plugin
[INFO]   maven-changes-plugin
[INFO]   maven-checkstyle-plugin
[INFO]   maven-clean-plugin
[INFO]   maven-compiler-plugin
[INFO]   maven-dependency-plugin
[INFO]   maven-deploy-plugin
[INFO]   maven-doap-plugin
[INFO]   maven-docck-plugin
[INFO]   maven-ear-plugin
[INFO]   maven-ejb-plugin
[INFO]   * maven-enforcer-plugin
[INFO]   * maven-failsafe-plugin
[INFO]   maven-gpg-plugin
[INFO]   maven-help-plugin
[INFO]   maven-install-plugin
[INFO]   maven-invoker-plugin
[INFO]   maven-jar-plugin
[INFO]   maven-jarsigner-plugin
[INFO]   maven-javadoc-plugin
[INFO]   maven-jdeps-plugin
[INFO]   maven-jdeprscan-plugin
[INFO]   maven-jlink-plugin
[INFO]   maven-jmod-plugin
[INFO]   * maven-jxr-plugin
[INFO]   maven-linkcheck-plugin
[INFO]   maven-patch-plugin
[INFO]   maven-pdf-plugin
[INFO]   * maven-plugin-plugin
[INFO]   maven-pmd-plugin
[INFO]   maven-project-info-reports-plugin
[INFO]   maven-rar-plugin
[INFO]   * maven-release-plugin  
[INFO]   maven-remote-resources-plugin
[INFO]   maven-repository-plugin
[INFO]   maven-resources-plugin
[INFO]   * maven-scm-plugin
[INFO]   maven-scm-publish-plugin
[INFO]   maven-shade-plugin
[INFO]   maven-site-plugin
[INFO]   maven-source-plugin
[INFO]   maven-stage-plugin
[INFO]   * maven-surefire-plugin
[INFO]   * maven-surefire-report-plugin
[INFO]   maven-toolchains-plugin
[INFO]   maven-verifier-plugin
[INFO]   maven-war-plugin
[INFO] /pom: org.apache http://maven.apache.org/pom/
[INFO] > apache index-path = /asf/
[INFO] > apache site = http://maven.apache.org/pom/asf/
[INFO]   apache
[INFO] /pom: org.apache.maven http://maven.apache.org/pom/
[INFO] > maven-parent index-path = /maven/
[INFO] > maven-parent site = http://maven.apache.org/pom/maven/
[INFO]   maven-parent
[INFO] /release: org.apache.maven.release
[INFO]   maven-release (,3)
[INFO] /reporting: org.apache.maven.reporting http://maven.apache.org/shared/
[INFO]   maven-reporting-api
[INFO]   maven-reporting-exec
[INFO]   maven-reporting-impl
[INFO] /resolver: org.apache.maven.resolver
[INFO]   maven-resolver
[INFO] /resources: org.apache.apache.resources
[INFO] > apache-source-release-assembly-descriptor site = http://maven.apache.org/apache-resource-bundles/
[INFO]   apache-source-release-assembly-descriptor
[INFO] /resources: org.apache
[INFO] > apache-incubator-disclaimer-resource-bundle site = http://maven.apache.org/apache-resource-bundles/
[INFO]   apache-incubator-disclaimer-resource-bundle (,1.1]
[INFO] > apache-jar-resource-bundle site = http://maven.apache.org/apache-resource-bundles/
[INFO]   apache-jar-resource-bundle (,1.4]
[INFO] > apache-license-header-resource-bundle site = http://maven.apache.org/apache-resource-bundles/
[INFO]   apache-license-header-resource-bundle (,1.1]
[INFO] /scm: org.apache.maven.scm
[INFO]   maven-scm
[INFO] /shared: org.apache.maven.shared http://maven.apache.org/shared/
[INFO]   file-management
[INFO]   maven-artifact-resolver
[INFO]   maven-common-artifact-filters
[INFO]   maven-dependency-analyzer
[INFO]   maven-dependency-tree
[INFO]   maven-filtering
[INFO]   maven-invoker
[INFO]   maven-jarsigner
[INFO]   maven-mapping
[INFO]   maven-repository-builder
[INFO]   maven-runtime
[INFO]   maven-script-interpreter
[INFO]   maven-shared-incremental
[INFO]   maven-shared-jar
[INFO]   maven-shared-resources
[INFO]   maven-shared-utils
[INFO]   maven-shared-io
[INFO]   maven-verifier
[INFO] /shared: org.apache.maven http://maven.apache.org/shared/
[INFO]   maven-archiver
[INFO] > maven-skins index-path = /skins/
[INFO] /skins: org.apache.maven.skins http://maven.apache.org/skins/
[INFO]   maven-default-skin
[INFO]   maven-fluido-skin
[INFO] /surefire: org.apache.maven.surefire
[INFO]   surefire
[INFO] /wagon: org.apache.maven.wagon
[INFO]   wagon
[INFO]
[ERROR] maven-clean-plugin: found 3.0.0 instead of 3.1.0 in http://maven.apache.org/plugins/
[ERROR] maven-jar-plugin: found 3.0.2 instead of 3.1.0 in http://maven.apache.org/plugins/
[INFO] Generating "Dist Tool> Check Errors" report --- dist-tool-plugin:1.0-SNAPSHOT:check-errors
[INFO] Generating "Dist Tool> List Plugins Prerequisites" report --- dist-tool-plugin:1.0-SNAPSHOT:list-plugins-prerequisites
[INFO] Generating "Dist Tool> Failure Hack" report --- dist-tool-plugin:1.0-SNAPSHOT:failure-report
[ERROR] check-source-release.log error log not empty:
Missing file for apache-maven in http://www.apache.org/dist/maven/maven-3/3.0.5/source
 > apache-maven-3.0.5-src.zip.md5 <
Missing file for apache-maven in http://www.apache.org/dist/maven/maven-3/3.1.1/source
 > apache-maven-3.1.1-src.zip.md5 <
Missing file for apache-maven in http://www.apache.org/dist/maven/maven-3/3.5.3/source
 > apache-maven-3.5.3-src.zip.md5 <
Missing file for maven-clean-plugin in http://www.apache.org/dist/maven/plugins
 > maven-clean-plugin-3.1.0-source-release.zip.md5 <
Missing file for maven-jar-plugin in http://www.apache.org/dist/maven/plugins
 > maven-jar-plugin-3.1.0-source-release.zip.md5 <

[ERROR] check-index-page.log error log not empty:
maven-clean-plugin: found 3.0.0 instead of 3.1.0 in http://maven.apache.org/plugins/
maven-jar-plugin: found 3.0.2 instead of 3.1.0 in http://maven.apache.org/plugins/

[JENKINS] Archiving site from <https://builds.apache.org/job/dist-tool-plugin/ws/target/site> to /x1/jenkins/jenkins-home/jobs/dist-tool-plugin/site
[INFO] ------------------------------------------------------------------------
[INFO] BUILD FAILURE
[INFO] ------------------------------------------------------------------------
[INFO] Total time: 03:18 min
[INFO] Finished at: 2018-04-14T09:54:50+00:00
[INFO] Final Memory: 97M/838M
[INFO] ------------------------------------------------------------------------
[WARNING] The requested profile "apache.snapshots" could not be activated because it does not exist.
Waiting for Jenkins to finish collecting data
[ERROR] Failed to execute goal org.apache.maven.plugins:maven-site-plugin:3.7:site (default-site) on project dist-tool-plugin: Error generating dist-tool-plugin:1.0-SNAPSHOT:failure-report report: Dist Tool> Checks found inconsistencies in some released artifacts, see https://builds.apache.org/job/dist-tool-plugin/site/dist-tool-check-errors.html for more information -> [Help 1]
org.apache.maven.lifecycle.LifecycleExecutionException: Failed to execute goal org.apache.maven.plugins:maven-site-plugin:3.7:site (default-site) on project dist-tool-plugin: Error generating dist-tool-plugin:1.0-SNAPSHOT:failure-report report
        at org.apache.maven.lifecycle.internal.MojoExecutor.execute(MojoExecutor.java:212)
        at org.apache.maven.lifecycle.internal.MojoExecutor.execute(MojoExecutor.java:153)
        at org.apache.maven.lifecycle.internal.MojoExecutor.execute(MojoExecutor.java:145)
        at org.apache.maven.lifecycle.internal.LifecycleModuleBuilder.buildProject(LifecycleModuleBuilder.java:116)
        at org.apache.maven.lifecycle.internal.LifecycleModuleBuilder.buildProject(LifecycleModuleBuilder.java:80)
        at org.apache.maven.lifecycle.internal.builder.singlethreaded.SingleThreadedBuilder.build(SingleThreadedBuilder.java:51)
        at org.apache.maven.lifecycle.internal.LifecycleStarter.execute(LifecycleStarter.java:128)
        at org.apache.maven.DefaultMaven.doExecute(DefaultMaven.java:307)
        at org.apache.maven.DefaultMaven.doExecute(DefaultMaven.java:193)
        at org.apache.maven.DefaultMaven.execute(DefaultMaven.java:106)
        at org.jvnet.hudson.maven3.launcher.Maven33Launcher.main(Maven33Launcher.java:129)
        at sun.reflect.NativeMethodAccessorImpl.invoke0(Native Method)
        at sun.reflect.NativeMethodAccessorImpl.invoke(NativeMethodAccessorImpl.java:62)
        at sun.reflect.DelegatingMethodAccessorImpl.invoke(DelegatingMethodAccessorImpl.java:43)
        at java.lang.reflect.Method.invoke(Method.java:498)
        at org.codehaus.plexus.classworlds.launcher.Launcher.launchStandard(Launcher.java:330)
        at org.codehaus.plexus.classworlds.launcher.Launcher.launch(Launcher.java:238)
        at jenkins.maven3.agent.Maven33Main.launch(Maven33Main.java:176)
        at sun.reflect.NativeMethodAccessorImpl.invoke0(Native Method)
        at sun.reflect.NativeMethodAccessorImpl.invoke(NativeMethodAccessorImpl.java:62)
        at sun.reflect.DelegatingMethodAccessorImpl.invoke(DelegatingMethodAccessorImpl.java:43)
        at java.lang.reflect.Method.invoke(Method.java:498)
        at hudson.maven.Maven3Builder.call(Maven3Builder.java:139)
        at hudson.maven.Maven3Builder.call(Maven3Builder.java:70)
        at hudson.remoting.UserRequest.perform(UserRequest.java:207)
        at hudson.remoting.UserRequest.perform(UserRequest.java:53)
        at hudson.remoting.Request$2.run(Request.java:358)
        at hudson.remoting.InterceptingExecutorService$1.call(InterceptingExecutorService.java:72)
        at java.util.concurrent.FutureTask.run(FutureTask.java:266)
        at java.util.concurrent.ThreadPoolExecutor.runWorker(ThreadPoolExecutor.java:1149)
        at java.util.concurrent.ThreadPoolExecutor$Worker.run(ThreadPoolExecutor.java:624)
        at java.lang.Thread.run(Thread.java:748)
Caused by: org.apache.maven.plugin.MojoExecutionException: Error generating dist-tool-plugin:1.0-SNAPSHOT:failure-report report
        at org.apache.maven.plugins.site.render.SiteMojo.execute(SiteMojo.java:141)
        at org.apache.maven.plugin.DefaultBuildPluginManager.executeMojo(DefaultBuildPluginManager.java:134)
        at org.apache.maven.lifecycle.internal.MojoExecutor.execute(MojoExecutor.java:207)
        ... 31 more
Caused by: org.apache.maven.reporting.MavenReportException: Dist Tool> Checks found inconsistencies in some released artifacts, see https://builds.apache.org/job/dist-tool-plugin/site/dist-tool-check-errors.html for more information
        at org.apache.maven.dist.tools.DistCheckErrorsMojo.executeReport(DistCheckErrorsMojo.java:112)
        at org.apache.maven.reporting.AbstractMavenReport.generate(AbstractMavenReport.java:255)
        at org.apache.maven.plugins.site.render.ReportDocumentRenderer.renderDocument(ReportDocumentRenderer.java:230)
        at org.apache.maven.doxia.siterenderer.DefaultSiteRenderer.render(DefaultSiteRenderer.java:349)
        at org.apache.maven.plugins.site.render.SiteMojo.renderLocale(SiteMojo.java:184)
        at org.apache.maven.plugins.site.render.SiteMojo.execute(SiteMojo.java:133)
        ... 33 more
[ERROR]
[ERROR] Re-run Maven using the -X switch to enable full debug logging.
[ERROR]
[ERROR] For more information about the errors and possible solutions, please read the following articles:
[ERROR] [Help 1] http://cwiki.apache.org/confluence/display/MAVEN/MojoExecutionException
[JENKINS] Archiving <https://builds.apache.org/job/dist-tool-plugin/ws/pom.xml> to org.apache.maven.dist.tools/dist-tool-plugin/1.0-SNAPSHOT/dist-tool-plugin-1.0-SNAPSHOT.pom
[JENKINS] Archiving <https://builds.apache.org/job/dist-tool-plugin/ws/target/dist-tool-plugin-1.0-SNAPSHOT.jar> to org.apache.maven.dist.tools/dist-tool-plugin/1.0-SNAPSHOT/dist-tool-plugin-1.0-SNAPSHOT.jar
channel stopped
Reply | Threaded
Open this post in threaded view
|

Build failed in Jenkins: dist-tool-plugin #2145

Apache Jenkins Server-2
See <https://builds.apache.org/job/dist-tool-plugin/2145/display/redirect>

------------------------------------------
[...truncated 59.27 KB...]
[WARNING]  > apache-license-header-resource-bundle-1.1-source-release.zip <
[WARNING]  > apache-license-header-resource-bundle-1.1-source-release.zip.asc <
[WARNING]  > apache-license-header-resource-bundle-1.1-source-release.zip.md5 <
[INFO] /scm: org.apache.maven.scm
[INFO]   maven-scm
[INFO] /shared: org.apache.maven.shared http://maven.apache.org/shared/
[INFO]   file-management
[INFO]   maven-artifact-resolver
[INFO]   maven-common-artifact-filters
[INFO]   maven-dependency-analyzer
[INFO]   maven-dependency-tree
[INFO]   maven-filtering
[INFO]   maven-invoker
[INFO]   maven-jarsigner
[INFO]   maven-mapping
[INFO]   maven-repository-builder
[INFO]   maven-runtime
[INFO]   maven-script-interpreter
[INFO]   maven-shared-incremental
[INFO]   maven-shared-jar
[INFO]   maven-shared-resources
[INFO]   maven-shared-utils
[INFO]   maven-shared-io
[INFO]   maven-verifier
[INFO] /shared: org.apache.maven http://maven.apache.org/shared/
[INFO]   maven-archiver
[INFO] > maven-skins index-path = /skins/
[INFO] /skins: org.apache.maven.skins http://maven.apache.org/skins/
[INFO]   maven-default-skin
[INFO]   maven-fluido-skin
[INFO] /surefire: org.apache.maven.surefire
[INFO]   surefire
[INFO] /wagon: org.apache.maven.wagon
[INFO]   wagon
[INFO]
[INFO] Generating "Dist Tool> Check Index Pages" report --- dist-tool-plugin:1.0-SNAPSHOT:check-index-page
[INFO] > dist-area = http://www.apache.org/dist/maven/
[INFO] /archetype: org.apache.maven.archetype
[INFO]   maven-archetype
[INFO] /binaries: content.not.checked
[INFO] /doxia: org.apache.maven.doxia
[INFO]   doxia
[INFO]   doxia-converter
[INFO]   doxia-linkcheck
[INFO]   doxia-sitetools
[INFO] /enforcer: org.apache.maven.enforcer
[INFO]   enforcer
[INFO] /indexer: org.apache.maven.indexer
[INFO]   maven-indexer
[INFO] /maven-3: org.apache.maven src+bin
[INFO]   apache-maven [3.0,3.1.0-alpha-1)
[INFO]   apache-maven [3.1.0,3.2.0-alpha-1)
[INFO]   apache-maven
[INFO] /jxr: org.apache.maven.jxr
[INFO]   jxr
[INFO] /plugin-testing: org.apache.maven.plugin-testing
[INFO]   maven-plugin-testing
[INFO] /plugin-tools: org.apache.maven.plugin-tools
[INFO]   maven-plugin-tools
[INFO] /plugins: org.apache.maven.plugins http://maven.apache.org/plugins/
[INFO]   maven-acr-plugin
[INFO]   maven-ant-plugin
[INFO]   maven-antrun-plugin
[INFO]   * maven-archetype-plugin
[INFO]   maven-assembly-plugin
[INFO]   maven-changelog-plugin
[INFO]   maven-changes-plugin
[INFO]   maven-checkstyle-plugin
[INFO]   maven-clean-plugin
[INFO]   maven-compiler-plugin
[INFO]   maven-dependency-plugin
[INFO]   maven-deploy-plugin
[INFO]   maven-doap-plugin
[INFO]   maven-docck-plugin
[INFO]   maven-ear-plugin
[INFO]   maven-ejb-plugin
[INFO]   * maven-enforcer-plugin
[INFO]   * maven-failsafe-plugin
[INFO]   maven-gpg-plugin
[INFO]   maven-help-plugin
[INFO]   maven-install-plugin
[INFO]   maven-invoker-plugin
[INFO]   maven-jar-plugin
[INFO]   maven-jarsigner-plugin
[INFO]   maven-javadoc-plugin
[INFO]   maven-jdeps-plugin
[INFO]   maven-jdeprscan-plugin
[INFO]   maven-jlink-plugin
[INFO]   maven-jmod-plugin
[INFO]   * maven-jxr-plugin
[INFO]   maven-linkcheck-plugin
[INFO]   maven-patch-plugin
[INFO]   maven-pdf-plugin
[INFO]   * maven-plugin-plugin
[INFO]   maven-pmd-plugin
[INFO]   maven-project-info-reports-plugin
[INFO]   maven-rar-plugin
[INFO]   * maven-release-plugin  
[INFO]   maven-remote-resources-plugin
[INFO]   maven-repository-plugin
[INFO]   maven-resources-plugin
[INFO]   * maven-scm-plugin
[INFO]   maven-scm-publish-plugin
[INFO]   maven-shade-plugin
[INFO]   maven-site-plugin
[INFO]   maven-source-plugin
[INFO]   maven-stage-plugin
[INFO]   * maven-surefire-plugin
[INFO]   * maven-surefire-report-plugin
[INFO]   maven-toolchains-plugin
[INFO]   maven-verifier-plugin
[INFO]   maven-war-plugin
[INFO] /pom: org.apache http://maven.apache.org/pom/
[INFO] > apache index-path = /asf/
[INFO] > apache site = http://maven.apache.org/pom/asf/
[INFO]   apache
[INFO] /pom: org.apache.maven http://maven.apache.org/pom/
[INFO] > maven-parent index-path = /maven/
[INFO] > maven-parent site = http://maven.apache.org/pom/maven/
[INFO]   maven-parent
[INFO] /release: org.apache.maven.release
[INFO]   maven-release (,3)
[INFO] /reporting: org.apache.maven.reporting http://maven.apache.org/shared/
[INFO]   maven-reporting-api
[INFO]   maven-reporting-exec
[INFO]   maven-reporting-impl
[INFO] /resolver: org.apache.maven.resolver
[INFO]   maven-resolver
[INFO] /resources: org.apache.apache.resources
[INFO] > apache-source-release-assembly-descriptor site = http://maven.apache.org/apache-resource-bundles/
[INFO]   apache-source-release-assembly-descriptor
[INFO] /resources: org.apache
[INFO] > apache-incubator-disclaimer-resource-bundle site = http://maven.apache.org/apache-resource-bundles/
[INFO]   apache-incubator-disclaimer-resource-bundle (,1.1]
[INFO] > apache-jar-resource-bundle site = http://maven.apache.org/apache-resource-bundles/
[INFO]   apache-jar-resource-bundle (,1.4]
[INFO] > apache-license-header-resource-bundle site = http://maven.apache.org/apache-resource-bundles/
[INFO]   apache-license-header-resource-bundle (,1.1]
[INFO] /scm: org.apache.maven.scm
[INFO]   maven-scm
[INFO] /shared: org.apache.maven.shared http://maven.apache.org/shared/
[INFO]   file-management
[INFO]   maven-artifact-resolver
[INFO]   maven-common-artifact-filters
[INFO]   maven-dependency-analyzer
[INFO]   maven-dependency-tree
[INFO]   maven-filtering
[INFO]   maven-invoker
[INFO]   maven-jarsigner
[INFO]   maven-mapping
[INFO]   maven-repository-builder
[INFO]   maven-runtime
[INFO]   maven-script-interpreter
[INFO]   maven-shared-incremental
[INFO]   maven-shared-jar
[INFO]   maven-shared-resources
[INFO]   maven-shared-utils
[INFO]   maven-shared-io
[INFO]   maven-verifier
[INFO] /shared: org.apache.maven http://maven.apache.org/shared/
[INFO]   maven-archiver
[INFO] > maven-skins index-path = /skins/
[INFO] /skins: org.apache.maven.skins http://maven.apache.org/skins/
[INFO]   maven-default-skin
[INFO]   maven-fluido-skin
[INFO] /surefire: org.apache.maven.surefire
[INFO]   surefire
[INFO] /wagon: org.apache.maven.wagon
[INFO]   wagon
[INFO]
[INFO] Generating "Dist Tool> Check Errors" report --- dist-tool-plugin:1.0-SNAPSHOT:check-errors
[INFO] Generating "Dist Tool> List Plugins Prerequisites" report --- dist-tool-plugin:1.0-SNAPSHOT:list-plugins-prerequisites
[INFO] Generating "Dist Tool> Failure Hack" report --- dist-tool-plugin:1.0-SNAPSHOT:failure-report
[ERROR] check-source-release.log error log not empty:
Missing file for apache-maven in http://www.apache.org/dist/maven/maven-3/3.0.5/source
 > apache-maven-3.0.5-src.zip.md5 <
Missing file for apache-maven in http://www.apache.org/dist/maven/maven-3/3.1.1/source
 > apache-maven-3.1.1-src.zip.md5 <
Missing file for apache-maven in http://www.apache.org/dist/maven/maven-3/3.5.3/source
 > apache-maven-3.5.3-src.zip.md5 <
Missing file for maven-clean-plugin in http://www.apache.org/dist/maven/plugins
 > maven-clean-plugin-3.1.0-source-release.zip.md5 <
Missing file for maven-jar-plugin in http://www.apache.org/dist/maven/plugins
 > maven-jar-plugin-3.1.0-source-release.zip.md5 <

[JENKINS] Archiving site from <https://builds.apache.org/job/dist-tool-plugin/ws/target/site> to /x1/jenkins/jenkins-home/jobs/dist-tool-plugin/site
[INFO] ------------------------------------------------------------------------
[INFO] BUILD FAILURE
[INFO] ------------------------------------------------------------------------
[INFO] Total time: 02:53 min
[INFO] Finished at: 2018-04-14T19:54:52+00:00
[INFO] Final Memory: 96M/878M
[INFO] ------------------------------------------------------------------------
[WARNING] The requested profile "apache.snapshots" could not be activated because it does not exist.
[ERROR] Failed to execute goal org.apache.maven.plugins:maven-site-plugin:3.7:site (default-site) on project dist-tool-plugin: Error generating dist-tool-plugin:1.0-SNAPSHOT:failure-report report: Dist Tool> Checks found inconsistencies in some released artifacts, see https://builds.apache.org/job/dist-tool-plugin/site/dist-tool-check-errors.html for more information -> [Help 1]
org.apache.maven.lifecycle.LifecycleExecutionException: Failed to execute goal org.apache.maven.plugins:maven-site-plugin:3.7:site (default-site) on project dist-tool-plugin: Error generating dist-tool-plugin:1.0-SNAPSHOT:failure-report report
        at org.apache.maven.lifecycle.internal.MojoExecutor.execute(MojoExecutor.java:212)
        at org.apache.maven.lifecycle.internal.MojoExecutor.execute(MojoExecutor.java:153)
        at org.apache.maven.lifecycle.internal.MojoExecutor.execute(MojoExecutor.java:145)
        at org.apache.maven.lifecycle.internal.LifecycleModuleBuilder.buildProject(LifecycleModuleBuilder.java:116)
        at org.apache.maven.lifecycle.internal.LifecycleModuleBuilder.buildProject(LifecycleModuleBuilder.java:80)
        at org.apache.maven.lifecycle.internal.builder.singlethreaded.SingleThreadedBuilder.build(SingleThreadedBuilder.java:51)
        at org.apache.maven.lifecycle.internal.LifecycleStarter.execute(LifecycleStarter.java:128)
        at org.apache.maven.DefaultMaven.doExecute(DefaultMaven.java:307)
        at org.apache.maven.DefaultMaven.doExecute(DefaultMaven.java:193)
        at org.apache.maven.DefaultMaven.execute(DefaultMaven.java:106)
        at org.jvnet.hudson.maven3.launcher.Maven33Launcher.main(Maven33Launcher.java:129)
        at sun.reflect.NativeMethodAccessorImpl.invoke0(Native Method)
        at sun.reflect.NativeMethodAccessorImpl.invoke(NativeMethodAccessorImpl.java:62)
        at sun.reflect.DelegatingMethodAccessorImpl.invoke(DelegatingMethodAccessorImpl.java:43)
        at java.lang.reflect.Method.invoke(Method.java:498)
        at org.codehaus.plexus.classworlds.launcher.Launcher.launchStandard(Launcher.java:330)
        at org.codehaus.plexus.classworlds.launcher.Launcher.launch(Launcher.java:238)
        at jenkins.maven3.agent.Maven33Main.launch(Maven33Main.java:176)
        at sun.reflect.NativeMethodAccessorImpl.invoke0(Native Method)
        at sun.reflect.NativeMethodAccessorImpl.invoke(NativeMethodAccessorImpl.java:62)
        at sun.reflect.DelegatingMethodAccessorImpl.invoke(DelegatingMethodAccessorImpl.java:43)
        at java.lang.reflect.Method.invoke(Method.java:498)
        at hudson.maven.Maven3Builder.call(Maven3Builder.java:139)
        at hudson.maven.Maven3Builder.call(Maven3Builder.java:70)
        at hudson.remoting.UserRequest.perform(UserRequest.java:207)
        at hudson.remoting.UserRequest.perform(UserRequest.java:53)
        at hudson.remoting.Request$2.run(Request.java:358)
        at hudson.remoting.InterceptingExecutorService$1.call(InterceptingExecutorService.java:72)
        at java.util.concurrent.FutureTask.run(FutureTask.java:266)
        at java.util.concurrent.ThreadPoolExecutor.runWorker(ThreadPoolExecutor.java:1149)
        at java.util.concurrent.ThreadPoolExecutor$Worker.run(ThreadPoolExecutor.java:624)
        at java.lang.Thread.run(Thread.java:748)
Caused by: org.apache.maven.plugin.MojoExecutionException: Error generating dist-tool-plugin:1.0-SNAPSHOT:failure-report report
        at org.apache.maven.plugins.site.render.SiteMojo.execute(SiteMojo.java:141)
        at org.apache.maven.plugin.DefaultBuildPluginManager.executeMojo(DefaultBuildPluginManager.java:134)
        at org.apache.maven.lifecycle.internal.MojoExecutor.execute(MojoExecutor.java:207)
        ... 31 more
Caused by: org.apache.maven.reporting.MavenReportException: Dist Tool> Checks found inconsistencies in some released artifacts, see https://builds.apache.org/job/dist-tool-plugin/site/dist-tool-check-errors.html for more information
        at org.apache.maven.dist.tools.DistCheckErrorsMojo.executeReport(DistCheckErrorsMojo.java:112)
        at org.apache.maven.reporting.AbstractMavenReport.generate(AbstractMavenReport.java:255)
        at org.apache.maven.plugins.site.render.ReportDocumentRenderer.renderDocument(ReportDocumentRenderer.java:230)
        at org.apache.maven.doxia.siterenderer.DefaultSiteRenderer.render(DefaultSiteRenderer.java:349)
        at org.apache.maven.plugins.site.render.SiteMojo.renderLocale(SiteMojo.java:184)
        at org.apache.maven.plugins.site.render.SiteMojo.execute(SiteMojo.java:133)
        ... 33 more
[ERROR]
[ERROR] Re-run Maven using the -X switch to enable full debug logging.
[ERROR]
[ERROR] For more information about the errors and possible solutions, please read the following articles:
[ERROR] [Help 1] http://cwiki.apache.org/confluence/display/MAVEN/MojoExecutionException
[JENKINS] Archiving <https://builds.apache.org/job/dist-tool-plugin/ws/pom.xml> to org.apache.maven.dist.tools/dist-tool-plugin/1.0-SNAPSHOT/dist-tool-plugin-1.0-SNAPSHOT.pom
[JENKINS] Archiving <https://builds.apache.org/job/dist-tool-plugin/ws/target/dist-tool-plugin-1.0-SNAPSHOT.jar> to org.apache.maven.dist.tools/dist-tool-plugin/1.0-SNAPSHOT/dist-tool-plugin-1.0-SNAPSHOT.jar
channel stopped
Reply | Threaded
Open this post in threaded view
|

Build failed in Jenkins: dist-tool-plugin #2146

Apache Jenkins Server-2
See <https://builds.apache.org/job/dist-tool-plugin/2146/display/redirect?page=changes>

Changes:

[khmarbaise] Replaced deprecated verbatim (true) with verbatim

------------------------------------------
Started by an SCM change
[EnvInject] - Loading node environment variables.
Building remotely on H27 (ubuntu xenial) in workspace <https://builds.apache.org/job/dist-tool-plugin/ws/>
 > git rev-parse --is-inside-work-tree # timeout=10
Fetching changes from the remote Git repository
 > git config remote.origin.url https://gitbox.apache.org/repos/asf/maven-dist-tool.git # timeout=10
Fetching upstream changes from https://gitbox.apache.org/repos/asf/maven-dist-tool.git
 > git --version # timeout=10
 > git fetch --tags --progress https://gitbox.apache.org/repos/asf/maven-dist-tool.git +refs/heads/*:refs/remotes/origin/*
 > git rev-parse refs/remotes/origin/master^{commit} # timeout=10
 > git rev-parse refs/remotes/origin/origin/master^{commit} # timeout=10
Checking out Revision f7c55be8cb524d6c0384befbe8b14aa3e6caa159 (refs/remotes/origin/master)
 > git config core.sparsecheckout # timeout=10
 > git checkout -f f7c55be8cb524d6c0384befbe8b14aa3e6caa159
Commit message: "Replaced deprecated verbatim (true) with verbatim (SinkEventAttributeSet.BOXED)."
 > git rev-list --no-walk 4d35c6ba2b749e9f21c0783768654d2d52b5d924 # timeout=10
Parsing POMs
Established TCP socket on 44511
maven33-agent.jar already up to date
maven33-interceptor.jar already up to date
maven3-interceptor-commons.jar already up to date
[dist-tool-plugin] $ /home/jenkins/tools/java/latest1.8/bin/java -Xmx2g -Xms256m -cp /home/jenkins/jenkins-slave/maven33-agent.jar:/home/jenkins/tools/maven/apache-maven-3.3.9/boot/plexus-classworlds-2.5.2.jar:/home/jenkins/tools/maven/apache-maven-3.3.9/conf/logging jenkins.maven3.agent.Maven33Main /home/jenkins/tools/maven/apache-maven-3.3.9 /home/jenkins/jenkins-slave/slave.jar /home/jenkins/jenkins-slave/maven33-interceptor.jar /home/jenkins/jenkins-slave/maven3-interceptor-commons.jar 44511
<===[JENKINS REMOTING CAPACITY]===>   channel started
Executing Maven:  -B -f <https://builds.apache.org/job/dist-tool-plugin/ws/pom.xml> -Dmaven.repo.local=/home/jenkins/jenkins-slave/maven-repositories/0 -B -e -Preporting -Papache.snapshots -Dscreenshot=false clean install site
[INFO] Error stacktraces are turned on.
[INFO] Scanning for projects...
[INFO]                                                                        
[INFO] ------------------------------------------------------------------------
[INFO] Building dist-tool-plugin 1.0-SNAPSHOT
[INFO] ------------------------------------------------------------------------
[INFO]
[INFO] --- maven-clean-plugin:3.0.0:clean (default-clean) @ dist-tool-plugin ---
[INFO] Deleting <https://builds.apache.org/job/dist-tool-plugin/ws/target>
[INFO]
[INFO] --- maven-enforcer-plugin:1.4.1:enforce (enforce-maven-version) @ dist-tool-plugin ---
[INFO]
[INFO] --- maven-enforcer-plugin:1.4.1:enforce (enforce-bytecode-version) @ dist-tool-plugin ---
[INFO]
[INFO] --- maven-enforcer-plugin:1.4.1:enforce (ban-known-bad-maven-versions) @ dist-tool-plugin ---
[INFO]
[INFO] --- apache-rat-plugin:0.12:check (rat-check) @ dist-tool-plugin ---
[INFO] Enabled default license matchers.
[INFO] Will parse SCM ignores for exclusions...
[INFO] Parsing exclusions from <https://builds.apache.org/job/dist-tool-plugin/ws/.gitignore>
[INFO] Finished adding exclusions from SCM ignore files.
[INFO] 69 implicit excludes (use -debug for more details).
[INFO] Exclude: .repository/**
[INFO] Exclude: .maven/spy.log
[INFO] Exclude: dependency-reduced-pom.xml
[INFO] Exclude: .java-version
[INFO] Exclude: .repository/**
[INFO] 38 resources included (use -debug for more details)
[INFO] Rat check: Summary over all files. Unapproved: 0, unknown: 0, generated: 0, approved: 37 licenses.
[INFO]
[INFO] --- maven-plugin-plugin:3.5.1:helpmojo (generated-helpmojo) @ dist-tool-plugin ---
[INFO] Using 'UTF-8' encoding to read mojo source files.
[INFO] java-javadoc mojo extractor found 0 mojo descriptor.
[INFO] java-annotations mojo extractor found 0 mojo descriptor.
[INFO]
[INFO] --- maven-remote-resources-plugin:1.5:process (process-resource-bundles) @ dist-tool-plugin ---
[INFO]
[INFO] --- maven-resources-plugin:3.0.2:resources (default-resources) @ dist-tool-plugin ---
[INFO] Using 'UTF-8' encoding to copy filtered resources.
[INFO] Copying 1 resource
[INFO] Copying 3 resources
[INFO]
[INFO] --- maven-compiler-plugin:3.7.0:compile (default-compile) @ dist-tool-plugin ---
[INFO] Changes detected - recompiling the module!
[INFO] Compiling 21 source files to <https://builds.apache.org/job/dist-tool-plugin/ws/target/classes>
[INFO] <https://builds.apache.org/job/dist-tool-plugin/ws/src/main/java/org/apache/maven/dist/tools/site/DistCheckSiteMojo.java>: <https://builds.apache.org/job/dist-tool-plugin/ws/src/main/java/org/apache/maven/dist/tools/site/DistCheckSiteMojo.java> uses or overrides a deprecated API.
[INFO] <https://builds.apache.org/job/dist-tool-plugin/ws/src/main/java/org/apache/maven/dist/tools/site/DistCheckSiteMojo.java>: Recompile with -Xlint:deprecation for details.
[INFO] <https://builds.apache.org/job/dist-tool-plugin/ws/src/main/java/org/apache/maven/dist/tools/prerequisites/ListPluginsPrerequisitesMojo.java>: <https://builds.apache.org/job/dist-tool-plugin/ws/src/main/java/org/apache/maven/dist/tools/prerequisites/ListPluginsPrerequisitesMojo.java> uses unchecked or unsafe operations.
[INFO] <https://builds.apache.org/job/dist-tool-plugin/ws/src/main/java/org/apache/maven/dist/tools/prerequisites/ListPluginsPrerequisitesMojo.java>: Recompile with -Xlint:unchecked for details.
[INFO]
[INFO] --- maven-plugin-plugin:3.5.1:descriptor (default-descriptor) @ dist-tool-plugin ---
[INFO] Using 'UTF-8' encoding to read mojo source files.
[INFO] java-javadoc mojo extractor found 0 mojo descriptor.
[INFO] java-annotations mojo extractor found 7 mojo descriptors.
[INFO]
[INFO] --- maven-resources-plugin:3.0.2:testResources (default-testResources) @ dist-tool-plugin ---
[INFO] Using 'UTF-8' encoding to copy filtered resources.
[INFO] skip non existing resourceDirectory <https://builds.apache.org/job/dist-tool-plugin/ws/src/test/resources>
[INFO] Copying 3 resources
[INFO]
[INFO] --- maven-compiler-plugin:3.7.0:testCompile (default-testCompile) @ dist-tool-plugin ---
[INFO] Changes detected - recompiling the module!
[INFO] Compiling 1 source file to <https://builds.apache.org/job/dist-tool-plugin/ws/target/test-classes>
[INFO]
[INFO] --- maven-surefire-plugin:2.20.1:test (default-test) @ dist-tool-plugin ---
[INFO] Surefire report directory: <https://builds.apache.org/job/dist-tool-plugin/ws/target/surefire-reports>
[INFO]
[INFO] -------------------------------------------------------
[INFO]  T E S T S
[INFO] -------------------------------------------------------
[INFO] Running org.apache.maven.dist.tools.source.PatternTest
[INFO] Tests run: 1, Failures: 0, Errors: 0, Skipped: 0, Time elapsed: 0.058 s - in org.apache.maven.dist.tools.source.PatternTest
[INFO]
[INFO] Results:
[INFO]
[INFO] Tests run: 1, Failures: 0, Errors: 0, Skipped: 0
[INFO]
[JENKINS] Recording test results
[INFO]
[INFO] --- maven-jar-plugin:3.0.2:jar (default-jar) @ dist-tool-plugin ---
[INFO] Building jar: <https://builds.apache.org/job/dist-tool-plugin/ws/target/dist-tool-plugin-1.0-SNAPSHOT.jar>
[INFO]
[INFO] --- maven-plugin-plugin:3.5.1:addPluginArtifactMetadata (default-addPluginArtifactMetadata) @ dist-tool-plugin ---
[INFO]
[INFO] --- maven-site-plugin:3.7:attach-descriptor (attach-descriptor) @ dist-tool-plugin ---
[INFO] Skipping because packaging 'maven-plugin' is not pom.
[INFO]
[INFO] --- maven-checkstyle-plugin:3.0.0:check (checkstyle-check) @ dist-tool-plugin ---
[INFO] There are 2 errors reported by Checkstyle 6.18 with config/maven_checks.xml ruleset.
[ERROR] src/main/java/org/apache/maven/dist/tools/DistCheckErrorsMojo.java:[83,40] (whitespace) ParenPad: '(' is not followed by whitespace.
[ERROR] src/main/java/org/apache/maven/dist/tools/DistCheckErrorsMojo.java:[83,67] (whitespace) ParenPad: ')' is not preceded with whitespace.
[INFO] ------------------------------------------------------------------------
[INFO] BUILD FAILURE
[INFO] ------------------------------------------------------------------------
[INFO] Total time: 01:18 min
[INFO] Finished at: 2018-04-14T20:50:50+00:00
[INFO] Final Memory: 52M/824M
[INFO] ------------------------------------------------------------------------
[WARNING] The requested profile "apache.snapshots" could not be activated because it does not exist.
Waiting for Jenkins to finish collecting data
[ERROR] Failed to execute goal org.apache.maven.plugins:maven-checkstyle-plugin:3.0.0:check (checkstyle-check) on project dist-tool-plugin: You have 2 Checkstyle violations. -> [Help 1]
org.apache.maven.lifecycle.LifecycleExecutionException: Failed to execute goal org.apache.maven.plugins:maven-checkstyle-plugin:3.0.0:check (checkstyle-check) on project dist-tool-plugin: You have 2 Checkstyle violations.
        at org.apache.maven.lifecycle.internal.MojoExecutor.execute(MojoExecutor.java:212)
        at org.apache.maven.lifecycle.internal.MojoExecutor.execute(MojoExecutor.java:153)
        at org.apache.maven.lifecycle.internal.MojoExecutor.execute(MojoExecutor.java:145)
        at org.apache.maven.lifecycle.internal.LifecycleModuleBuilder.buildProject(LifecycleModuleBuilder.java:116)
        at org.apache.maven.lifecycle.internal.LifecycleModuleBuilder.buildProject(LifecycleModuleBuilder.java:80)
        at org.apache.maven.lifecycle.internal.builder.singlethreaded.SingleThreadedBuilder.build(SingleThreadedBuilder.java:51)
        at org.apache.maven.lifecycle.internal.LifecycleStarter.execute(LifecycleStarter.java:128)
        at org.apache.maven.DefaultMaven.doExecute(DefaultMaven.java:307)
        at org.apache.maven.DefaultMaven.doExecute(DefaultMaven.java:193)
        at org.apache.maven.DefaultMaven.execute(DefaultMaven.java:106)
        at org.jvnet.hudson.maven3.launcher.Maven33Launcher.main(Maven33Launcher.java:129)
        at sun.reflect.NativeMethodAccessorImpl.invoke0(Native Method)
        at sun.reflect.NativeMethodAccessorImpl.invoke(NativeMethodAccessorImpl.java:62)
        at sun.reflect.DelegatingMethodAccessorImpl.invoke(DelegatingMethodAccessorImpl.java:43)
        at java.lang.reflect.Method.invoke(Method.java:498)
        at org.codehaus.plexus.classworlds.launcher.Launcher.launchStandard(Launcher.java:330)
        at org.codehaus.plexus.classworlds.launcher.Launcher.launch(Launcher.java:238)
        at jenkins.maven3.agent.Maven33Main.launch(Maven33Main.java:176)
        at sun.reflect.NativeMethodAccessorImpl.invoke0(Native Method)
        at sun.reflect.NativeMethodAccessorImpl.invoke(NativeMethodAccessorImpl.java:62)
        at sun.reflect.DelegatingMethodAccessorImpl.invoke(DelegatingMethodAccessorImpl.java:43)
        at java.lang.reflect.Method.invoke(Method.java:498)
        at hudson.maven.Maven3Builder.call(Maven3Builder.java:139)
        at hudson.maven.Maven3Builder.call(Maven3Builder.java:70)
        at hudson.remoting.UserRequest.perform(UserRequest.java:207)
        at hudson.remoting.UserRequest.perform(UserRequest.java:53)
        at hudson.remoting.Request$2.run(Request.java:358)
        at hudson.remoting.InterceptingExecutorService$1.call(InterceptingExecutorService.java:72)
        at java.util.concurrent.FutureTask.run(FutureTask.java:266)
        at java.util.concurrent.ThreadPoolExecutor.runWorker(ThreadPoolExecutor.java:1149)
        at java.util.concurrent.ThreadPoolExecutor$Worker.run(ThreadPoolExecutor.java:624)
        at java.lang.Thread.run(Thread.java:748)
Caused by: org.apache.maven.plugin.MojoFailureException: You have 2 Checkstyle violations.
        at org.apache.maven.plugins.checkstyle.CheckstyleViolationCheckMojo.execute(CheckstyleViolationCheckMojo.java:576)
        at org.apache.maven.plugin.DefaultBuildPluginManager.executeMojo(DefaultBuildPluginManager.java:134)
        at org.apache.maven.lifecycle.internal.MojoExecutor.execute(MojoExecutor.java:207)
        ... 31 more
[ERROR]
[ERROR] Re-run Maven using the -X switch to enable full debug logging.
[ERROR]
[ERROR] For more information about the errors and possible solutions, please read the following articles:
[ERROR] [Help 1] http://cwiki.apache.org/confluence/display/MAVEN/MojoFailureException
[JENKINS] Archiving <https://builds.apache.org/job/dist-tool-plugin/ws/pom.xml> to org.apache.maven.dist.tools/dist-tool-plugin/1.0-SNAPSHOT/dist-tool-plugin-1.0-SNAPSHOT.pom
[JENKINS] Archiving <https://builds.apache.org/job/dist-tool-plugin/ws/target/dist-tool-plugin-1.0-SNAPSHOT.jar> to org.apache.maven.dist.tools/dist-tool-plugin/1.0-SNAPSHOT/dist-tool-plugin-1.0-SNAPSHOT.jar
channel stopped
Reply | Threaded
Open this post in threaded view
|

Build failed in Jenkins: dist-tool-plugin #2147

Apache Jenkins Server-2
See <https://builds.apache.org/job/dist-tool-plugin/2147/display/redirect>

------------------------------------------
Started by timer
[EnvInject] - Loading node environment variables.
Building remotely on H26 (ubuntu xenial) in workspace <https://builds.apache.org/job/dist-tool-plugin/ws/>
 > git rev-parse --is-inside-work-tree # timeout=10
Fetching changes from the remote Git repository
 > git config remote.origin.url https://gitbox.apache.org/repos/asf/maven-dist-tool.git # timeout=10
Fetching upstream changes from https://gitbox.apache.org/repos/asf/maven-dist-tool.git
 > git --version # timeout=10
 > git fetch --tags --progress https://gitbox.apache.org/repos/asf/maven-dist-tool.git +refs/heads/*:refs/remotes/origin/*
 > git rev-parse refs/remotes/origin/master^{commit} # timeout=10
 > git rev-parse refs/remotes/origin/origin/master^{commit} # timeout=10
Checking out Revision f7c55be8cb524d6c0384befbe8b14aa3e6caa159 (refs/remotes/origin/master)
 > git config core.sparsecheckout # timeout=10
 > git checkout -f f7c55be8cb524d6c0384befbe8b14aa3e6caa159
Commit message: "Replaced deprecated verbatim (true) with verbatim (SinkEventAttributeSet.BOXED)."
 > git rev-list --no-walk f7c55be8cb524d6c0384befbe8b14aa3e6caa159 # timeout=10
Parsing POMs
Established TCP socket on 43968
maven33-agent.jar already up to date
maven33-interceptor.jar already up to date
maven3-interceptor-commons.jar already up to date
[dist-tool-plugin] $ /home/jenkins/tools/java/latest1.8/bin/java -Xmx2g -Xms256m -cp /home/jenkins/jenkins-slave/maven33-agent.jar:/home/jenkins/tools/maven/apache-maven-3.3.9/boot/plexus-classworlds-2.5.2.jar:/home/jenkins/tools/maven/apache-maven-3.3.9/conf/logging jenkins.maven3.agent.Maven33Main /home/jenkins/tools/maven/apache-maven-3.3.9 /home/jenkins/jenkins-slave/slave.jar /home/jenkins/jenkins-slave/maven33-interceptor.jar /home/jenkins/jenkins-slave/maven3-interceptor-commons.jar 43968
<===[JENKINS REMOTING CAPACITY]===>   channel started
Executing Maven:  -B -f <https://builds.apache.org/job/dist-tool-plugin/ws/pom.xml> -Dmaven.repo.local=/home/jenkins/jenkins-slave/maven-repositories/0 -B -e -Preporting -Papache.snapshots -Dscreenshot=false clean install site
[INFO] Error stacktraces are turned on.
[INFO] Scanning for projects...
[INFO]                                                                        
[INFO] ------------------------------------------------------------------------
[INFO] Building dist-tool-plugin 1.0-SNAPSHOT
[INFO] ------------------------------------------------------------------------
[INFO]
[INFO] --- maven-clean-plugin:3.0.0:clean (default-clean) @ dist-tool-plugin ---
[INFO] Deleting <https://builds.apache.org/job/dist-tool-plugin/ws/target>
[INFO]
[INFO] --- maven-enforcer-plugin:1.4.1:enforce (enforce-maven-version) @ dist-tool-plugin ---
[INFO]
[INFO] --- maven-enforcer-plugin:1.4.1:enforce (enforce-bytecode-version) @ dist-tool-plugin ---
[INFO]
[INFO] --- maven-enforcer-plugin:1.4.1:enforce (ban-known-bad-maven-versions) @ dist-tool-plugin ---
[INFO]
[INFO] --- apache-rat-plugin:0.12:check (rat-check) @ dist-tool-plugin ---
[INFO] Enabled default license matchers.
[INFO] Will parse SCM ignores for exclusions...
[INFO] Parsing exclusions from <https://builds.apache.org/job/dist-tool-plugin/ws/.gitignore>
[INFO] Finished adding exclusions from SCM ignore files.
[INFO] 69 implicit excludes (use -debug for more details).
[INFO] Exclude: .repository/**
[INFO] Exclude: .maven/spy.log
[INFO] Exclude: dependency-reduced-pom.xml
[INFO] Exclude: .java-version
[INFO] Exclude: .repository/**
[INFO] 38 resources included (use -debug for more details)
[INFO] Rat check: Summary over all files. Unapproved: 0, unknown: 0, generated: 0, approved: 37 licenses.
[INFO]
[INFO] --- maven-plugin-plugin:3.5.1:helpmojo (generated-helpmojo) @ dist-tool-plugin ---
[INFO] Using 'UTF-8' encoding to read mojo source files.
[INFO] java-javadoc mojo extractor found 0 mojo descriptor.
[INFO] java-annotations mojo extractor found 0 mojo descriptor.
[INFO]
[INFO] --- maven-remote-resources-plugin:1.5:process (process-resource-bundles) @ dist-tool-plugin ---
[INFO]
[INFO] --- maven-resources-plugin:3.0.2:resources (default-resources) @ dist-tool-plugin ---
[INFO] Using 'UTF-8' encoding to copy filtered resources.
[INFO] Copying 1 resource
[INFO] Copying 3 resources
[INFO]
[INFO] --- maven-compiler-plugin:3.7.0:compile (default-compile) @ dist-tool-plugin ---
[INFO] Changes detected - recompiling the module!
[INFO] Compiling 21 source files to <https://builds.apache.org/job/dist-tool-plugin/ws/target/classes>
[INFO] <https://builds.apache.org/job/dist-tool-plugin/ws/src/main/java/org/apache/maven/dist/tools/site/DistCheckSiteMojo.java>: <https://builds.apache.org/job/dist-tool-plugin/ws/src/main/java/org/apache/maven/dist/tools/site/DistCheckSiteMojo.java> uses or overrides a deprecated API.
[INFO] <https://builds.apache.org/job/dist-tool-plugin/ws/src/main/java/org/apache/maven/dist/tools/site/DistCheckSiteMojo.java>: Recompile with -Xlint:deprecation for details.
[INFO] <https://builds.apache.org/job/dist-tool-plugin/ws/src/main/java/org/apache/maven/dist/tools/prerequisites/ListPluginsPrerequisitesMojo.java>: <https://builds.apache.org/job/dist-tool-plugin/ws/src/main/java/org/apache/maven/dist/tools/prerequisites/ListPluginsPrerequisitesMojo.java> uses unchecked or unsafe operations.
[INFO] <https://builds.apache.org/job/dist-tool-plugin/ws/src/main/java/org/apache/maven/dist/tools/prerequisites/ListPluginsPrerequisitesMojo.java>: Recompile with -Xlint:unchecked for details.
[INFO]
[INFO] --- maven-plugin-plugin:3.5.1:descriptor (default-descriptor) @ dist-tool-plugin ---
[INFO] Using 'UTF-8' encoding to read mojo source files.
[INFO] java-javadoc mojo extractor found 0 mojo descriptor.
[INFO] java-annotations mojo extractor found 7 mojo descriptors.
[INFO]
[INFO] --- maven-resources-plugin:3.0.2:testResources (default-testResources) @ dist-tool-plugin ---
[INFO] Using 'UTF-8' encoding to copy filtered resources.
[INFO] skip non existing resourceDirectory <https://builds.apache.org/job/dist-tool-plugin/ws/src/test/resources>
[INFO] Copying 3 resources
[INFO]
[INFO] --- maven-compiler-plugin:3.7.0:testCompile (default-testCompile) @ dist-tool-plugin ---
[INFO] Changes detected - recompiling the module!
[INFO] Compiling 1 source file to <https://builds.apache.org/job/dist-tool-plugin/ws/target/test-classes>
[INFO]
[INFO] --- maven-surefire-plugin:2.20.1:test (default-test) @ dist-tool-plugin ---
[INFO] Surefire report directory: <https://builds.apache.org/job/dist-tool-plugin/ws/target/surefire-reports>
[INFO]
[INFO] -------------------------------------------------------
[INFO]  T E S T S
[INFO] -------------------------------------------------------
[INFO] Running org.apache.maven.dist.tools.source.PatternTest
[INFO] Tests run: 1, Failures: 0, Errors: 0, Skipped: 0, Time elapsed: 0.046 s - in org.apache.maven.dist.tools.source.PatternTest
[INFO]
[INFO] Results:
[INFO]
[INFO] Tests run: 1, Failures: 0, Errors: 0, Skipped: 0
[INFO]
[JENKINS] Recording test results
[INFO]
[INFO] --- maven-jar-plugin:3.0.2:jar (default-jar) @ dist-tool-plugin ---
[INFO] Building jar: <https://builds.apache.org/job/dist-tool-plugin/ws/target/dist-tool-plugin-1.0-SNAPSHOT.jar>
[INFO]
[INFO] --- maven-plugin-plugin:3.5.1:addPluginArtifactMetadata (default-addPluginArtifactMetadata) @ dist-tool-plugin ---
[INFO]
[INFO] --- maven-site-plugin:3.7:attach-descriptor (attach-descriptor) @ dist-tool-plugin ---
[INFO] Skipping because packaging 'maven-plugin' is not pom.
[INFO]
[INFO] --- maven-checkstyle-plugin:3.0.0:check (checkstyle-check) @ dist-tool-plugin ---
[INFO] There are 2 errors reported by Checkstyle 6.18 with config/maven_checks.xml ruleset.
[ERROR] src/main/java/org/apache/maven/dist/tools/DistCheckErrorsMojo.java:[83,40] (whitespace) ParenPad: '(' is not followed by whitespace.
[ERROR] src/main/java/org/apache/maven/dist/tools/DistCheckErrorsMojo.java:[83,67] (whitespace) ParenPad: ')' is not preceded with whitespace.
[INFO] ------------------------------------------------------------------------
[INFO] BUILD FAILURE
[INFO] ------------------------------------------------------------------------
[INFO] Total time: 01:21 min
[INFO] Finished at: 2018-04-15T09:55:15+00:00
[INFO] Final Memory: 56M/816M
[INFO] ------------------------------------------------------------------------
[WARNING] The requested profile "apache.snapshots" could not be activated because it does not exist.
Waiting for Jenkins to finish collecting data
[ERROR] Failed to execute goal org.apache.maven.plugins:maven-checkstyle-plugin:3.0.0:check (checkstyle-check) on project dist-tool-plugin: You have 2 Checkstyle violations. -> [Help 1]
org.apache.maven.lifecycle.LifecycleExecutionException: Failed to execute goal org.apache.maven.plugins:maven-checkstyle-plugin:3.0.0:check (checkstyle-check) on project dist-tool-plugin: You have 2 Checkstyle violations.
        at org.apache.maven.lifecycle.internal.MojoExecutor.execute(MojoExecutor.java:212)
        at org.apache.maven.lifecycle.internal.MojoExecutor.execute(MojoExecutor.java:153)
        at org.apache.maven.lifecycle.internal.MojoExecutor.execute(MojoExecutor.java:145)
        at org.apache.maven.lifecycle.internal.LifecycleModuleBuilder.buildProject(LifecycleModuleBuilder.java:116)
        at org.apache.maven.lifecycle.internal.LifecycleModuleBuilder.buildProject(LifecycleModuleBuilder.java:80)
        at org.apache.maven.lifecycle.internal.builder.singlethreaded.SingleThreadedBuilder.build(SingleThreadedBuilder.java:51)
        at org.apache.maven.lifecycle.internal.LifecycleStarter.execute(LifecycleStarter.java:128)
        at org.apache.maven.DefaultMaven.doExecute(DefaultMaven.java:307)
        at org.apache.maven.DefaultMaven.doExecute(DefaultMaven.java:193)
        at org.apache.maven.DefaultMaven.execute(DefaultMaven.java:106)
        at org.jvnet.hudson.maven3.launcher.Maven33Launcher.main(Maven33Launcher.java:129)
        at sun.reflect.NativeMethodAccessorImpl.invoke0(Native Method)
        at sun.reflect.NativeMethodAccessorImpl.invoke(NativeMethodAccessorImpl.java:62)
        at sun.reflect.DelegatingMethodAccessorImpl.invoke(DelegatingMethodAccessorImpl.java:43)
        at java.lang.reflect.Method.invoke(Method.java:498)
        at org.codehaus.plexus.classworlds.launcher.Launcher.launchStandard(Launcher.java:330)
        at org.codehaus.plexus.classworlds.launcher.Launcher.launch(Launcher.java:238)
        at jenkins.maven3.agent.Maven33Main.launch(Maven33Main.java:176)
        at sun.reflect.NativeMethodAccessorImpl.invoke0(Native Method)
        at sun.reflect.NativeMethodAccessorImpl.invoke(NativeMethodAccessorImpl.java:62)
        at sun.reflect.DelegatingMethodAccessorImpl.invoke(DelegatingMethodAccessorImpl.java:43)
        at java.lang.reflect.Method.invoke(Method.java:498)
        at hudson.maven.Maven3Builder.call(Maven3Builder.java:139)
        at hudson.maven.Maven3Builder.call(Maven3Builder.java:70)
        at hudson.remoting.UserRequest.perform(UserRequest.java:207)
        at hudson.remoting.UserRequest.perform(UserRequest.java:53)
        at hudson.remoting.Request$2.run(Request.java:358)
        at hudson.remoting.InterceptingExecutorService$1.call(InterceptingExecutorService.java:72)
        at java.util.concurrent.FutureTask.run(FutureTask.java:266)
        at java.util.concurrent.ThreadPoolExecutor.runWorker(ThreadPoolExecutor.java:1149)
        at java.util.concurrent.ThreadPoolExecutor$Worker.run(ThreadPoolExecutor.java:624)
        at java.lang.Thread.run(Thread.java:748)
Caused by: org.apache.maven.plugin.MojoFailureException: You have 2 Checkstyle violations.
        at org.apache.maven.plugins.checkstyle.CheckstyleViolationCheckMojo.execute(CheckstyleViolationCheckMojo.java:576)
        at org.apache.maven.plugin.DefaultBuildPluginManager.executeMojo(DefaultBuildPluginManager.java:134)
        at org.apache.maven.lifecycle.internal.MojoExecutor.execute(MojoExecutor.java:207)
        ... 31 more
[ERROR]
[ERROR] Re-run Maven using the -X switch to enable full debug logging.
[ERROR]
[ERROR] For more information about the errors and possible solutions, please read the following articles:
[ERROR] [Help 1] http://cwiki.apache.org/confluence/display/MAVEN/MojoFailureException
[JENKINS] Archiving <https://builds.apache.org/job/dist-tool-plugin/ws/pom.xml> to org.apache.maven.dist.tools/dist-tool-plugin/1.0-SNAPSHOT/dist-tool-plugin-1.0-SNAPSHOT.pom
[JENKINS] Archiving <https://builds.apache.org/job/dist-tool-plugin/ws/target/dist-tool-plugin-1.0-SNAPSHOT.jar> to org.apache.maven.dist.tools/dist-tool-plugin/1.0-SNAPSHOT/dist-tool-plugin-1.0-SNAPSHOT.jar
channel stopped
Reply | Threaded
Open this post in threaded view
|

Build failed in Jenkins: dist-tool-plugin #2148

Apache Jenkins Server-2
See <https://builds.apache.org/job/dist-tool-plugin/2148/display/redirect>

------------------------------------------
Started by timer
[EnvInject] - Loading node environment variables.
Building remotely on H35 (ubuntu xenial) in workspace <https://builds.apache.org/job/dist-tool-plugin/ws/>
 > git rev-parse --is-inside-work-tree # timeout=10
Fetching changes from the remote Git repository
 > git config remote.origin.url https://gitbox.apache.org/repos/asf/maven-dist-tool.git # timeout=10
Fetching upstream changes from https://gitbox.apache.org/repos/asf/maven-dist-tool.git
 > git --version # timeout=10
 > git fetch --tags --progress https://gitbox.apache.org/repos/asf/maven-dist-tool.git +refs/heads/*:refs/remotes/origin/*
 > git rev-parse refs/remotes/origin/master^{commit} # timeout=10
 > git rev-parse refs/remotes/origin/origin/master^{commit} # timeout=10
Checking out Revision f7c55be8cb524d6c0384befbe8b14aa3e6caa159 (refs/remotes/origin/master)
 > git config core.sparsecheckout # timeout=10
 > git checkout -f f7c55be8cb524d6c0384befbe8b14aa3e6caa159
Commit message: "Replaced deprecated verbatim (true) with verbatim (SinkEventAttributeSet.BOXED)."
 > git rev-list --no-walk f7c55be8cb524d6c0384befbe8b14aa3e6caa159 # timeout=10
Parsing POMs
Established TCP socket on 46681
maven33-agent.jar already up to date
maven33-interceptor.jar already up to date
maven3-interceptor-commons.jar already up to date
[dist-tool-plugin] $ /home/jenkins/tools/java/latest1.8/bin/java -Xmx2g -Xms256m -cp /home/jenkins/jenkins-slave/maven33-agent.jar:/home/jenkins/tools/maven/apache-maven-3.3.9/boot/plexus-classworlds-2.5.2.jar:/home/jenkins/tools/maven/apache-maven-3.3.9/conf/logging jenkins.maven3.agent.Maven33Main /home/jenkins/tools/maven/apache-maven-3.3.9 /home/jenkins/jenkins-slave/slave.jar /home/jenkins/jenkins-slave/maven33-interceptor.jar /home/jenkins/jenkins-slave/maven3-interceptor-commons.jar 46681
<===[JENKINS REMOTING CAPACITY]===>   channel started
Executing Maven:  -B -f <https://builds.apache.org/job/dist-tool-plugin/ws/pom.xml> -Dmaven.repo.local=/home/jenkins/jenkins-slave/maven-repositories/1 -B -e -Preporting -Papache.snapshots -Dscreenshot=false clean install site
[INFO] Error stacktraces are turned on.
[INFO] Scanning for projects...
[INFO]                                                                        
[INFO] ------------------------------------------------------------------------
[INFO] Building dist-tool-plugin 1.0-SNAPSHOT
[INFO] ------------------------------------------------------------------------
[INFO]
[INFO] --- maven-clean-plugin:3.0.0:clean (default-clean) @ dist-tool-plugin ---
[INFO] Deleting <https://builds.apache.org/job/dist-tool-plugin/ws/target>
[INFO]
[INFO] --- maven-enforcer-plugin:1.4.1:enforce (enforce-maven-version) @ dist-tool-plugin ---
[INFO]
[INFO] --- maven-enforcer-plugin:1.4.1:enforce (enforce-bytecode-version) @ dist-tool-plugin ---
[INFO]
[INFO] --- maven-enforcer-plugin:1.4.1:enforce (ban-known-bad-maven-versions) @ dist-tool-plugin ---
[INFO]
[INFO] --- apache-rat-plugin:0.12:check (rat-check) @ dist-tool-plugin ---
[INFO] Enabled default license matchers.
[INFO] Will parse SCM ignores for exclusions...
[INFO] Parsing exclusions from <https://builds.apache.org/job/dist-tool-plugin/ws/.gitignore>
[INFO] Finished adding exclusions from SCM ignore files.
[INFO] 69 implicit excludes (use -debug for more details).
[INFO] Exclude: .repository/**
[INFO] Exclude: .maven/spy.log
[INFO] Exclude: dependency-reduced-pom.xml
[INFO] Exclude: .java-version
[INFO] Exclude: .repository/**
[INFO] 38 resources included (use -debug for more details)
[INFO] Rat check: Summary over all files. Unapproved: 0, unknown: 0, generated: 0, approved: 37 licenses.
[INFO]
[INFO] --- maven-plugin-plugin:3.5.1:helpmojo (generated-helpmojo) @ dist-tool-plugin ---
[INFO] Using 'UTF-8' encoding to read mojo source files.
[INFO] java-javadoc mojo extractor found 0 mojo descriptor.
[INFO] java-annotations mojo extractor found 0 mojo descriptor.
[INFO]
[INFO] --- maven-remote-resources-plugin:1.5:process (process-resource-bundles) @ dist-tool-plugin ---
[INFO]
[INFO] --- maven-resources-plugin:3.0.2:resources (default-resources) @ dist-tool-plugin ---
[INFO] Using 'UTF-8' encoding to copy filtered resources.
[INFO] Copying 1 resource
[INFO] Copying 3 resources
[INFO]
[INFO] --- maven-compiler-plugin:3.7.0:compile (default-compile) @ dist-tool-plugin ---
[INFO] Changes detected - recompiling the module!
[INFO] Compiling 21 source files to <https://builds.apache.org/job/dist-tool-plugin/ws/target/classes>
[INFO] <https://builds.apache.org/job/dist-tool-plugin/ws/src/main/java/org/apache/maven/dist/tools/site/DistCheckSiteMojo.java>: <https://builds.apache.org/job/dist-tool-plugin/ws/src/main/java/org/apache/maven/dist/tools/site/DistCheckSiteMojo.java> uses or overrides a deprecated API.
[INFO] <https://builds.apache.org/job/dist-tool-plugin/ws/src/main/java/org/apache/maven/dist/tools/site/DistCheckSiteMojo.java>: Recompile with -Xlint:deprecation for details.
[INFO] <https://builds.apache.org/job/dist-tool-plugin/ws/src/main/java/org/apache/maven/dist/tools/prerequisites/ListPluginsPrerequisitesMojo.java>: <https://builds.apache.org/job/dist-tool-plugin/ws/src/main/java/org/apache/maven/dist/tools/prerequisites/ListPluginsPrerequisitesMojo.java> uses unchecked or unsafe operations.
[INFO] <https://builds.apache.org/job/dist-tool-plugin/ws/src/main/java/org/apache/maven/dist/tools/prerequisites/ListPluginsPrerequisitesMojo.java>: Recompile with -Xlint:unchecked for details.
[INFO]
[INFO] --- maven-plugin-plugin:3.5.1:descriptor (default-descriptor) @ dist-tool-plugin ---
[INFO] Using 'UTF-8' encoding to read mojo source files.
[INFO] java-javadoc mojo extractor found 0 mojo descriptor.
[INFO] java-annotations mojo extractor found 7 mojo descriptors.
[INFO]
[INFO] --- maven-resources-plugin:3.0.2:testResources (default-testResources) @ dist-tool-plugin ---
[INFO] Using 'UTF-8' encoding to copy filtered resources.
[INFO] skip non existing resourceDirectory <https://builds.apache.org/job/dist-tool-plugin/ws/src/test/resources>
[INFO] Copying 3 resources
[INFO]
[INFO] --- maven-compiler-plugin:3.7.0:testCompile (default-testCompile) @ dist-tool-plugin ---
[INFO] Changes detected - recompiling the module!
[INFO] Compiling 1 source file to <https://builds.apache.org/job/dist-tool-plugin/ws/target/test-classes>
[INFO]
[INFO] --- maven-surefire-plugin:2.20.1:test (default-test) @ dist-tool-plugin ---
[INFO] Surefire report directory: <https://builds.apache.org/job/dist-tool-plugin/ws/target/surefire-reports>
[INFO]
[INFO] -------------------------------------------------------
[INFO]  T E S T S
[INFO] -------------------------------------------------------
[INFO] Running org.apache.maven.dist.tools.source.PatternTest
[INFO] Tests run: 1, Failures: 0, Errors: 0, Skipped: 0, Time elapsed: 0.058 s - in org.apache.maven.dist.tools.source.PatternTest
[INFO]
[INFO] Results:
[INFO]
[INFO] Tests run: 1, Failures: 0, Errors: 0, Skipped: 0
[INFO]
[JENKINS] Recording test results
[INFO]
[INFO] --- maven-jar-plugin:3.0.2:jar (default-jar) @ dist-tool-plugin ---
[INFO] Building jar: <https://builds.apache.org/job/dist-tool-plugin/ws/target/dist-tool-plugin-1.0-SNAPSHOT.jar>
[INFO]
[INFO] --- maven-plugin-plugin:3.5.1:addPluginArtifactMetadata (default-addPluginArtifactMetadata) @ dist-tool-plugin ---
[INFO]
[INFO] --- maven-site-plugin:3.7:attach-descriptor (attach-descriptor) @ dist-tool-plugin ---
[INFO] Skipping because packaging 'maven-plugin' is not pom.
[INFO]
[INFO] --- maven-checkstyle-plugin:3.0.0:check (checkstyle-check) @ dist-tool-plugin ---
[INFO] There are 2 errors reported by Checkstyle 6.18 with config/maven_checks.xml ruleset.
[ERROR] src/main/java/org/apache/maven/dist/tools/DistCheckErrorsMojo.java:[83,40] (whitespace) ParenPad: '(' is not followed by whitespace.
[ERROR] src/main/java/org/apache/maven/dist/tools/DistCheckErrorsMojo.java:[83,67] (whitespace) ParenPad: ')' is not preceded with whitespace.
[INFO] ------------------------------------------------------------------------
[INFO] BUILD FAILURE
[INFO] ------------------------------------------------------------------------
[INFO] Total time: 01:23 min
[INFO] Finished at: 2018-04-16T09:52:46+00:00
[INFO] Final Memory: 56M/762M
[INFO] ------------------------------------------------------------------------
[WARNING] The requested profile "apache.snapshots" could not be activated because it does not exist.
Waiting for Jenkins to finish collecting data
[ERROR] Failed to execute goal org.apache.maven.plugins:maven-checkstyle-plugin:3.0.0:check (checkstyle-check) on project dist-tool-plugin: You have 2 Checkstyle violations. -> [Help 1]
org.apache.maven.lifecycle.LifecycleExecutionException: Failed to execute goal org.apache.maven.plugins:maven-checkstyle-plugin:3.0.0:check (checkstyle-check) on project dist-tool-plugin: You have 2 Checkstyle violations.
        at org.apache.maven.lifecycle.internal.MojoExecutor.execute(MojoExecutor.java:212)
        at org.apache.maven.lifecycle.internal.MojoExecutor.execute(MojoExecutor.java:153)
        at org.apache.maven.lifecycle.internal.MojoExecutor.execute(MojoExecutor.java:145)
        at org.apache.maven.lifecycle.internal.LifecycleModuleBuilder.buildProject(LifecycleModuleBuilder.java:116)
        at org.apache.maven.lifecycle.internal.LifecycleModuleBuilder.buildProject(LifecycleModuleBuilder.java:80)
        at org.apache.maven.lifecycle.internal.builder.singlethreaded.SingleThreadedBuilder.build(SingleThreadedBuilder.java:51)
        at org.apache.maven.lifecycle.internal.LifecycleStarter.execute(LifecycleStarter.java:128)
        at org.apache.maven.DefaultMaven.doExecute(DefaultMaven.java:307)
        at org.apache.maven.DefaultMaven.doExecute(DefaultMaven.java:193)
        at org.apache.maven.DefaultMaven.execute(DefaultMaven.java:106)
        at org.jvnet.hudson.maven3.launcher.Maven33Launcher.main(Maven33Launcher.java:129)
        at sun.reflect.NativeMethodAccessorImpl.invoke0(Native Method)
        at sun.reflect.NativeMethodAccessorImpl.invoke(NativeMethodAccessorImpl.java:62)
        at sun.reflect.DelegatingMethodAccessorImpl.invoke(DelegatingMethodAccessorImpl.java:43)
        at java.lang.reflect.Method.invoke(Method.java:498)
        at org.codehaus.plexus.classworlds.launcher.Launcher.launchStandard(Launcher.java:330)
        at org.codehaus.plexus.classworlds.launcher.Launcher.launch(Launcher.java:238)
        at jenkins.maven3.agent.Maven33Main.launch(Maven33Main.java:176)
        at sun.reflect.NativeMethodAccessorImpl.invoke0(Native Method)
        at sun.reflect.NativeMethodAccessorImpl.invoke(NativeMethodAccessorImpl.java:62)
        at sun.reflect.DelegatingMethodAccessorImpl.invoke(DelegatingMethodAccessorImpl.java:43)
        at java.lang.reflect.Method.invoke(Method.java:498)
        at hudson.maven.Maven3Builder.call(Maven3Builder.java:139)
        at hudson.maven.Maven3Builder.call(Maven3Builder.java:70)
        at hudson.remoting.UserRequest.perform(UserRequest.java:207)
        at hudson.remoting.UserRequest.perform(UserRequest.java:53)
        at hudson.remoting.Request$2.run(Request.java:358)
        at hudson.remoting.InterceptingExecutorService$1.call(InterceptingExecutorService.java:72)
        at java.util.concurrent.FutureTask.run(FutureTask.java:266)
        at java.util.concurrent.ThreadPoolExecutor.runWorker(ThreadPoolExecutor.java:1149)
        at java.util.concurrent.ThreadPoolExecutor$Worker.run(ThreadPoolExecutor.java:624)
        at java.lang.Thread.run(Thread.java:748)
Caused by: org.apache.maven.plugin.MojoFailureException: You have 2 Checkstyle violations.
        at org.apache.maven.plugins.checkstyle.CheckstyleViolationCheckMojo.execute(CheckstyleViolationCheckMojo.java:576)
        at org.apache.maven.plugin.DefaultBuildPluginManager.executeMojo(DefaultBuildPluginManager.java:134)
        at org.apache.maven.lifecycle.internal.MojoExecutor.execute(MojoExecutor.java:207)
        ... 31 more
[ERROR]
[ERROR] Re-run Maven using the -X switch to enable full debug logging.
[ERROR]
[ERROR] For more information about the errors and possible solutions, please read the following articles:
[ERROR] [Help 1] http://cwiki.apache.org/confluence/display/MAVEN/MojoFailureException
[JENKINS] Archiving <https://builds.apache.org/job/dist-tool-plugin/ws/pom.xml> to org.apache.maven.dist.tools/dist-tool-plugin/1.0-SNAPSHOT/dist-tool-plugin-1.0-SNAPSHOT.pom
[JENKINS] Archiving <https://builds.apache.org/job/dist-tool-plugin/ws/target/dist-tool-plugin-1.0-SNAPSHOT.jar> to org.apache.maven.dist.tools/dist-tool-plugin/1.0-SNAPSHOT/dist-tool-plugin-1.0-SNAPSHOT.jar
channel stopped
Reply | Threaded
Open this post in threaded view
|

Build failed in Jenkins: dist-tool-plugin #2149

Apache Jenkins Server-2
See <https://builds.apache.org/job/dist-tool-plugin/2149/display/redirect>

------------------------------------------
Started by timer
[EnvInject] - Loading node environment variables.
Building remotely on H33 (ubuntu xenial) in workspace <https://builds.apache.org/job/dist-tool-plugin/ws/>
Cloning the remote Git repository
Cloning repository https://gitbox.apache.org/repos/asf/maven-dist-tool.git
 > git init <https://builds.apache.org/job/dist-tool-plugin/ws/> # timeout=10
Fetching upstream changes from https://gitbox.apache.org/repos/asf/maven-dist-tool.git
 > git --version # timeout=10
 > git fetch --tags --progress https://gitbox.apache.org/repos/asf/maven-dist-tool.git +refs/heads/*:refs/remotes/origin/*
 > git config remote.origin.url https://gitbox.apache.org/repos/asf/maven-dist-tool.git # timeout=10
 > git config --add remote.origin.fetch +refs/heads/*:refs/remotes/origin/* # timeout=10
 > git config remote.origin.url https://gitbox.apache.org/repos/asf/maven-dist-tool.git # timeout=10
Fetching upstream changes from https://gitbox.apache.org/repos/asf/maven-dist-tool.git
 > git fetch --tags --progress https://gitbox.apache.org/repos/asf/maven-dist-tool.git +refs/heads/*:refs/remotes/origin/*
 > git rev-parse refs/remotes/origin/master^{commit} # timeout=10
 > git rev-parse refs/remotes/origin/origin/master^{commit} # timeout=10
Checking out Revision f7c55be8cb524d6c0384befbe8b14aa3e6caa159 (refs/remotes/origin/master)
 > git config core.sparsecheckout # timeout=10
 > git checkout -f f7c55be8cb524d6c0384befbe8b14aa3e6caa159
Commit message: "Replaced deprecated verbatim (true) with verbatim (SinkEventAttributeSet.BOXED)."
 > git rev-list --no-walk f7c55be8cb524d6c0384befbe8b14aa3e6caa159 # timeout=10
Parsing POMs
Downloaded artifact http://repo.maven.apache.org/maven2/org/apache/maven/maven-parent/31/maven-parent-31.pom
Established TCP socket on 44958
maven33-agent.jar already up to date
maven33-interceptor.jar already up to date
maven3-interceptor-commons.jar already up to date
[dist-tool-plugin] $ /home/jenkins/tools/java/latest1.8/bin/java -Xmx2g -Xms256m -cp /home/jenkins/jenkins-slave/maven33-agent.jar:/home/jenkins/tools/maven/apache-maven-3.3.9/boot/plexus-classworlds-2.5.2.jar:/home/jenkins/tools/maven/apache-maven-3.3.9/conf/logging jenkins.maven3.agent.Maven33Main /home/jenkins/tools/maven/apache-maven-3.3.9 /home/jenkins/jenkins-slave/slave.jar /home/jenkins/jenkins-slave/maven33-interceptor.jar /home/jenkins/jenkins-slave/maven3-interceptor-commons.jar 44958
<===[JENKINS REMOTING CAPACITY]===>   channel started
Executing Maven:  -B -f <https://builds.apache.org/job/dist-tool-plugin/ws/pom.xml> -Dmaven.repo.local=/home/jenkins/jenkins-slave/maven-repositories/1 -B -e -Preporting -Papache.snapshots -Dscreenshot=false clean install site
[INFO] Error stacktraces are turned on.
[INFO] Scanning for projects...
[INFO]                                                                        
[INFO] ------------------------------------------------------------------------
[INFO] Building dist-tool-plugin 1.0-SNAPSHOT
[INFO] ------------------------------------------------------------------------
[INFO]
[INFO] --- maven-clean-plugin:3.0.0:clean (default-clean) @ dist-tool-plugin ---
[INFO]
[INFO] --- maven-enforcer-plugin:1.4.1:enforce (enforce-maven-version) @ dist-tool-plugin ---
[INFO] Downloading: https://repo.maven.apache.org/maven2/org/codehaus/mojo/extra-enforcer-rules/1.0-beta-7/extra-enforcer-rules-1.0-beta-7.pom
[INFO] Downloaded: https://repo.maven.apache.org/maven2/org/codehaus/mojo/extra-enforcer-rules/1.0-beta-7/extra-enforcer-rules-1.0-beta-7.pom (7 KB at 17.3 KB/sec)
[INFO] Downloading: https://repo.maven.apache.org/maven2/org/codehaus/mojo/extra-enforcer-rules/1.0-beta-7/extra-enforcer-rules-1.0-beta-7.jar
[INFO] Downloaded: https://repo.maven.apache.org/maven2/org/codehaus/mojo/extra-enforcer-rules/1.0-beta-7/extra-enforcer-rules-1.0-beta-7.jar (37 KB at 1029.9 KB/sec)
[INFO]
[INFO] --- maven-enforcer-plugin:1.4.1:enforce (enforce-bytecode-version) @ dist-tool-plugin ---
[INFO]
[INFO] --- maven-enforcer-plugin:1.4.1:enforce (ban-known-bad-maven-versions) @ dist-tool-plugin ---
[INFO]
[INFO] --- apache-rat-plugin:0.12:check (rat-check) @ dist-tool-plugin ---
[INFO] Enabled default license matchers.
[INFO] Will parse SCM ignores for exclusions...
[INFO] Parsing exclusions from <https://builds.apache.org/job/dist-tool-plugin/ws/.gitignore>
[INFO] Finished adding exclusions from SCM ignore files.
[INFO] 69 implicit excludes (use -debug for more details).
[INFO] Exclude: .repository/**
[INFO] Exclude: .maven/spy.log
[INFO] Exclude: dependency-reduced-pom.xml
[INFO] Exclude: .java-version
[INFO] Exclude: .repository/**
[INFO] 38 resources included (use -debug for more details)
[INFO] Rat check: Summary over all files. Unapproved: 0, unknown: 0, generated: 0, approved: 37 licenses.
[INFO]
[INFO] --- maven-plugin-plugin:3.5.1:helpmojo (generated-helpmojo) @ dist-tool-plugin ---
[INFO] Using 'UTF-8' encoding to read mojo source files.
[INFO] java-javadoc mojo extractor found 0 mojo descriptor.
[INFO] java-annotations mojo extractor found 0 mojo descriptor.
[INFO]
[INFO] --- maven-remote-resources-plugin:1.5:process (process-resource-bundles) @ dist-tool-plugin ---
[INFO]
[INFO] --- maven-resources-plugin:3.0.2:resources (default-resources) @ dist-tool-plugin ---
[INFO] Using 'UTF-8' encoding to copy filtered resources.
[INFO] Copying 1 resource
[INFO] Copying 3 resources
[INFO]
[INFO] --- maven-compiler-plugin:3.7.0:compile (default-compile) @ dist-tool-plugin ---
[INFO] Changes detected - recompiling the module!
[INFO] Compiling 21 source files to <https://builds.apache.org/job/dist-tool-plugin/ws/target/classes>
[INFO] <https://builds.apache.org/job/dist-tool-plugin/ws/src/main/java/org/apache/maven/dist/tools/site/DistCheckSiteMojo.java>: <https://builds.apache.org/job/dist-tool-plugin/ws/src/main/java/org/apache/maven/dist/tools/site/DistCheckSiteMojo.java> uses or overrides a deprecated API.
[INFO] <https://builds.apache.org/job/dist-tool-plugin/ws/src/main/java/org/apache/maven/dist/tools/site/DistCheckSiteMojo.java>: Recompile with -Xlint:deprecation for details.
[INFO] <https://builds.apache.org/job/dist-tool-plugin/ws/src/main/java/org/apache/maven/dist/tools/prerequisites/ListPluginsPrerequisitesMojo.java>: <https://builds.apache.org/job/dist-tool-plugin/ws/src/main/java/org/apache/maven/dist/tools/prerequisites/ListPluginsPrerequisitesMojo.java> uses unchecked or unsafe operations.
[INFO] <https://builds.apache.org/job/dist-tool-plugin/ws/src/main/java/org/apache/maven/dist/tools/prerequisites/ListPluginsPrerequisitesMojo.java>: Recompile with -Xlint:unchecked for details.
[INFO]
[INFO] --- maven-plugin-plugin:3.5.1:descriptor (default-descriptor) @ dist-tool-plugin ---
[INFO] Using 'UTF-8' encoding to read mojo source files.
[INFO] java-javadoc mojo extractor found 0 mojo descriptor.
[INFO] java-annotations mojo extractor found 7 mojo descriptors.
[INFO]
[INFO] --- maven-resources-plugin:3.0.2:testResources (default-testResources) @ dist-tool-plugin ---
[INFO] Using 'UTF-8' encoding to copy filtered resources.
[INFO] skip non existing resourceDirectory <https://builds.apache.org/job/dist-tool-plugin/ws/src/test/resources>
[INFO] Copying 3 resources
[INFO]
[INFO] --- maven-compiler-plugin:3.7.0:testCompile (default-testCompile) @ dist-tool-plugin ---
[INFO] Changes detected - recompiling the module!
[INFO] Compiling 1 source file to <https://builds.apache.org/job/dist-tool-plugin/ws/target/test-classes>
[INFO]
[INFO] --- maven-surefire-plugin:2.20.1:test (default-test) @ dist-tool-plugin ---
[INFO] Surefire report directory: <https://builds.apache.org/job/dist-tool-plugin/ws/target/surefire-reports>
[INFO]
[INFO] -------------------------------------------------------
[INFO]  T E S T S
[INFO] -------------------------------------------------------
[INFO] Running org.apache.maven.dist.tools.source.PatternTest
[INFO] Tests run: 1, Failures: 0, Errors: 0, Skipped: 0, Time elapsed: 0.065 s - in org.apache.maven.dist.tools.source.PatternTest
[INFO]
[INFO] Results:
[INFO]
[INFO] Tests run: 1, Failures: 0, Errors: 0, Skipped: 0
[INFO]
[JENKINS] Recording test results
[INFO]
[INFO] --- maven-jar-plugin:3.0.2:jar (default-jar) @ dist-tool-plugin ---
[INFO] Building jar: <https://builds.apache.org/job/dist-tool-plugin/ws/target/dist-tool-plugin-1.0-SNAPSHOT.jar>
[INFO]
[INFO] --- maven-plugin-plugin:3.5.1:addPluginArtifactMetadata (default-addPluginArtifactMetadata) @ dist-tool-plugin ---
[INFO]
[INFO] --- maven-site-plugin:3.7:attach-descriptor (attach-descriptor) @ dist-tool-plugin ---
[INFO] Skipping because packaging 'maven-plugin' is not pom.
[INFO]
[INFO] --- maven-checkstyle-plugin:3.0.0:check (checkstyle-check) @ dist-tool-plugin ---
[INFO] There are 2 errors reported by Checkstyle 6.18 with config/maven_checks.xml ruleset.
[ERROR] src/main/java/org/apache/maven/dist/tools/DistCheckErrorsMojo.java:[83,40] (whitespace) ParenPad: '(' is not followed by whitespace.
[ERROR] src/main/java/org/apache/maven/dist/tools/DistCheckErrorsMojo.java:[83,67] (whitespace) ParenPad: ')' is not preceded with whitespace.
[INFO] ------------------------------------------------------------------------
[INFO] BUILD FAILURE
[INFO] ------------------------------------------------------------------------
[INFO] Total time: 01:37 min
[INFO] Finished at: 2018-04-17T10:24:47+00:00
[INFO] Final Memory: 50M/699M
[INFO] ------------------------------------------------------------------------
[WARNING] The requested profile "apache.snapshots" could not be activated because it does not exist.
Waiting for Jenkins to finish collecting data
[ERROR] Failed to execute goal org.apache.maven.plugins:maven-checkstyle-plugin:3.0.0:check (checkstyle-check) on project dist-tool-plugin: You have 2 Checkstyle violations. -> [Help 1]
org.apache.maven.lifecycle.LifecycleExecutionException: Failed to execute goal org.apache.maven.plugins:maven-checkstyle-plugin:3.0.0:check (checkstyle-check) on project dist-tool-plugin: You have 2 Checkstyle violations.
        at org.apache.maven.lifecycle.internal.MojoExecutor.execute(MojoExecutor.java:212)
        at org.apache.maven.lifecycle.internal.MojoExecutor.execute(MojoExecutor.java:153)
        at org.apache.maven.lifecycle.internal.MojoExecutor.execute(MojoExecutor.java:145)
        at org.apache.maven.lifecycle.internal.LifecycleModuleBuilder.buildProject(LifecycleModuleBuilder.java:116)
        at org.apache.maven.lifecycle.internal.LifecycleModuleBuilder.buildProject(LifecycleModuleBuilder.java:80)
        at org.apache.maven.lifecycle.internal.builder.singlethreaded.SingleThreadedBuilder.build(SingleThreadedBuilder.java:51)
        at org.apache.maven.lifecycle.internal.LifecycleStarter.execute(LifecycleStarter.java:128)
        at org.apache.maven.DefaultMaven.doExecute(DefaultMaven.java:307)
        at org.apache.maven.DefaultMaven.doExecute(DefaultMaven.java:193)
        at org.apache.maven.DefaultMaven.execute(DefaultMaven.java:106)
        at org.jvnet.hudson.maven3.launcher.Maven33Launcher.main(Maven33Launcher.java:129)
        at sun.reflect.NativeMethodAccessorImpl.invoke0(Native Method)
        at sun.reflect.NativeMethodAccessorImpl.invoke(NativeMethodAccessorImpl.java:62)
        at sun.reflect.DelegatingMethodAccessorImpl.invoke(DelegatingMethodAccessorImpl.java:43)
        at java.lang.reflect.Method.invoke(Method.java:498)
        at org.codehaus.plexus.classworlds.launcher.Launcher.launchStandard(Launcher.java:330)
        at org.codehaus.plexus.classworlds.launcher.Launcher.launch(Launcher.java:238)
        at jenkins.maven3.agent.Maven33Main.launch(Maven33Main.java:176)
        at sun.reflect.NativeMethodAccessorImpl.invoke0(Native Method)
        at sun.reflect.NativeMethodAccessorImpl.invoke(NativeMethodAccessorImpl.java:62)
        at sun.reflect.DelegatingMethodAccessorImpl.invoke(DelegatingMethodAccessorImpl.java:43)
        at java.lang.reflect.Method.invoke(Method.java:498)
        at hudson.maven.Maven3Builder.call(Maven3Builder.java:139)
        at hudson.maven.Maven3Builder.call(Maven3Builder.java:70)
        at hudson.remoting.UserRequest.perform(UserRequest.java:207)
        at hudson.remoting.UserRequest.perform(UserRequest.java:53)
        at hudson.remoting.Request$2.run(Request.java:358)
        at hudson.remoting.InterceptingExecutorService$1.call(InterceptingExecutorService.java:72)
        at java.util.concurrent.FutureTask.run(FutureTask.java:266)
        at java.util.concurrent.ThreadPoolExecutor.runWorker(ThreadPoolExecutor.java:1149)
        at java.util.concurrent.ThreadPoolExecutor$Worker.run(ThreadPoolExecutor.java:624)
        at java.lang.Thread.run(Thread.java:748)
Caused by: org.apache.maven.plugin.MojoFailureException: You have 2 Checkstyle violations.
        at org.apache.maven.plugins.checkstyle.CheckstyleViolationCheckMojo.execute(CheckstyleViolationCheckMojo.java:576)
        at org.apache.maven.plugin.DefaultBuildPluginManager.executeMojo(DefaultBuildPluginManager.java:134)
        at org.apache.maven.lifecycle.internal.MojoExecutor.execute(MojoExecutor.java:207)
        ... 31 more
[ERROR]
[ERROR] Re-run Maven using the -X switch to enable full debug logging.
[ERROR]
[ERROR] For more information about the errors and possible solutions, please read the following articles:
[ERROR] [Help 1] http://cwiki.apache.org/confluence/display/MAVEN/MojoFailureException
[JENKINS] Archiving <https://builds.apache.org/job/dist-tool-plugin/ws/pom.xml> to org.apache.maven.dist.tools/dist-tool-plugin/1.0-SNAPSHOT/dist-tool-plugin-1.0-SNAPSHOT.pom
[JENKINS] Archiving <https://builds.apache.org/job/dist-tool-plugin/ws/target/dist-tool-plugin-1.0-SNAPSHOT.jar> to org.apache.maven.dist.tools/dist-tool-plugin/1.0-SNAPSHOT/dist-tool-plugin-1.0-SNAPSHOT.jar
channel stopped
Reply | Threaded
Open this post in threaded view
|

Build failed in Jenkins: dist-tool-plugin #2150

Apache Jenkins Server-2
See <https://builds.apache.org/job/dist-tool-plugin/2150/display/redirect>

------------------------------------------
Started by timer
[EnvInject] - Loading node environment variables.
Building remotely on H31 (ubuntu xenial) in workspace <https://builds.apache.org/job/dist-tool-plugin/ws/>
Cloning the remote Git repository
Cloning repository https://gitbox.apache.org/repos/asf/maven-dist-tool.git
 > git init <https://builds.apache.org/job/dist-tool-plugin/ws/> # timeout=10
Fetching upstream changes from https://gitbox.apache.org/repos/asf/maven-dist-tool.git
 > git --version # timeout=10
 > git fetch --tags --progress https://gitbox.apache.org/repos/asf/maven-dist-tool.git +refs/heads/*:refs/remotes/origin/*
 > git config remote.origin.url https://gitbox.apache.org/repos/asf/maven-dist-tool.git # timeout=10
 > git config --add remote.origin.fetch +refs/heads/*:refs/remotes/origin/* # timeout=10
 > git config remote.origin.url https://gitbox.apache.org/repos/asf/maven-dist-tool.git # timeout=10
Fetching upstream changes from https://gitbox.apache.org/repos/asf/maven-dist-tool.git
 > git fetch --tags --progress https://gitbox.apache.org/repos/asf/maven-dist-tool.git +refs/heads/*:refs/remotes/origin/*
 > git rev-parse refs/remotes/origin/master^{commit} # timeout=10
 > git rev-parse refs/remotes/origin/origin/master^{commit} # timeout=10
Checking out Revision f7c55be8cb524d6c0384befbe8b14aa3e6caa159 (refs/remotes/origin/master)
 > git config core.sparsecheckout # timeout=10
 > git checkout -f f7c55be8cb524d6c0384befbe8b14aa3e6caa159
Commit message: "Replaced deprecated verbatim (true) with verbatim (SinkEventAttributeSet.BOXED)."
 > git rev-list --no-walk f7c55be8cb524d6c0384befbe8b14aa3e6caa159 # timeout=10
Parsing POMs
Established TCP socket on 45200
maven33-agent.jar already up to date
maven33-interceptor.jar already up to date
maven3-interceptor-commons.jar already up to date
[dist-tool-plugin] $ /home/jenkins/tools/java/latest1.8/bin/java -Xmx2g -Xms256m -cp /home/jenkins/jenkins-slave/maven33-agent.jar:/home/jenkins/tools/maven/apache-maven-3.3.9/boot/plexus-classworlds-2.5.2.jar:/home/jenkins/tools/maven/apache-maven-3.3.9/conf/logging jenkins.maven3.agent.Maven33Main /home/jenkins/tools/maven/apache-maven-3.3.9 /home/jenkins/jenkins-slave/slave.jar /home/jenkins/jenkins-slave/maven33-interceptor.jar /home/jenkins/jenkins-slave/maven3-interceptor-commons.jar 45200
<===[JENKINS REMOTING CAPACITY]===>   channel started
Executing Maven:  -B -f <https://builds.apache.org/job/dist-tool-plugin/ws/pom.xml> -Dmaven.repo.local=/home/jenkins/jenkins-slave/maven-repositories/1 -B -e -Preporting -Papache.snapshots -Dscreenshot=false clean install site
[INFO] Error stacktraces are turned on.
[INFO] Scanning for projects...
[INFO]                                                                        
[INFO] ------------------------------------------------------------------------
[INFO] Building dist-tool-plugin 1.0-SNAPSHOT
[INFO] ------------------------------------------------------------------------
[INFO]
[INFO] --- maven-clean-plugin:3.0.0:clean (default-clean) @ dist-tool-plugin ---
[INFO]
[INFO] --- maven-enforcer-plugin:1.4.1:enforce (enforce-maven-version) @ dist-tool-plugin ---
[INFO]
[INFO] --- maven-enforcer-plugin:1.4.1:enforce (enforce-bytecode-version) @ dist-tool-plugin ---
[INFO]
[INFO] --- maven-enforcer-plugin:1.4.1:enforce (ban-known-bad-maven-versions) @ dist-tool-plugin ---
[INFO]
[INFO] --- apache-rat-plugin:0.12:check (rat-check) @ dist-tool-plugin ---
[INFO] Enabled default license matchers.
[INFO] Will parse SCM ignores for exclusions...
[INFO] Parsing exclusions from <https://builds.apache.org/job/dist-tool-plugin/ws/.gitignore>
[INFO] Finished adding exclusions from SCM ignore files.
[INFO] 69 implicit excludes (use -debug for more details).
[INFO] Exclude: .repository/**
[INFO] Exclude: .maven/spy.log
[INFO] Exclude: dependency-reduced-pom.xml
[INFO] Exclude: .java-version
[INFO] Exclude: .repository/**
[INFO] 38 resources included (use -debug for more details)
[INFO] Rat check: Summary over all files. Unapproved: 0, unknown: 0, generated: 0, approved: 37 licenses.
[INFO]
[INFO] --- maven-plugin-plugin:3.5.1:helpmojo (generated-helpmojo) @ dist-tool-plugin ---
[INFO] Using 'UTF-8' encoding to read mojo source files.
[INFO] java-javadoc mojo extractor found 0 mojo descriptor.
[INFO] java-annotations mojo extractor found 0 mojo descriptor.
[INFO]
[INFO] --- maven-remote-resources-plugin:1.5:process (process-resource-bundles) @ dist-tool-plugin ---
[INFO]
[INFO] --- maven-resources-plugin:3.0.2:resources (default-resources) @ dist-tool-plugin ---
[INFO] Using 'UTF-8' encoding to copy filtered resources.
[INFO] Copying 1 resource
[INFO] Copying 3 resources
[INFO]
[INFO] --- maven-compiler-plugin:3.7.0:compile (default-compile) @ dist-tool-plugin ---
[INFO] Changes detected - recompiling the module!
[INFO] Compiling 21 source files to <https://builds.apache.org/job/dist-tool-plugin/ws/target/classes>
[INFO] <https://builds.apache.org/job/dist-tool-plugin/ws/src/main/java/org/apache/maven/dist/tools/site/DistCheckSiteMojo.java>: <https://builds.apache.org/job/dist-tool-plugin/ws/src/main/java/org/apache/maven/dist/tools/site/DistCheckSiteMojo.java> uses or overrides a deprecated API.
[INFO] <https://builds.apache.org/job/dist-tool-plugin/ws/src/main/java/org/apache/maven/dist/tools/site/DistCheckSiteMojo.java>: Recompile with -Xlint:deprecation for details.
[INFO] <https://builds.apache.org/job/dist-tool-plugin/ws/src/main/java/org/apache/maven/dist/tools/prerequisites/ListPluginsPrerequisitesMojo.java>: <https://builds.apache.org/job/dist-tool-plugin/ws/src/main/java/org/apache/maven/dist/tools/prerequisites/ListPluginsPrerequisitesMojo.java> uses unchecked or unsafe operations.
[INFO] <https://builds.apache.org/job/dist-tool-plugin/ws/src/main/java/org/apache/maven/dist/tools/prerequisites/ListPluginsPrerequisitesMojo.java>: Recompile with -Xlint:unchecked for details.
[INFO]
[INFO] --- maven-plugin-plugin:3.5.1:descriptor (default-descriptor) @ dist-tool-plugin ---
[INFO] Using 'UTF-8' encoding to read mojo source files.
[INFO] java-javadoc mojo extractor found 0 mojo descriptor.
[INFO] java-annotations mojo extractor found 7 mojo descriptors.
[INFO]
[INFO] --- maven-resources-plugin:3.0.2:testResources (default-testResources) @ dist-tool-plugin ---
[INFO] Using 'UTF-8' encoding to copy filtered resources.
[INFO] skip non existing resourceDirectory <https://builds.apache.org/job/dist-tool-plugin/ws/src/test/resources>
[INFO] Copying 3 resources
[INFO]
[INFO] --- maven-compiler-plugin:3.7.0:testCompile (default-testCompile) @ dist-tool-plugin ---
[INFO] Changes detected - recompiling the module!
[INFO] Compiling 1 source file to <https://builds.apache.org/job/dist-tool-plugin/ws/target/test-classes>
[INFO]
[INFO] --- maven-surefire-plugin:2.20.1:test (default-test) @ dist-tool-plugin ---
[INFO] Surefire report directory: <https://builds.apache.org/job/dist-tool-plugin/ws/target/surefire-reports>
[INFO]
[INFO] -------------------------------------------------------
[INFO]  T E S T S
[INFO] -------------------------------------------------------
[INFO] Running org.apache.maven.dist.tools.source.PatternTest
[INFO] Tests run: 1, Failures: 0, Errors: 0, Skipped: 0, Time elapsed: 0.069 s - in org.apache.maven.dist.tools.source.PatternTest
[INFO]
[INFO] Results:
[INFO]
[INFO] Tests run: 1, Failures: 0, Errors: 0, Skipped: 0
[INFO]
[JENKINS] Recording test results
[INFO]
[INFO] --- maven-jar-plugin:3.0.2:jar (default-jar) @ dist-tool-plugin ---
[INFO] Building jar: <https://builds.apache.org/job/dist-tool-plugin/ws/target/dist-tool-plugin-1.0-SNAPSHOT.jar>
[INFO]
[INFO] --- maven-plugin-plugin:3.5.1:addPluginArtifactMetadata (default-addPluginArtifactMetadata) @ dist-tool-plugin ---
[INFO]
[INFO] --- maven-site-plugin:3.7:attach-descriptor (attach-descriptor) @ dist-tool-plugin ---
[INFO] Skipping because packaging 'maven-plugin' is not pom.
[INFO]
[INFO] --- maven-checkstyle-plugin:3.0.0:check (checkstyle-check) @ dist-tool-plugin ---
[INFO] There are 2 errors reported by Checkstyle 6.18 with config/maven_checks.xml ruleset.
[ERROR] src/main/java/org/apache/maven/dist/tools/DistCheckErrorsMojo.java:[83,40] (whitespace) ParenPad: '(' is not followed by whitespace.
[ERROR] src/main/java/org/apache/maven/dist/tools/DistCheckErrorsMojo.java:[83,67] (whitespace) ParenPad: ')' is not preceded with whitespace.
[INFO] ------------------------------------------------------------------------
[INFO] BUILD FAILURE
[INFO] ------------------------------------------------------------------------
[INFO] Total time: 01:35 min
[INFO] Finished at: 2018-04-18T10:09:38+00:00
[INFO] Final Memory: 56M/763M
[INFO] ------------------------------------------------------------------------
[WARNING] The requested profile "apache.snapshots" could not be activated because it does not exist.
Waiting for Jenkins to finish collecting data
[ERROR] Failed to execute goal org.apache.maven.plugins:maven-checkstyle-plugin:3.0.0:check (checkstyle-check) on project dist-tool-plugin: You have 2 Checkstyle violations. -> [Help 1]
org.apache.maven.lifecycle.LifecycleExecutionException: Failed to execute goal org.apache.maven.plugins:maven-checkstyle-plugin:3.0.0:check (checkstyle-check) on project dist-tool-plugin: You have 2 Checkstyle violations.
        at org.apache.maven.lifecycle.internal.MojoExecutor.execute(MojoExecutor.java:212)
        at org.apache.maven.lifecycle.internal.MojoExecutor.execute(MojoExecutor.java:153)
        at org.apache.maven.lifecycle.internal.MojoExecutor.execute(MojoExecutor.java:145)
        at org.apache.maven.lifecycle.internal.LifecycleModuleBuilder.buildProject(LifecycleModuleBuilder.java:116)
        at org.apache.maven.lifecycle.internal.LifecycleModuleBuilder.buildProject(LifecycleModuleBuilder.java:80)
        at org.apache.maven.lifecycle.internal.builder.singlethreaded.SingleThreadedBuilder.build(SingleThreadedBuilder.java:51)
        at org.apache.maven.lifecycle.internal.LifecycleStarter.execute(LifecycleStarter.java:128)
        at org.apache.maven.DefaultMaven.doExecute(DefaultMaven.java:307)
        at org.apache.maven.DefaultMaven.doExecute(DefaultMaven.java:193)
        at org.apache.maven.DefaultMaven.execute(DefaultMaven.java:106)
        at org.jvnet.hudson.maven3.launcher.Maven33Launcher.main(Maven33Launcher.java:129)
        at sun.reflect.NativeMethodAccessorImpl.invoke0(Native Method)
        at sun.reflect.NativeMethodAccessorImpl.invoke(NativeMethodAccessorImpl.java:62)
        at sun.reflect.DelegatingMethodAccessorImpl.invoke(DelegatingMethodAccessorImpl.java:43)
        at java.lang.reflect.Method.invoke(Method.java:498)
        at org.codehaus.plexus.classworlds.launcher.Launcher.launchStandard(Launcher.java:330)
        at org.codehaus.plexus.classworlds.launcher.Launcher.launch(Launcher.java:238)
        at jenkins.maven3.agent.Maven33Main.launch(Maven33Main.java:176)
        at sun.reflect.NativeMethodAccessorImpl.invoke0(Native Method)
        at sun.reflect.NativeMethodAccessorImpl.invoke(NativeMethodAccessorImpl.java:62)
        at sun.reflect.DelegatingMethodAccessorImpl.invoke(DelegatingMethodAccessorImpl.java:43)
        at java.lang.reflect.Method.invoke(Method.java:498)
        at hudson.maven.Maven3Builder.call(Maven3Builder.java:139)
        at hudson.maven.Maven3Builder.call(Maven3Builder.java:70)
        at hudson.remoting.UserRequest.perform(UserRequest.java:207)
        at hudson.remoting.UserRequest.perform(UserRequest.java:53)
        at hudson.remoting.Request$2.run(Request.java:358)
        at hudson.remoting.InterceptingExecutorService$1.call(InterceptingExecutorService.java:72)
        at java.util.concurrent.FutureTask.run(FutureTask.java:266)
        at java.util.concurrent.ThreadPoolExecutor.runWorker(ThreadPoolExecutor.java:1149)
        at java.util.concurrent.ThreadPoolExecutor$Worker.run(ThreadPoolExecutor.java:624)
        at java.lang.Thread.run(Thread.java:748)
Caused by: org.apache.maven.plugin.MojoFailureException: You have 2 Checkstyle violations.
        at org.apache.maven.plugins.checkstyle.CheckstyleViolationCheckMojo.execute(CheckstyleViolationCheckMojo.java:576)
        at org.apache.maven.plugin.DefaultBuildPluginManager.executeMojo(DefaultBuildPluginManager.java:134)
        at org.apache.maven.lifecycle.internal.MojoExecutor.execute(MojoExecutor.java:207)
        ... 31 more
[ERROR]
[ERROR] Re-run Maven using the -X switch to enable full debug logging.
[ERROR]
[ERROR] For more information about the errors and possible solutions, please read the following articles:
[ERROR] [Help 1] http://cwiki.apache.org/confluence/display/MAVEN/MojoFailureException
[JENKINS] Archiving <https://builds.apache.org/job/dist-tool-plugin/ws/pom.xml> to org.apache.maven.dist.tools/dist-tool-plugin/1.0-SNAPSHOT/dist-tool-plugin-1.0-SNAPSHOT.pom
[JENKINS] Archiving <https://builds.apache.org/job/dist-tool-plugin/ws/target/dist-tool-plugin-1.0-SNAPSHOT.jar> to org.apache.maven.dist.tools/dist-tool-plugin/1.0-SNAPSHOT/dist-tool-plugin-1.0-SNAPSHOT.jar
channel stopped
Reply | Threaded
Open this post in threaded view
|

Build failed in Jenkins: dist-tool-plugin #2151

Apache Jenkins Server-2
See <https://builds.apache.org/job/dist-tool-plugin/2151/display/redirect>

------------------------------------------
Started by timer
[EnvInject] - Loading node environment variables.
Building remotely on H26 (ubuntu xenial) in workspace <https://builds.apache.org/job/dist-tool-plugin/ws/>
 > git rev-parse --is-inside-work-tree # timeout=10
Fetching changes from the remote Git repository
 > git config remote.origin.url https://gitbox.apache.org/repos/asf/maven-dist-tool.git # timeout=10
Fetching upstream changes from https://gitbox.apache.org/repos/asf/maven-dist-tool.git
 > git --version # timeout=10
 > git fetch --tags --progress https://gitbox.apache.org/repos/asf/maven-dist-tool.git +refs/heads/*:refs/remotes/origin/*
 > git rev-parse refs/remotes/origin/master^{commit} # timeout=10
 > git rev-parse refs/remotes/origin/origin/master^{commit} # timeout=10
Checking out Revision f7c55be8cb524d6c0384befbe8b14aa3e6caa159 (refs/remotes/origin/master)
 > git config core.sparsecheckout # timeout=10
 > git checkout -f f7c55be8cb524d6c0384befbe8b14aa3e6caa159
Commit message: "Replaced deprecated verbatim (true) with verbatim (SinkEventAttributeSet.BOXED)."
 > git rev-list --no-walk f7c55be8cb524d6c0384befbe8b14aa3e6caa159 # timeout=10
Parsing POMs
Established TCP socket on 44229
maven33-agent.jar already up to date
maven33-interceptor.jar already up to date
maven3-interceptor-commons.jar already up to date
[dist-tool-plugin] $ /home/jenkins/tools/java/latest1.8/bin/java -Xmx2g -Xms256m -cp /home/jenkins/jenkins-slave/maven33-agent.jar:/home/jenkins/tools/maven/apache-maven-3.3.9/boot/plexus-classworlds-2.5.2.jar:/home/jenkins/tools/maven/apache-maven-3.3.9/conf/logging jenkins.maven3.agent.Maven33Main /home/jenkins/tools/maven/apache-maven-3.3.9 /home/jenkins/jenkins-slave/slave.jar /home/jenkins/jenkins-slave/maven33-interceptor.jar /home/jenkins/jenkins-slave/maven3-interceptor-commons.jar 44229
<===[JENKINS REMOTING CAPACITY]===>   channel started
Executing Maven:  -B -f <https://builds.apache.org/job/dist-tool-plugin/ws/pom.xml> -Dmaven.repo.local=/home/jenkins/jenkins-slave/maven-repositories/1 -B -e -Preporting -Papache.snapshots -Dscreenshot=false clean install site
[INFO] Error stacktraces are turned on.
[INFO] Scanning for projects...
[INFO]                                                                        
[INFO] ------------------------------------------------------------------------
[INFO] Building dist-tool-plugin 1.0-SNAPSHOT
[INFO] ------------------------------------------------------------------------
[INFO]
[INFO] --- maven-clean-plugin:3.0.0:clean (default-clean) @ dist-tool-plugin ---
[INFO] Deleting <https://builds.apache.org/job/dist-tool-plugin/ws/target>
[INFO]
[INFO] --- maven-enforcer-plugin:1.4.1:enforce (enforce-maven-version) @ dist-tool-plugin ---
[INFO]
[INFO] --- maven-enforcer-plugin:1.4.1:enforce (enforce-bytecode-version) @ dist-tool-plugin ---
[INFO]
[INFO] --- maven-enforcer-plugin:1.4.1:enforce (ban-known-bad-maven-versions) @ dist-tool-plugin ---
[INFO]
[INFO] --- apache-rat-plugin:0.12:check (rat-check) @ dist-tool-plugin ---
[INFO] Enabled default license matchers.
[INFO] Will parse SCM ignores for exclusions...
[INFO] Parsing exclusions from <https://builds.apache.org/job/dist-tool-plugin/ws/.gitignore>
[INFO] Finished adding exclusions from SCM ignore files.
[INFO] 69 implicit excludes (use -debug for more details).
[INFO] Exclude: .repository/**
[INFO] Exclude: .maven/spy.log
[INFO] Exclude: dependency-reduced-pom.xml
[INFO] Exclude: .java-version
[INFO] Exclude: .repository/**
[INFO] 38 resources included (use -debug for more details)
[INFO] Rat check: Summary over all files. Unapproved: 0, unknown: 0, generated: 0, approved: 37 licenses.
[INFO]
[INFO] --- maven-plugin-plugin:3.5.1:helpmojo (generated-helpmojo) @ dist-tool-plugin ---
[INFO] Using 'UTF-8' encoding to read mojo source files.
[INFO] java-javadoc mojo extractor found 0 mojo descriptor.
[INFO] java-annotations mojo extractor found 0 mojo descriptor.
[INFO]
[INFO] --- maven-remote-resources-plugin:1.5:process (process-resource-bundles) @ dist-tool-plugin ---
[INFO]
[INFO] --- maven-resources-plugin:3.0.2:resources (default-resources) @ dist-tool-plugin ---
[INFO] Using 'UTF-8' encoding to copy filtered resources.
[INFO] Copying 1 resource
[INFO] Copying 3 resources
[INFO]
[INFO] --- maven-compiler-plugin:3.7.0:compile (default-compile) @ dist-tool-plugin ---
[INFO] Changes detected - recompiling the module!
[INFO] Compiling 21 source files to <https://builds.apache.org/job/dist-tool-plugin/ws/target/classes>
[INFO] <https://builds.apache.org/job/dist-tool-plugin/ws/src/main/java/org/apache/maven/dist/tools/site/DistCheckSiteMojo.java>: <https://builds.apache.org/job/dist-tool-plugin/ws/src/main/java/org/apache/maven/dist/tools/site/DistCheckSiteMojo.java> uses or overrides a deprecated API.
[INFO] <https://builds.apache.org/job/dist-tool-plugin/ws/src/main/java/org/apache/maven/dist/tools/site/DistCheckSiteMojo.java>: Recompile with -Xlint:deprecation for details.
[INFO] <https://builds.apache.org/job/dist-tool-plugin/ws/src/main/java/org/apache/maven/dist/tools/prerequisites/ListPluginsPrerequisitesMojo.java>: <https://builds.apache.org/job/dist-tool-plugin/ws/src/main/java/org/apache/maven/dist/tools/prerequisites/ListPluginsPrerequisitesMojo.java> uses unchecked or unsafe operations.
[INFO] <https://builds.apache.org/job/dist-tool-plugin/ws/src/main/java/org/apache/maven/dist/tools/prerequisites/ListPluginsPrerequisitesMojo.java>: Recompile with -Xlint:unchecked for details.
[INFO]
[INFO] --- maven-plugin-plugin:3.5.1:descriptor (default-descriptor) @ dist-tool-plugin ---
[INFO] Using 'UTF-8' encoding to read mojo source files.
[INFO] java-javadoc mojo extractor found 0 mojo descriptor.
[INFO] java-annotations mojo extractor found 7 mojo descriptors.
[INFO]
[INFO] --- maven-resources-plugin:3.0.2:testResources (default-testResources) @ dist-tool-plugin ---
[INFO] Using 'UTF-8' encoding to copy filtered resources.
[INFO] skip non existing resourceDirectory <https://builds.apache.org/job/dist-tool-plugin/ws/src/test/resources>
[INFO] Copying 3 resources
[INFO]
[INFO] --- maven-compiler-plugin:3.7.0:testCompile (default-testCompile) @ dist-tool-plugin ---
[INFO] Changes detected - recompiling the module!
[INFO] Compiling 1 source file to <https://builds.apache.org/job/dist-tool-plugin/ws/target/test-classes>
[INFO]
[INFO] --- maven-surefire-plugin:2.20.1:test (default-test) @ dist-tool-plugin ---
[INFO] Surefire report directory: <https://builds.apache.org/job/dist-tool-plugin/ws/target/surefire-reports>
[INFO]
[INFO] -------------------------------------------------------
[INFO]  T E S T S
[INFO] -------------------------------------------------------
[INFO] Running org.apache.maven.dist.tools.source.PatternTest
[INFO] Tests run: 1, Failures: 0, Errors: 0, Skipped: 0, Time elapsed: 0.048 s - in org.apache.maven.dist.tools.source.PatternTest
[INFO]
[INFO] Results:
[INFO]
[INFO] Tests run: 1, Failures: 0, Errors: 0, Skipped: 0
[INFO]
[JENKINS] Recording test results
[INFO]
[INFO] --- maven-jar-plugin:3.0.2:jar (default-jar) @ dist-tool-plugin ---
[INFO] Building jar: <https://builds.apache.org/job/dist-tool-plugin/ws/target/dist-tool-plugin-1.0-SNAPSHOT.jar>
[INFO]
[INFO] --- maven-plugin-plugin:3.5.1:addPluginArtifactMetadata (default-addPluginArtifactMetadata) @ dist-tool-plugin ---
[INFO]
[INFO] --- maven-site-plugin:3.7:attach-descriptor (attach-descriptor) @ dist-tool-plugin ---
[INFO] Skipping because packaging 'maven-plugin' is not pom.
[INFO]
[INFO] --- maven-checkstyle-plugin:3.0.0:check (checkstyle-check) @ dist-tool-plugin ---
[INFO] There are 2 errors reported by Checkstyle 6.18 with config/maven_checks.xml ruleset.
[ERROR] src/main/java/org/apache/maven/dist/tools/DistCheckErrorsMojo.java:[83,40] (whitespace) ParenPad: '(' is not followed by whitespace.
[ERROR] src/main/java/org/apache/maven/dist/tools/DistCheckErrorsMojo.java:[83,67] (whitespace) ParenPad: ')' is not preceded with whitespace.
[INFO] ------------------------------------------------------------------------
[INFO] BUILD FAILURE
[INFO] ------------------------------------------------------------------------
[INFO] Total time: 01:17 min
[INFO] Finished at: 2018-04-19T09:52:40+00:00
[INFO] Final Memory: 56M/732M
[INFO] ------------------------------------------------------------------------
[WARNING] The requested profile "apache.snapshots" could not be activated because it does not exist.
Waiting for Jenkins to finish collecting data
[ERROR] Failed to execute goal org.apache.maven.plugins:maven-checkstyle-plugin:3.0.0:check (checkstyle-check) on project dist-tool-plugin: You have 2 Checkstyle violations. -> [Help 1]
org.apache.maven.lifecycle.LifecycleExecutionException: Failed to execute goal org.apache.maven.plugins:maven-checkstyle-plugin:3.0.0:check (checkstyle-check) on project dist-tool-plugin: You have 2 Checkstyle violations.
        at org.apache.maven.lifecycle.internal.MojoExecutor.execute(MojoExecutor.java:212)
        at org.apache.maven.lifecycle.internal.MojoExecutor.execute(MojoExecutor.java:153)
        at org.apache.maven.lifecycle.internal.MojoExecutor.execute(MojoExecutor.java:145)
        at org.apache.maven.lifecycle.internal.LifecycleModuleBuilder.buildProject(LifecycleModuleBuilder.java:116)
        at org.apache.maven.lifecycle.internal.LifecycleModuleBuilder.buildProject(LifecycleModuleBuilder.java:80)
        at org.apache.maven.lifecycle.internal.builder.singlethreaded.SingleThreadedBuilder.build(SingleThreadedBuilder.java:51)
        at org.apache.maven.lifecycle.internal.LifecycleStarter.execute(LifecycleStarter.java:128)
        at org.apache.maven.DefaultMaven.doExecute(DefaultMaven.java:307)
        at org.apache.maven.DefaultMaven.doExecute(DefaultMaven.java:193)
        at org.apache.maven.DefaultMaven.execute(DefaultMaven.java:106)
        at org.jvnet.hudson.maven3.launcher.Maven33Launcher.main(Maven33Launcher.java:129)
        at sun.reflect.NativeMethodAccessorImpl.invoke0(Native Method)
        at sun.reflect.NativeMethodAccessorImpl.invoke(NativeMethodAccessorImpl.java:62)
        at sun.reflect.DelegatingMethodAccessorImpl.invoke(DelegatingMethodAccessorImpl.java:43)
        at java.lang.reflect.Method.invoke(Method.java:498)
        at org.codehaus.plexus.classworlds.launcher.Launcher.launchStandard(Launcher.java:330)
        at org.codehaus.plexus.classworlds.launcher.Launcher.launch(Launcher.java:238)
        at jenkins.maven3.agent.Maven33Main.launch(Maven33Main.java:176)
        at sun.reflect.NativeMethodAccessorImpl.invoke0(Native Method)
        at sun.reflect.NativeMethodAccessorImpl.invoke(NativeMethodAccessorImpl.java:62)
        at sun.reflect.DelegatingMethodAccessorImpl.invoke(DelegatingMethodAccessorImpl.java:43)
        at java.lang.reflect.Method.invoke(Method.java:498)
        at hudson.maven.Maven3Builder.call(Maven3Builder.java:139)
        at hudson.maven.Maven3Builder.call(Maven3Builder.java:70)
        at hudson.remoting.UserRequest.perform(UserRequest.java:207)
        at hudson.remoting.UserRequest.perform(UserRequest.java:53)
        at hudson.remoting.Request$2.run(Request.java:358)
        at hudson.remoting.InterceptingExecutorService$1.call(InterceptingExecutorService.java:72)
        at java.util.concurrent.FutureTask.run(FutureTask.java:266)
        at java.util.concurrent.ThreadPoolExecutor.runWorker(ThreadPoolExecutor.java:1149)
        at java.util.concurrent.ThreadPoolExecutor$Worker.run(ThreadPoolExecutor.java:624)
        at java.lang.Thread.run(Thread.java:748)
Caused by: org.apache.maven.plugin.MojoFailureException: You have 2 Checkstyle violations.
        at org.apache.maven.plugins.checkstyle.CheckstyleViolationCheckMojo.execute(CheckstyleViolationCheckMojo.java:576)
        at org.apache.maven.plugin.DefaultBuildPluginManager.executeMojo(DefaultBuildPluginManager.java:134)
        at org.apache.maven.lifecycle.internal.MojoExecutor.execute(MojoExecutor.java:207)
        ... 31 more
[ERROR]
[ERROR] Re-run Maven using the -X switch to enable full debug logging.
[ERROR]
[ERROR] For more information about the errors and possible solutions, please read the following articles:
[ERROR] [Help 1] http://cwiki.apache.org/confluence/display/MAVEN/MojoFailureException
[JENKINS] Archiving <https://builds.apache.org/job/dist-tool-plugin/ws/pom.xml> to org.apache.maven.dist.tools/dist-tool-plugin/1.0-SNAPSHOT/dist-tool-plugin-1.0-SNAPSHOT.pom
[JENKINS] Archiving <https://builds.apache.org/job/dist-tool-plugin/ws/target/dist-tool-plugin-1.0-SNAPSHOT.jar> to org.apache.maven.dist.tools/dist-tool-plugin/1.0-SNAPSHOT/dist-tool-plugin-1.0-SNAPSHOT.jar
channel stopped
Reply | Threaded
Open this post in threaded view
|

Build failed in Jenkins: dist-tool-plugin #2152

Apache Jenkins Server-2
See <https://builds.apache.org/job/dist-tool-plugin/2152/display/redirect>

------------------------------------------
Started by timer
[EnvInject] - Loading node environment variables.
Building remotely on H35 (ubuntu xenial) in workspace <https://builds.apache.org/job/dist-tool-plugin/ws/>
 > git rev-parse --is-inside-work-tree # timeout=10
Fetching changes from the remote Git repository
 > git config remote.origin.url https://gitbox.apache.org/repos/asf/maven-dist-tool.git # timeout=10
Fetching upstream changes from https://gitbox.apache.org/repos/asf/maven-dist-tool.git
 > git --version # timeout=10
 > git fetch --tags --progress https://gitbox.apache.org/repos/asf/maven-dist-tool.git +refs/heads/*:refs/remotes/origin/*
 > git rev-parse refs/remotes/origin/master^{commit} # timeout=10
 > git rev-parse refs/remotes/origin/origin/master^{commit} # timeout=10
Checking out Revision f7c55be8cb524d6c0384befbe8b14aa3e6caa159 (refs/remotes/origin/master)
 > git config core.sparsecheckout # timeout=10
 > git checkout -f f7c55be8cb524d6c0384befbe8b14aa3e6caa159
Commit message: "Replaced deprecated verbatim (true) with verbatim (SinkEventAttributeSet.BOXED)."
 > git rev-list --no-walk f7c55be8cb524d6c0384befbe8b14aa3e6caa159 # timeout=10
Parsing POMs
Established TCP socket on 38009
maven33-agent.jar already up to date
maven33-interceptor.jar already up to date
maven3-interceptor-commons.jar already up to date
[dist-tool-plugin] $ /home/jenkins/tools/java/latest1.8/bin/java -Xmx2g -Xms256m -cp /home/jenkins/jenkins-slave/maven33-agent.jar:/home/jenkins/tools/maven/apache-maven-3.3.9/boot/plexus-classworlds-2.5.2.jar:/home/jenkins/tools/maven/apache-maven-3.3.9/conf/logging jenkins.maven3.agent.Maven33Main /home/jenkins/tools/maven/apache-maven-3.3.9 /home/jenkins/jenkins-slave/slave.jar /home/jenkins/jenkins-slave/maven33-interceptor.jar /home/jenkins/jenkins-slave/maven3-interceptor-commons.jar 38009
<===[JENKINS REMOTING CAPACITY]===>   channel started
Executing Maven:  -B -f <https://builds.apache.org/job/dist-tool-plugin/ws/pom.xml> -Dmaven.repo.local=/home/jenkins/jenkins-slave/maven-repositories/1 -B -e -Preporting -Papache.snapshots -Dscreenshot=false clean install site
[INFO] Error stacktraces are turned on.
[INFO] Scanning for projects...
[INFO]                                                                        
[INFO] ------------------------------------------------------------------------
[INFO] Building dist-tool-plugin 1.0-SNAPSHOT
[INFO] ------------------------------------------------------------------------
[INFO]
[INFO] --- maven-clean-plugin:3.0.0:clean (default-clean) @ dist-tool-plugin ---
[INFO] Deleting <https://builds.apache.org/job/dist-tool-plugin/ws/target>
[INFO]
[INFO] --- maven-enforcer-plugin:1.4.1:enforce (enforce-maven-version) @ dist-tool-plugin ---
[INFO]
[INFO] --- maven-enforcer-plugin:1.4.1:enforce (enforce-bytecode-version) @ dist-tool-plugin ---
[INFO]
[INFO] --- maven-enforcer-plugin:1.4.1:enforce (ban-known-bad-maven-versions) @ dist-tool-plugin ---
[INFO]
[INFO] --- apache-rat-plugin:0.12:check (rat-check) @ dist-tool-plugin ---
[INFO] Enabled default license matchers.
[INFO] Will parse SCM ignores for exclusions...
[INFO] Parsing exclusions from <https://builds.apache.org/job/dist-tool-plugin/ws/.gitignore>
[INFO] Finished adding exclusions from SCM ignore files.
[INFO] 69 implicit excludes (use -debug for more details).
[INFO] Exclude: .repository/**
[INFO] Exclude: .maven/spy.log
[INFO] Exclude: dependency-reduced-pom.xml
[INFO] Exclude: .java-version
[INFO] Exclude: .repository/**
[INFO] 38 resources included (use -debug for more details)
[INFO] Rat check: Summary over all files. Unapproved: 0, unknown: 0, generated: 0, approved: 37 licenses.
[INFO]
[INFO] --- maven-plugin-plugin:3.5.1:helpmojo (generated-helpmojo) @ dist-tool-plugin ---
[INFO] Using 'UTF-8' encoding to read mojo source files.
[INFO] java-javadoc mojo extractor found 0 mojo descriptor.
[INFO] java-annotations mojo extractor found 0 mojo descriptor.
[INFO]
[INFO] --- maven-remote-resources-plugin:1.5:process (process-resource-bundles) @ dist-tool-plugin ---
[INFO]
[INFO] --- maven-resources-plugin:3.0.2:resources (default-resources) @ dist-tool-plugin ---
[INFO] Using 'UTF-8' encoding to copy filtered resources.
[INFO] Copying 1 resource
[INFO] Copying 3 resources
[INFO]
[INFO] --- maven-compiler-plugin:3.7.0:compile (default-compile) @ dist-tool-plugin ---
[INFO] Changes detected - recompiling the module!
[INFO] Compiling 21 source files to <https://builds.apache.org/job/dist-tool-plugin/ws/target/classes>
[INFO] <https://builds.apache.org/job/dist-tool-plugin/ws/src/main/java/org/apache/maven/dist/tools/site/DistCheckSiteMojo.java>: <https://builds.apache.org/job/dist-tool-plugin/ws/src/main/java/org/apache/maven/dist/tools/site/DistCheckSiteMojo.java> uses or overrides a deprecated API.
[INFO] <https://builds.apache.org/job/dist-tool-plugin/ws/src/main/java/org/apache/maven/dist/tools/site/DistCheckSiteMojo.java>: Recompile with -Xlint:deprecation for details.
[INFO] <https://builds.apache.org/job/dist-tool-plugin/ws/src/main/java/org/apache/maven/dist/tools/prerequisites/ListPluginsPrerequisitesMojo.java>: <https://builds.apache.org/job/dist-tool-plugin/ws/src/main/java/org/apache/maven/dist/tools/prerequisites/ListPluginsPrerequisitesMojo.java> uses unchecked or unsafe operations.
[INFO] <https://builds.apache.org/job/dist-tool-plugin/ws/src/main/java/org/apache/maven/dist/tools/prerequisites/ListPluginsPrerequisitesMojo.java>: Recompile with -Xlint:unchecked for details.
[INFO]
[INFO] --- maven-plugin-plugin:3.5.1:descriptor (default-descriptor) @ dist-tool-plugin ---
[INFO] Using 'UTF-8' encoding to read mojo source files.
[INFO] java-javadoc mojo extractor found 0 mojo descriptor.
[INFO] java-annotations mojo extractor found 7 mojo descriptors.
[INFO]
[INFO] --- maven-resources-plugin:3.0.2:testResources (default-testResources) @ dist-tool-plugin ---
[INFO] Using 'UTF-8' encoding to copy filtered resources.
[INFO] skip non existing resourceDirectory <https://builds.apache.org/job/dist-tool-plugin/ws/src/test/resources>
[INFO] Copying 3 resources
[INFO]
[INFO] --- maven-compiler-plugin:3.7.0:testCompile (default-testCompile) @ dist-tool-plugin ---
[INFO] Changes detected - recompiling the module!
[INFO] Compiling 1 source file to <https://builds.apache.org/job/dist-tool-plugin/ws/target/test-classes>
[INFO]
[INFO] --- maven-surefire-plugin:2.20.1:test (default-test) @ dist-tool-plugin ---
[INFO] Surefire report directory: <https://builds.apache.org/job/dist-tool-plugin/ws/target/surefire-reports>
[INFO]
[INFO] -------------------------------------------------------
[INFO]  T E S T S
[INFO] -------------------------------------------------------
[INFO] Running org.apache.maven.dist.tools.source.PatternTest
[INFO] Tests run: 1, Failures: 0, Errors: 0, Skipped: 0, Time elapsed: 0.074 s - in org.apache.maven.dist.tools.source.PatternTest
[INFO]
[INFO] Results:
[INFO]
[INFO] Tests run: 1, Failures: 0, Errors: 0, Skipped: 0
[INFO]
[JENKINS] Recording test results
[INFO]
[INFO] --- maven-jar-plugin:3.0.2:jar (default-jar) @ dist-tool-plugin ---
[INFO] Building jar: <https://builds.apache.org/job/dist-tool-plugin/ws/target/dist-tool-plugin-1.0-SNAPSHOT.jar>
[INFO]
[INFO] --- maven-plugin-plugin:3.5.1:addPluginArtifactMetadata (default-addPluginArtifactMetadata) @ dist-tool-plugin ---
[INFO]
[INFO] --- maven-site-plugin:3.7:attach-descriptor (attach-descriptor) @ dist-tool-plugin ---
[INFO] Skipping because packaging 'maven-plugin' is not pom.
[INFO]
[INFO] --- maven-checkstyle-plugin:3.0.0:check (checkstyle-check) @ dist-tool-plugin ---
[INFO] There are 2 errors reported by Checkstyle 6.18 with config/maven_checks.xml ruleset.
[ERROR] src/main/java/org/apache/maven/dist/tools/DistCheckErrorsMojo.java:[83,40] (whitespace) ParenPad: '(' is not followed by whitespace.
[ERROR] src/main/java/org/apache/maven/dist/tools/DistCheckErrorsMojo.java:[83,67] (whitespace) ParenPad: ')' is not preceded with whitespace.
[INFO] ------------------------------------------------------------------------
[INFO] BUILD FAILURE
[INFO] ------------------------------------------------------------------------
[INFO] Total time: 01:29 min
[INFO] Finished at: 2018-04-20T09:52:53+00:00
[INFO] Final Memory: 52M/821M
[INFO] ------------------------------------------------------------------------
[WARNING] The requested profile "apache.snapshots" could not be activated because it does not exist.
Waiting for Jenkins to finish collecting data
[ERROR] Failed to execute goal org.apache.maven.plugins:maven-checkstyle-plugin:3.0.0:check (checkstyle-check) on project dist-tool-plugin: You have 2 Checkstyle violations. -> [Help 1]
org.apache.maven.lifecycle.LifecycleExecutionException: Failed to execute goal org.apache.maven.plugins:maven-checkstyle-plugin:3.0.0:check (checkstyle-check) on project dist-tool-plugin: You have 2 Checkstyle violations.
        at org.apache.maven.lifecycle.internal.MojoExecutor.execute(MojoExecutor.java:212)
        at org.apache.maven.lifecycle.internal.MojoExecutor.execute(MojoExecutor.java:153)
        at org.apache.maven.lifecycle.internal.MojoExecutor.execute(MojoExecutor.java:145)
        at org.apache.maven.lifecycle.internal.LifecycleModuleBuilder.buildProject(LifecycleModuleBuilder.java:116)
        at org.apache.maven.lifecycle.internal.LifecycleModuleBuilder.buildProject(LifecycleModuleBuilder.java:80)
        at org.apache.maven.lifecycle.internal.builder.singlethreaded.SingleThreadedBuilder.build(SingleThreadedBuilder.java:51)
        at org.apache.maven.lifecycle.internal.LifecycleStarter.execute(LifecycleStarter.java:128)
        at org.apache.maven.DefaultMaven.doExecute(DefaultMaven.java:307)
        at org.apache.maven.DefaultMaven.doExecute(DefaultMaven.java:193)
        at org.apache.maven.DefaultMaven.execute(DefaultMaven.java:106)
        at org.jvnet.hudson.maven3.launcher.Maven33Launcher.main(Maven33Launcher.java:129)
        at sun.reflect.NativeMethodAccessorImpl.invoke0(Native Method)
        at sun.reflect.NativeMethodAccessorImpl.invoke(NativeMethodAccessorImpl.java:62)
        at sun.reflect.DelegatingMethodAccessorImpl.invoke(DelegatingMethodAccessorImpl.java:43)
        at java.lang.reflect.Method.invoke(Method.java:498)
        at org.codehaus.plexus.classworlds.launcher.Launcher.launchStandard(Launcher.java:330)
        at org.codehaus.plexus.classworlds.launcher.Launcher.launch(Launcher.java:238)
        at jenkins.maven3.agent.Maven33Main.launch(Maven33Main.java:176)
        at sun.reflect.NativeMethodAccessorImpl.invoke0(Native Method)
        at sun.reflect.NativeMethodAccessorImpl.invoke(NativeMethodAccessorImpl.java:62)
        at sun.reflect.DelegatingMethodAccessorImpl.invoke(DelegatingMethodAccessorImpl.java:43)
        at java.lang.reflect.Method.invoke(Method.java:498)
        at hudson.maven.Maven3Builder.call(Maven3Builder.java:139)
        at hudson.maven.Maven3Builder.call(Maven3Builder.java:70)
        at hudson.remoting.UserRequest.perform(UserRequest.java:207)
        at hudson.remoting.UserRequest.perform(UserRequest.java:53)
        at hudson.remoting.Request$2.run(Request.java:358)
        at hudson.remoting.InterceptingExecutorService$1.call(InterceptingExecutorService.java:72)
        at java.util.concurrent.FutureTask.run(FutureTask.java:266)
        at java.util.concurrent.ThreadPoolExecutor.runWorker(ThreadPoolExecutor.java:1149)
        at java.util.concurrent.ThreadPoolExecutor$Worker.run(ThreadPoolExecutor.java:624)
        at java.lang.Thread.run(Thread.java:748)
Caused by: org.apache.maven.plugin.MojoFailureException: You have 2 Checkstyle violations.
        at org.apache.maven.plugins.checkstyle.CheckstyleViolationCheckMojo.execute(CheckstyleViolationCheckMojo.java:576)
        at org.apache.maven.plugin.DefaultBuildPluginManager.executeMojo(DefaultBuildPluginManager.java:134)
        at org.apache.maven.lifecycle.internal.MojoExecutor.execute(MojoExecutor.java:207)
        ... 31 more
[ERROR]
[ERROR] Re-run Maven using the -X switch to enable full debug logging.
[ERROR]
[ERROR] For more information about the errors and possible solutions, please read the following articles:
[ERROR] [Help 1] http://cwiki.apache.org/confluence/display/MAVEN/MojoFailureException
[JENKINS] Archiving <https://builds.apache.org/job/dist-tool-plugin/ws/pom.xml> to org.apache.maven.dist.tools/dist-tool-plugin/1.0-SNAPSHOT/dist-tool-plugin-1.0-SNAPSHOT.pom
[JENKINS] Archiving <https://builds.apache.org/job/dist-tool-plugin/ws/target/dist-tool-plugin-1.0-SNAPSHOT.jar> to org.apache.maven.dist.tools/dist-tool-plugin/1.0-SNAPSHOT/dist-tool-plugin-1.0-SNAPSHOT.jar
channel stopped