Build failed in Jenkins: core-integration-testing-maven-3-embedded #7720

Previous Topic Next Topic
 
classic Classic list List threaded Threaded
2 messages Options
Reply | Threaded
Open this post in threaded view
|

Build failed in Jenkins: core-integration-testing-maven-3-embedded #7720

Apache Jenkins Server-2
See <https://builds.apache.org/job/core-integration-testing-maven-3-embedded/7720/display/redirect?page=changes>

Changes:

[stephen.alan.connolly] [MNG-6216] ArrayIndexOutOfBoundsException when parsing POM  o Upgraded

------------------------------------------
[...truncated 372.63 KB...]
[INFO] Exclude: .maven/spy.log
[INFO] Exclude: .java-version
[INFO] Exclude: README.md
[INFO] Exclude: DEPENDENCIES
[INFO] 44 resources included (use -debug for more details)
[INFO] Rat check: Summary of files. Unapproved: 0 unknown: 0 generated: 0 approved: 44 licence.
[INFO]
[INFO] --- modello-maven-plugin:1.9.1:java (modello) @ maven-embedder ---
[INFO] outputDirectory: <https://builds.apache.org/job/core-integration-testing-maven-3-embedded/ws/maven-3-trunk/maven-embedder/target/generated-sources/modello>
[INFO] Working on model: src/main/mdo/core-extensions.mdo
[INFO] Generating current version: 1.0.0
[INFO]
[INFO] --- modello-maven-plugin:1.9.1:xpp3-reader (modello) @ maven-embedder ---
[INFO] outputDirectory: <https://builds.apache.org/job/core-integration-testing-maven-3-embedded/ws/maven-3-trunk/maven-embedder/target/generated-sources/modello>
[INFO] Working on model: src/main/mdo/core-extensions.mdo
[INFO] Generating current version: 1.0.0
[INFO]
[INFO] --- modello-maven-plugin:1.9.1:xpp3-writer (modello) @ maven-embedder ---
[INFO] outputDirectory: <https://builds.apache.org/job/core-integration-testing-maven-3-embedded/ws/maven-3-trunk/maven-embedder/target/generated-sources/modello>
[INFO] Working on model: src/main/mdo/core-extensions.mdo
[INFO] Generating current version: 1.0.0
[INFO]
[INFO] --- maven-remote-resources-plugin:1.5:process (default) @ maven-embedder ---
[INFO]
[INFO] --- maven-resources-plugin:2.7:resources (default-resources) @ maven-embedder ---
[INFO] Using 'UTF-8' encoding to copy filtered resources.
[INFO] Copying 1 resource
[INFO] Copying 3 resources
[INFO]
[INFO] --- maven-compiler-plugin:3.2:compile (default-compile) @ maven-embedder ---
[INFO] Changes detected - recompiling the module!
[INFO] Compiling 31 source files to <https://builds.apache.org/job/core-integration-testing-maven-3-embedded/ws/maven-3-trunk/maven-embedder/target/classes>
[INFO] <https://builds.apache.org/job/core-integration-testing-maven-3-embedded/ws/maven-3-trunk/maven-embedder/src/main/java/org/apache/maven/cli/CLIManager.java>: <https://builds.apache.org/job/core-integration-testing-maven-3-embedded/ws/maven-3-trunk/maven-embedder/src/main/java/org/apache/maven/cli/CLIManager.java> uses or overrides a deprecated API.
[INFO] <https://builds.apache.org/job/core-integration-testing-maven-3-embedded/ws/maven-3-trunk/maven-embedder/src/main/java/org/apache/maven/cli/CLIManager.java>: Recompile with -Xlint:deprecation for details.
[INFO] <https://builds.apache.org/job/core-integration-testing-maven-3-embedded/ws/maven-3-trunk/maven-embedder/target/generated-sources/modello/org/apache/maven/cli/internal/extension/model/io/xpp3/CoreExtensionsXpp3Reader.java>: <https://builds.apache.org/job/core-integration-testing-maven-3-embedded/ws/maven-3-trunk/maven-embedder/target/generated-sources/modello/org/apache/maven/cli/internal/extension/model/io/xpp3/CoreExtensionsXpp3Reader.java> uses unchecked or unsafe operations.
[INFO] <https://builds.apache.org/job/core-integration-testing-maven-3-embedded/ws/maven-3-trunk/maven-embedder/target/generated-sources/modello/org/apache/maven/cli/internal/extension/model/io/xpp3/CoreExtensionsXpp3Reader.java>: Recompile with -Xlint:unchecked for details.
[INFO]
[INFO] --- animal-sniffer-maven-plugin:1.15:check (check-java-compat) @ maven-embedder ---
[INFO] Checking unresolved references to org.codehaus.mojo.signature:java17:1.0
[INFO]
[INFO] --- sisu-maven-plugin:0.3.3:main-index (default) @ maven-embedder ---
[INFO]
[INFO] --- plexus-component-metadata:1.7.1:generate-metadata (default) @ maven-embedder ---
[INFO] Discovered 1 component descriptors(s)
[INFO]
[INFO] --- maven-resources-plugin:2.7:testResources (default-testResources) @ maven-embedder ---
[INFO] Using 'UTF-8' encoding to copy filtered resources.
[INFO] Copying 7 resources
[INFO] Copying 3 resources
[INFO]
[INFO] --- maven-compiler-plugin:3.2:testCompile (default-testCompile) @ maven-embedder ---
[INFO] Changes detected - recompiling the module!
[INFO] Compiling 5 source files to <https://builds.apache.org/job/core-integration-testing-maven-3-embedded/ws/maven-3-trunk/maven-embedder/target/test-classes>
[INFO]
[INFO] --- sisu-maven-plugin:0.3.3:test-index (default) @ maven-embedder ---
[INFO]
[INFO] --- plexus-component-metadata:1.7.1:generate-test-metadata (default) @ maven-embedder ---
[INFO]
[INFO] --- maven-surefire-plugin:2.18.1:test (default-test) @ maven-embedder ---
[INFO] Tests are skipped.
[INFO]
[INFO] --- maven-jar-plugin:2.5:jar (default-jar) @ maven-embedder ---
[INFO] Building jar: <https://builds.apache.org/job/core-integration-testing-maven-3-embedded/ws/maven-3-trunk/maven-embedder/target/maven-embedder-3.5.1-SNAPSHOT.jar>
[INFO]
[INFO] --- maven-site-plugin:3.4:attach-descriptor (attach-descriptor) @ maven-embedder ---
[INFO]                                                                        
[INFO] ------------------------------------------------------------------------
[INFO] Building Maven Compat 3.5.1-SNAPSHOT
[INFO] ------------------------------------------------------------------------
[INFO]
[INFO] --- maven-clean-plugin:2.5:clean (default-clean) @ maven-compat ---
[INFO] Deleting <https://builds.apache.org/job/core-integration-testing-maven-3-embedded/ws/maven-3-trunk/maven-compat/target>
[INFO]
[INFO] --- maven-enforcer-plugin:1.3.1:enforce (enforce-bytecode-version) @ maven-compat ---
[INFO]
[INFO] --- maven-enforcer-plugin:1.3.1:enforce (ban-known-bad-maven-versions) @ maven-compat ---
[INFO]
[INFO] --- maven-enforcer-plugin:1.3.1:enforce (enforce-maven) @ maven-compat ---
[INFO]
[INFO] --- apache-rat-plugin:0.11:check (rat-check) @ maven-compat ---
[INFO] 51 implicit excludes (use -debug for more details).
[INFO] Exclude: src/test/resources*/**
[INFO] Exclude: src/test/projects/**
[INFO] Exclude: src/test/remote-repo/**
[INFO] Exclude: **/*.odg
[INFO] Exclude: bootstrap/**
[INFO] Exclude: README.bootstrap.txt
[INFO] Exclude: .repository/**
[INFO] Exclude: .maven/spy.log
[INFO] Exclude: .java-version
[INFO] Exclude: README.md
[INFO] Exclude: DEPENDENCIES
[INFO] 212 resources included (use -debug for more details)
[INFO] Rat check: Summary of files. Unapproved: 0 unknown: 0 generated: 0 approved: 211 licence.
[INFO]
[INFO] --- modello-maven-plugin:1.9.1:java (modello) @ maven-compat ---
[INFO] outputDirectory: <https://builds.apache.org/job/core-integration-testing-maven-3-embedded/ws/maven-3-trunk/maven-compat/target/generated-sources/modello>
[INFO] Working on model: src/main/mdo/profiles.mdo
[INFO] Generating current version: 1.0.0
[INFO] Working on model: src/main/mdo/paramdoc.mdo
[INFO] Generating current version: 1.0.0
[INFO]
[INFO] --- modello-maven-plugin:1.9.1:xpp3-reader (modello) @ maven-compat ---
[INFO] outputDirectory: <https://builds.apache.org/job/core-integration-testing-maven-3-embedded/ws/maven-3-trunk/maven-compat/target/generated-sources/modello>
[INFO] Working on model: src/main/mdo/profiles.mdo
[INFO] Generating current version: 1.0.0
[INFO] Working on model: src/main/mdo/paramdoc.mdo
[INFO] Generating current version: 1.0.0
[INFO]
[INFO] --- modello-maven-plugin:1.9.1:xpp3-writer (modello) @ maven-compat ---
[INFO] outputDirectory: <https://builds.apache.org/job/core-integration-testing-maven-3-embedded/ws/maven-3-trunk/maven-compat/target/generated-sources/modello>
[INFO] Working on model: src/main/mdo/profiles.mdo
[INFO] Generating current version: 1.0.0
[INFO] Working on model: src/main/mdo/paramdoc.mdo
[INFO] Generating current version: 1.0.0
[INFO]
[INFO] --- maven-remote-resources-plugin:1.5:process (default) @ maven-compat ---
[INFO]
[INFO] --- maven-resources-plugin:2.7:resources (default-resources) @ maven-compat ---
[INFO] Using 'UTF-8' encoding to copy filtered resources.
[INFO] Copying 4 resources
[INFO] Copying 3 resources
[INFO]
[INFO] --- maven-compiler-plugin:3.2:compile (default-compile) @ maven-compat ---
[INFO] Changes detected - recompiling the module!
[INFO] Compiling 146 source files to <https://builds.apache.org/job/core-integration-testing-maven-3-embedded/ws/maven-3-trunk/maven-compat/target/classes>
[INFO] <https://builds.apache.org/job/core-integration-testing-maven-3-embedded/ws/maven-3-trunk/maven-compat/src/main/java/org/apache/maven/project/interpolation/ModelInterpolator.java>: Some input files use or override a deprecated API.
[INFO] <https://builds.apache.org/job/core-integration-testing-maven-3-embedded/ws/maven-3-trunk/maven-compat/src/main/java/org/apache/maven/project/interpolation/ModelInterpolator.java>: Recompile with -Xlint:deprecation for details.
[INFO] <https://builds.apache.org/job/core-integration-testing-maven-3-embedded/ws/maven-3-trunk/maven-compat/target/generated-sources/modello/org/apache/maven/usability/plugin/ExpressionDocumentation.java>: Some input files use unchecked or unsafe operations.
[INFO] <https://builds.apache.org/job/core-integration-testing-maven-3-embedded/ws/maven-3-trunk/maven-compat/target/generated-sources/modello/org/apache/maven/usability/plugin/ExpressionDocumentation.java>: Recompile with -Xlint:unchecked for details.
[INFO]
[INFO] --- animal-sniffer-maven-plugin:1.15:check (check-java-compat) @ maven-compat ---
[INFO] Checking unresolved references to org.codehaus.mojo.signature:java17:1.0
[INFO]
[INFO] --- plexus-component-metadata:1.7.1:generate-metadata (default) @ maven-compat ---
[INFO] Discovered 34 component descriptors(s)
[INFO]
[INFO] --- maven-resources-plugin:2.7:testResources (default-testResources) @ maven-compat ---
[INFO] Using 'UTF-8' encoding to copy filtered resources.
[INFO] Copying 156 resources
[INFO] Copying 3 resources
[INFO]
[INFO] --- maven-compiler-plugin:3.2:testCompile (default-testCompile) @ maven-compat ---
[INFO] Changes detected - recompiling the module!
[INFO] Compiling 71 source files to <https://builds.apache.org/job/core-integration-testing-maven-3-embedded/ws/maven-3-trunk/maven-compat/target/test-classes>
[INFO] <https://builds.apache.org/job/core-integration-testing-maven-3-embedded/ws/maven-3-trunk/maven-compat/src/test/java/org/apache/maven/repository/legacy/resolver/conflict/AbstractConflictResolverTest.java>: Some input files use or override a deprecated API.
[INFO] <https://builds.apache.org/job/core-integration-testing-maven-3-embedded/ws/maven-3-trunk/maven-compat/src/test/java/org/apache/maven/repository/legacy/resolver/conflict/AbstractConflictResolverTest.java>: Recompile with -Xlint:deprecation for details.
[INFO] <https://builds.apache.org/job/core-integration-testing-maven-3-embedded/ws/maven-3-trunk/maven-compat/src/test/java/org/apache/maven/repository/legacy/resolver/DefaultArtifactCollectorTest.java>: <https://builds.apache.org/job/core-integration-testing-maven-3-embedded/ws/maven-3-trunk/maven-compat/src/test/java/org/apache/maven/repository/legacy/resolver/DefaultArtifactCollectorTest.java> uses unchecked or unsafe operations.
[INFO] <https://builds.apache.org/job/core-integration-testing-maven-3-embedded/ws/maven-3-trunk/maven-compat/src/test/java/org/apache/maven/repository/legacy/resolver/DefaultArtifactCollectorTest.java>: Recompile with -Xlint:unchecked for details.
[INFO]
[INFO] --- plexus-component-metadata:1.7.1:generate-test-metadata (default) @ maven-compat ---
[INFO] Discovered 12 component descriptors(s)
[INFO]
[INFO] --- maven-surefire-plugin:2.18.1:test (default-test) @ maven-compat ---
[INFO] Tests are skipped.
[INFO]
[INFO] --- maven-jar-plugin:2.5:jar (default-jar) @ maven-compat ---
[INFO] Building jar: <https://builds.apache.org/job/core-integration-testing-maven-3-embedded/ws/maven-3-trunk/maven-compat/target/maven-compat-3.5.1-SNAPSHOT.jar>
[INFO]
[INFO] --- maven-site-plugin:3.4:attach-descriptor (attach-descriptor) @ maven-compat ---
[INFO]                                                                        
[INFO] ------------------------------------------------------------------------
[INFO] Building Apache Maven Distribution 3.5.1-SNAPSHOT
[INFO] ------------------------------------------------------------------------
[INFO] Downloading: https://repo.maven.apache.org/maven2/org/apache/maven/plugins/maven-assembly-plugin/3.0.0/maven-assembly-plugin-3.0.0.pom
[INFO] Downloaded: https://repo.maven.apache.org/maven2/org/apache/maven/plugins/maven-assembly-plugin/3.0.0/maven-assembly-plugin-3.0.0.pom (16 KB at 940.2 KB/sec)
[INFO] Downloading: https://repo.maven.apache.org/maven2/org/apache/maven/plugins/maven-plugins/30/maven-plugins-30.pom
[INFO] Downloaded: https://repo.maven.apache.org/maven2/org/apache/maven/plugins/maven-plugins/30/maven-plugins-30.pom (10 KB at 662.2 KB/sec)
[INFO] Downloading: https://repo.maven.apache.org/maven2/org/apache/maven/plugins/maven-assembly-plugin/3.0.0/maven-assembly-plugin-3.0.0.jar
[INFO] Downloaded: https://repo.maven.apache.org/maven2/org/apache/maven/plugins/maven-assembly-plugin/3.0.0/maven-assembly-plugin-3.0.0.jar (235 KB at 11188.9 KB/sec)
[INFO] Downloading: https://repo.maven.apache.org/maven2/org/apache/maven/wagon/wagon-http/2.12/wagon-http-2.12.pom
[INFO] Downloaded: https://repo.maven.apache.org/maven2/org/apache/maven/wagon/wagon-http/2.12/wagon-http-2.12.pom (7 KB at 407.6 KB/sec)
[INFO] Downloading: https://repo.maven.apache.org/maven2/org/slf4j/jcl-over-slf4j/1.7.22/jcl-over-slf4j-1.7.22.pom
[INFO] Downloaded: https://repo.maven.apache.org/maven2/org/slf4j/jcl-over-slf4j/1.7.22/jcl-over-slf4j-1.7.22.pom (963 B at 67.2 KB/sec)
[INFO] Downloading: https://repo.maven.apache.org/maven2/org/apache/maven/wagon/wagon-http/2.12/wagon-http-2.12-shaded.jar
[INFO] Downloading: https://repo.maven.apache.org/maven2/org/slf4j/jcl-over-slf4j/1.7.22/jcl-over-slf4j-1.7.22.jar
[INFO] Downloaded: https://repo.maven.apache.org/maven2/org/slf4j/jcl-over-slf4j/1.7.22/jcl-over-slf4j-1.7.22.jar (17 KB at 949.0 KB/sec)
[INFO] Downloaded: https://repo.maven.apache.org/maven2/org/apache/maven/wagon/wagon-http/2.12/wagon-http-2.12-shaded.jar (2117 KB at 25496.4 KB/sec)
[INFO]
[INFO] --- maven-clean-plugin:2.5:clean (default-clean) @ apache-maven ---
[INFO] Deleting <https://builds.apache.org/job/core-integration-testing-maven-3-embedded/ws/maven-3-trunk/apache-maven/target>
[INFO]
[INFO] --- maven-enforcer-plugin:1.3.1:enforce (enforce-bytecode-version) @ apache-maven ---
[INFO]
[INFO] --- maven-enforcer-plugin:1.3.1:enforce (ban-known-bad-maven-versions) @ apache-maven ---
[INFO]
[INFO] --- maven-enforcer-plugin:1.3.1:enforce (enforce-maven) @ apache-maven ---
[INFO]
[INFO] --- apache-rat-plugin:0.11:check (rat-check) @ apache-maven ---
[INFO] 51 implicit excludes (use -debug for more details).
[INFO] Exclude: src/test/resources*/**
[INFO] Exclude: src/test/projects/**
[INFO] Exclude: src/test/remote-repo/**
[INFO] Exclude: **/*.odg
[INFO] Exclude: src/bin/m2.conf
[INFO] Exclude: bootstrap/**
[INFO] Exclude: README.bootstrap.txt
[INFO] Exclude: .repository/**
[INFO] Exclude: .maven/spy.log
[INFO] Exclude: .java-version
[INFO] Exclude: README.md
[INFO] Exclude: DEPENDENCIES
[INFO] 19 resources included (use -debug for more details)
[INFO] Rat check: Summary of files. Unapproved: 0 unknown: 0 generated: 0 approved: 16 licence.
[INFO]
[INFO] --- maven-dependency-plugin:2.8:unpack-dependencies (unpack-jansi-native) @ apache-maven ---
[INFO] Unpacking <https://builds.apache.org/job/core-integration-testing-maven-3-embedded/ws/.repository/org/fusesource/jansi/jansi/1.16/jansi-1.16.jar> to <https://builds.apache.org/job/core-integration-testing-maven-3-embedded/ws/maven-3-trunk/apache-maven/target/dependency> with includes "META-INF/native/**" and excludes ""
[INFO]
[INFO] --- maven-remote-resources-plugin:1.5:process (default) @ apache-maven ---
[INFO] ------------------------------------------------------------------------
[INFO] Reactor Summary:
[INFO]
[INFO] Apache Maven ....................................... SUCCESS [ 13.113 s]
[INFO] Maven Model ........................................ SUCCESS [  6.444 s]
[INFO] Maven Artifact ..................................... SUCCESS [  1.739 s]
[INFO] Maven Plugin API ................................... SUCCESS [  1.691 s]
[INFO] Maven Builder Support .............................. SUCCESS [  0.769 s]
[INFO] Maven Model Builder ................................ SUCCESS [  3.602 s]
[INFO] Maven Settings ..................................... SUCCESS [  0.734 s]
[INFO] Maven Settings Builder ............................. SUCCESS [  0.860 s]
[INFO] Maven Repository Metadata Model .................... SUCCESS [  0.479 s]
[INFO] Maven Artifact Resolver Provider ................... SUCCESS [  2.268 s]
[INFO] Maven Core ......................................... SUCCESS [  7.520 s]
[INFO] Maven SLF4J Simple Provider ........................ SUCCESS [  4.234 s]
[INFO] Maven Embedder ..................................... SUCCESS [  3.237 s]
[INFO] Maven Compat ....................................... SUCCESS [  4.317 s]
[INFO] Apache Maven Distribution .......................... FAILURE [04:16 min]
[INFO] ------------------------------------------------------------------------
[INFO] BUILD FAILURE
[INFO] ------------------------------------------------------------------------
[INFO] Total time: 05:09 min
[INFO] Finished at: 2017-08-31T09:50:47+00:00
[INFO] Final Memory: 150M/3005M
[INFO] ------------------------------------------------------------------------
[ERROR] Failed to execute goal org.apache.maven.plugins:maven-remote-resources-plugin:1.5:process (default) on project apache-maven: Error rendering velocity resource. Invocation of method 'getResourceAsFile' in  class org.codehaus.plexus.resource.DefaultResourceManager threw exception org.codehaus.plexus.resource.loader.ResourceNotFoundException: Could not find resource 'https://www.apache.org/licenses/LICENSE-2.0.txt'. at remote-resources[line 38, column 26] -> [Help 1]
[ERROR]
[ERROR] To see the full stack trace of the errors, re-run Maven with the -e switch.
[ERROR] Re-run Maven using the -X switch to enable full debug logging.
[ERROR]
[ERROR] For more information about the errors and possible solutions, please read the following articles:
[ERROR] [Help 1] http://cwiki.apache.org/confluence/display/MAVEN/MojoExecutionException
[ERROR]
[ERROR] After correcting the problems, you can resume the build with the command
[ERROR]   mvn <goals> -rf :apache-maven
Build step 'Invoke top-level Maven targets' marked build as failure
Recording test results
ERROR: Step ?Publish JUnit test result report? failed: Test reports were found but none of them are new. Did tests run?
For example, <https://builds.apache.org/job/core-integration-testing-maven-3-embedded/ws/core-integration-testing-trunk/core-it-suite/target/surefire-reports/TEST-org.apache.maven.it.IntegrationTestSuite.xml> is 15 days old

Reply | Threaded
Open this post in threaded view
|

Jenkins build is back to normal : core-integration-testing-maven-3-embedded #7721

Apache Jenkins Server-2