Build failed in Jenkins: Maven TLP (wip) » maven-archetype » master #1

Previous Topic Next Topic
 
classic Classic list List threaded Threaded
1 message Options
Reply | Threaded
Open this post in threaded view
|

Build failed in Jenkins: Maven TLP (wip) » maven-archetype » master #1

Apache Jenkins Server-2
See https://builds.apache.org/job/maven-wip/job/maven-archetype/job/master/1/

No changes.

No tests ran.

Build log:
[...truncated 2.12 MB...]
[windows-jdk7] [INFO] Downloading: https://repo.maven.apache.org/maven2/org/codehaus/plexus/plexus-utils/1.5.6/plexus-utils-1.5.6.pom
[windows-jdk7] [INFO] Downloaded: https://repo.maven.apache.org/maven2/org/codehaus/plexus/plexus-utils/1.5.6/plexus-utils-1.5.6.pom (5.3 kB at 183 kB/s)
[windows-jdk7] [INFO] Downloading: https://repo.maven.apache.org/maven2/org/codehaus/plexus/plexus/1.0.12/plexus-1.0.12.pom
[windows-jdk7] [INFO] Downloaded: https://repo.maven.apache.org/maven2/org/codehaus/plexus/plexus/1.0.12/plexus-1.0.12.pom (9.8 kB at 350 kB/s)
[windows-jdk7] [INFO] Downloading: https://repo.maven.apache.org/maven2/org/apache/maven/shared/maven-dependency-analyzer/1.6/maven-dependency-analyzer-1.6.pom
[windows-jdk7] [INFO] Downloaded: https://repo.maven.apache.org/maven2/org/apache/maven/shared/maven-dependency-analyzer/1.6/maven-dependency-analyzer-1.6.pom (5.4 kB at 160 kB/s)
[windows-jdk7] [INFO] Downloading: https://repo.maven.apache.org/maven2/org/ow2/asm/asm/5.0.2/asm-5.0.2.pom
[windows-jdk7] [INFO] Downloaded: https://repo.maven.apache.org/maven2/org/ow2/asm/asm/5.0.2/asm-5.0.2.pom (1.9 kB at 72 kB/s)
[windows-jdk7] [INFO] Downloading: https://repo.maven.apache.org/maven2/org/codehaus/plexus/plexus-utils/1.5.1/plexus-utils-1.5.1.pom
[windows-jdk7] Sending interrupt signal to process
[windows-jdk8] [INFO] ----------------------------------------------------------------------------
[windows-jdk8] [INFO] Using following parameters for creating project from Old (1.x) Archetype: maven-archetype-portlet:1.0.1
[windows-jdk8] [INFO] ----------------------------------------------------------------------------
[windows-jdk8] [INFO] Parameter: basedir, Value: F:\jenkins\jenkins-slave\workspace\-wip_maven-archetype_master-VY3HRMKJD7NBKSJUC3K2FGLVMJ3XZ5JVCJPRIMYIS7JQMQITBJLQ\m\archetype-common\target\internal-archetypes-projects
[windows-jdk8] [INFO] Parameter: package, Value: com.acme
[windows-jdk8] [INFO] Parameter: groupId, Value: org.apache.maven.archetype.test
[windows-jdk8] [INFO] Parameter: artifactId, Value: archetype5
[windows-jdk8] [INFO] Parameter: packageName, Value: com.acme
[windows-jdk8] [INFO] Parameter: version, Value: 1.0-SNAPSHOT
[windows-jdk8] [INFO] project created from Old (1.x) Archetype in dir: F:\jenkins\jenkins-slave\workspace\-wip_maven-archetype_master-VY3HRMKJD7NBKSJUC3K2FGLVMJ3XZ5JVCJPRIMYIS7JQMQITBJLQ\m\archetype-common\target\internal-archetypes-projects\archetype5
[windows-jdk8] [INFO] ----------------------------------------------------------------------------
[windows-jdk8] [INFO] Using following parameters for creating project from Old (1.x) Archetype: maven-archetype-profiles:1.0-alpha-4
[windows-jdk8] [INFO] ----------------------------------------------------------------------------
[windows-jdk8] [INFO] Parameter: basedir, Value: F:\jenkins\jenkins-slave\workspace\-wip_maven-archetype_master-VY3HRMKJD7NBKSJUC3K2FGLVMJ3XZ5JVCJPRIMYIS7JQMQITBJLQ\m\archetype-common\target\internal-archetypes-projects
[windows-jdk8] [INFO] Parameter: package, Value: com.acme
[windows-jdk8] [INFO] Parameter: groupId, Value: org.apache.maven.archetype.test
[windows-jdk8] [INFO] Parameter: artifactId, Value: archetype6
[windows-jdk8] [INFO] Parameter: packageName, Value: com.acme
[windows-jdk8] [INFO] Parameter: version, Value: 1.0-SNAPSHOT
[windows-jdk8] [INFO] project created from Old (1.x) Archetype in dir: F:\jenkins\jenkins-slave\workspace\-wip_maven-archetype_master-VY3HRMKJD7NBKSJUC3K2FGLVMJ3XZ5JVCJPRIMYIS7JQMQITBJLQ\m\archetype-common\target\internal-archetypes-projects\archetype6
[windows-jdk8] [INFO] ----------------------------------------------------------------------------
[windows-jdk8] [INFO] Using following parameters for creating project from Old (1.x) Archetype: maven-archetype-quickstart:1.1
[windows-jdk8] [INFO] ----------------------------------------------------------------------------
[windows-jdk8] [INFO] Parameter: basedir, Value: F:\jenkins\jenkins-slave\workspace\-wip_maven-archetype_master-VY3HRMKJD7NBKSJUC3K2FGLVMJ3XZ5JVCJPRIMYIS7JQMQITBJLQ\m\archetype-common\target\internal-archetypes-projects
[windows-jdk8] [INFO] Parameter: package, Value: com.acme
[windows-jdk8] [INFO] Parameter: groupId, Value: org.apache.maven.archetype.test
[windows-jdk8] [INFO] Parameter: artifactId, Value: archetype7
[windows-jdk8] [INFO] Parameter: packageName, Value: com.acme
[windows-jdk8] [INFO] Parameter: version, Value: 1.0-SNAPSHOT
[windows-jdk8] [INFO] project created from Old (1.x) Archetype in dir: F:\jenkins\jenkins-slave\workspace\-wip_maven-archetype_master-VY3HRMKJD7NBKSJUC3K2FGLVMJ3XZ5JVCJPRIMYIS7JQMQITBJLQ\m\archetype-common\target\internal-archetypes-projects\archetype7
[windows-jdk8] [INFO] ----------------------------------------------------------------------------
[windows-jdk8] [INFO] Using following parameters for creating project from Old (1.x) Archetype: maven-archetype-site:1.1
[windows-jdk8] [INFO] ----------------------------------------------------------------------------
[windows-jdk8] [INFO] Parameter: basedir, Value: F:\jenkins\jenkins-slave\workspace\-wip_maven-archetype_master-VY3HRMKJD7NBKSJUC3K2FGLVMJ3XZ5JVCJPRIMYIS7JQMQITBJLQ\m\archetype-common\target\internal-archetypes-projects
[windows-jdk8] [INFO] Parameter: package, Value: com.acme
[windows-jdk8] [INFO] Parameter: groupId, Value: org.apache.maven.archetype.test
[windows-jdk8] [INFO] Parameter: artifactId, Value: archetype8
[windows-jdk8] [INFO] Parameter: packageName, Value: com.acme
[windows-jdk8] [INFO] Parameter: version, Value: 1.0-SNAPSHOT
[windows-jdk8] [INFO] project created from Old (1.x) Archetype in dir: F:\jenkins\jenkins-slave\workspace\-wip_maven-archetype_master-VY3HRMKJD7NBKSJUC3K2FGLVMJ3XZ5JVCJPRIMYIS7JQMQITBJLQ\m\archetype-common\target\internal-archetypes-projects\archetype8
[windows-jdk8] [INFO] ----------------------------------------------------------------------------
[windows-jdk8] [INFO] Using following parameters for creating project from Old (1.x) Archetype: maven-archetype-site-simple:1.1
[windows-jdk8] [INFO] ----------------------------------------------------------------------------
[windows-jdk8] [INFO] Parameter: basedir, Value: F:\jenkins\jenkins-slave\workspace\-wip_maven-archetype_master-VY3HRMKJD7NBKSJUC3K2FGLVMJ3XZ5JVCJPRIMYIS7JQMQITBJLQ\m\archetype-common\target\internal-archetypes-projects
[windows-jdk8] [INFO] Parameter: package, Value: com.acme
[windows-jdk8] [INFO] Parameter: groupId, Value: org.apache.maven.archetype.test
[windows-jdk8] [INFO] Parameter: artifactId, Value: archetype9
[windows-jdk8] [INFO] Parameter: packageName, Value: com.acme
[windows-jdk8] [INFO] Parameter: version, Value: 1.0-SNAPSHOT
[windows-jdk8] [INFO] project created from Old (1.x) Archetype in dir: F:\jenkins\jenkins-slave\workspace\-wip_maven-archetype_master-VY3HRMKJD7NBKSJUC3K2FGLVMJ3XZ5JVCJPRIMYIS7JQMQITBJLQ\m\archetype-common\target\internal-archetypes-projects\archetype9
[windows-jdk7] [INFO] Downloaded: https://repo.maven.apache.org/maven2/org/codehaus/plexus/plexus-utils/1.5.1/plexus-utils-1.5.1.pom (2.3 kB at 72 kB/s)
[windows-jdk7] [INFO] Downloading: https://repo.maven.apache.org/maven2/org/apache/maven/maven-project/2.0.5/maven-project-2.0.5.pom
[windows-jdk7] [INFO] Downloaded: https://repo.maven.apache.org/maven2/org/apache/maven/maven-project/2.0.5/maven-project-2.0.5.pom (1.8 kB at 71 kB/s)
[windows-jdk7] [INFO] Downloading: https://repo.maven.apache.org/maven2/org/apache/maven/maven/2.0.5/maven-2.0.5.pom
[windows-jdk7] [INFO] Downloaded: https://repo.maven.apache.org/maven2/org/apache/maven/maven/2.0.5/maven-2.0.5.pom (5.7 kB at 197 kB/s)
[windows-jdk7] [INFO] Downloading: https://repo.maven.apache.org/maven2/org/apache/maven/maven-settings/2.0.5/maven-settings-2.0.5.pom
[windows-jdk7] [INFO] Downloaded: https://repo.maven.apache.org/maven2/org/apache/maven/maven-settings/2.0.5/maven-settings-2.0.5.pom (1.7 kB at 33 kB/s)
[windows-jdk7] [INFO] Downloading: https://repo.maven.apache.org/maven2/org/apache/maven/maven-model/2.0.5/maven-model-2.0.5.pom
[windows-jdk8] [INFO] ----------------------------------------------------------------------------
[windows-jdk8] [INFO] Using following parameters for creating project from Old (1.x) Archetype: maven-archetype-webapp:1.0
[windows-jdk8] [INFO] ----------------------------------------------------------------------------
[windows-jdk8] [INFO] Parameter: basedir, Value: F:\jenkins\jenkins-slave\workspace\-wip_maven-archetype_master-VY3HRMKJD7NBKSJUC3K2FGLVMJ3XZ5JVCJPRIMYIS7JQMQITBJLQ\m\archetype-common\target\internal-archetypes-projects
[windows-jdk8] [INFO] Parameter: package, Value: com.acme
[windows-jdk8] [INFO] Parameter: groupId, Value: org.apache.maven.archetype.test
[windows-jdk8] [INFO] Parameter: artifactId, Value: archetype10
[windows-jdk8] [INFO] Parameter: packageName, Value: com.acme
[windows-jdk8] [INFO] Parameter: version, Value: 1.0-SNAPSHOT
[windows-jdk8] [INFO] project created from Old (1.x) Archetype in dir: F:\jenkins\jenkins-slave\workspace\-wip_maven-archetype_master-VY3HRMKJD7NBKSJUC3K2FGLVMJ3XZ5JVCJPRIMYIS7JQMQITBJLQ\m\archetype-common\target\internal-archetypes-projects\archetype10
[windows-jdk8] Tests run: 1, Failures: 0, Errors: 0, Skipped: 0, Time elapsed: 2.488 sec - in org.apache.maven.archetype.test.InternalCatalogArchetypesVerificationTest
[windows-jdk8] Picked up JAVA_TOOL_OPTIONS: -Dmaven.ext.class.path="f:\jenkins\jenkins-slave\workspace\-wip_maven-archetype_master-VY3HRMKJD7NBKSJUC3K2FGLVMJ3XZ5JVCJPRIMYIS7JQMQITBJLQ@tmp\withMaven1798e142\pipeline-maven-spy.jar" -Dorg.jenkinsci.plugins.pipeline.maven.reportsFolder="f:\jenkins\jenkins-slave\workspace\-wip_maven-archetype_master-VY3HRMKJD7NBKSJUC3K2FGLVMJ3XZ5JVCJPRIMYIS7JQMQITBJLQ@tmp\withMaven1798e142"
[windows-jdk8]
[windows-jdk8] Results :
[windows-jdk8]
[windows-jdk8] Tests run: 28, Failures: 0, Errors: 0, Skipped: 0
[windows-jdk8]
[windows-jdk8] [INFO]
[windows-jdk8] [INFO] --- maven-jar-plugin:3.0.0:jar (default-jar) @ archetype-common ---
[windows-jdk8] [INFO] Building jar: F:\jenkins\jenkins-slave\workspace\-wip_maven-archetype_master-VY3HRMKJD7NBKSJUC3K2FGLVMJ3XZ5JVCJPRIMYIS7JQMQITBJLQ\m\archetype-common\target\archetype-common-3.0.2-SNAPSHOT.jar
[windows-jdk8] [INFO]
[windows-jdk8] [INFO] --- maven-site-plugin:3.5.1:attach-descriptor (attach-descriptor) @ archetype-common ---
[windows-jdk8] [INFO]
[windows-jdk8] [INFO] --- maven-checkstyle-plugin:2.15:check (checkstyle-check) @ archetype-common ---
[windows-jdk8] Sending interrupt signal to process
[windows-jdk9] [INFO] /F:/jenkins/jenkins-slave/workspace/-wip_maven-archetype_master-VY3HRMKJD7NBKSJUC3K2FGLVMJ3XZ5JVCJPRIMYIS7JQMQITBJLQ@2/m/archetype-common/src/main/java/org/apache/maven/archetype/old/DefaultOldArchetype.java: Some input files use or override a deprecated API.
[windows-jdk9] [INFO] /F:/jenkins/jenkins-slave/workspace/-wip_maven-archetype_master-VY3HRMKJD7NBKSJUC3K2FGLVMJ3XZ5JVCJPRIMYIS7JQMQITBJLQ@2/m/archetype-common/src/main/java/org/apache/maven/archetype/old/DefaultOldArchetype.java: Recompile with -Xlint:deprecation for details.
[windows-jdk9] [INFO] /F:/jenkins/jenkins-slave/workspace/-wip_maven-archetype_master-VY3HRMKJD7NBKSJUC3K2FGLVMJ3XZ5JVCJPRIMYIS7JQMQITBJLQ@2/m/archetype-common/src/main/java/org/apache/maven/archetype/common/MavenJDOMWriter.java: Some input files use unchecked or unsafe operations.
[windows-jdk9] [INFO] /F:/jenkins/jenkins-slave/workspace/-wip_maven-archetype_master-VY3HRMKJD7NBKSJUC3K2FGLVMJ3XZ5JVCJPRIMYIS7JQMQITBJLQ@2/m/archetype-common/src/main/java/org/apache/maven/archetype/common/MavenJDOMWriter.java: Recompile with -Xlint:unchecked for details.
[windows-jdk9] [INFO]
[windows-jdk9] [INFO] --- plexus-component-metadata:1.6:generate-metadata (default) @ archetype-common ---
[windows-jdk9] [INFO] ------------------------------------------------------------------------
[windows-jdk9] [INFO] Reactor Summary:
[windows-jdk9] [INFO]
[windows-jdk9] [INFO] Maven Archetype .................................... SUCCESS [ 27.139 s]
[windows-jdk9] [INFO] Maven Archetype Models ............................. SUCCESS [  0.864 s]
[windows-jdk9] [INFO] Maven Archetype Catalog Model ...................... SUCCESS [  7.634 s]
[windows-jdk9] [INFO] Maven Archetype Descriptor Model ................... SUCCESS [  1.664 s]
[windows-jdk9] [INFO] Maven Archetype Testing ............................ SUCCESS [  0.801 s]
[windows-jdk9] [INFO] Maven Archetype Webapp Repository .................. SUCCESS [  2.744 s]
[windows-jdk9] [INFO] Maven Archetype Webapp Proxy ....................... SUCCESS [  1.489 s]
[windows-jdk9] [INFO] Maven Archetype Common ............................. FAILURE [  9.354 s]
[windows-jdk9] [INFO] Maven Archetype Packaging .......................... SKIPPED
[windows-jdk9] [INFO] Maven Archetype Plugin ............................. SKIPPED
[windows-jdk9] [INFO] Maven Archetype Testing Final ...................... SKIPPED
[windows-jdk9] [INFO] ------------------------------------------------------------------------
[windows-jdk9] [INFO] BUILD FAILURE
[windows-jdk9] [INFO] ------------------------------------------------------------------------
[windows-jdk9] [INFO] Total time: 53.530 s
[windows-jdk9] [INFO] Finished at: 2017-11-29T22:51:59Z
[linux-jdk8] >>>>>> testCreateFilesetArchetype( "create-3" )
[linux-jdk8] Picked up JAVA_TOOL_OPTIONS: -Dmaven.ext.class.path="/home/jenkins/jenkins-slave/workspace/-wip_maven-archetype_master-VY3HRMKJD7NBKSJUC3K2FGLVMJ3XZ5JVCJPRIMYIS7JQMQITBJLQ@tmp/withMaven472e7d73/pipeline-maven-spy.jar" -Dorg.jenkinsci.plugins.pipeline.maven.reportsFolder="/home/jenkins/jenkins-slave/workspace/-wip_maven-archetype_master-VY3HRMKJD7NBKSJUC3K2FGLVMJ3XZ5JVCJPRIMYIS7JQMQITBJLQ@tmp/withMaven472e7d73"
[linux-jdk8] Terminated
[windows-jdk9] [INFO] Final Memory: 43M/144M
[windows-jdk9] [INFO] ------------------------------------------------------------------------
[windows-jdk9] [jenkins-maven-event-spy] INFO generated F:\jenkins\jenkins-slave\workspace\-wip_maven-archetype_master-VY3HRMKJD7NBKSJUC3K2FGLVMJ3XZ5JVCJPRIMYIS7JQMQITBJLQ@2@tmp\withMavenf0a93612\maven-spy-20171129-225105-2942414437113733829448.log
[windows-jdk9] [ERROR] Failed to execute goal org.codehaus.plexus:plexus-component-metadata:1.6:generate-metadata (default) on project archetype-common: Error generating metadata: Failed to extract descriptors: IllegalArgumentException -> [Help 1]
[windows-jdk9] [ERROR]
[windows-jdk9] [ERROR] To see the full stack trace of the errors, re-run Maven with the -e switch.
[windows-jdk9] [ERROR] Re-run Maven using the -X switch to enable full debug logging.
[windows-jdk9] [ERROR]
[windows-jdk9] [ERROR] For more information about the errors and possible solutions, please read the following articles:
[windows-jdk9] [ERROR] [Help 1] http://cwiki.apache.org/confluence/display/MAVEN/MojoExecutionException
[windows-jdk9] [ERROR]
[windows-jdk9] [ERROR] After correcting the problems, you can resume the build with the command
[windows-jdk9] [ERROR]   mvn <goals> -rf :archetype-common
[windows-jdk9] Sending interrupt signal to process
[Pipeline] [linux-jdk8] }
[Pipeline] [linux-jdk7] }
[Pipeline] [windows-jdk7] }
[Pipeline] [windows-jdk8] }
[Pipeline] [windows-jdk9] }
[Pipeline] [linux-jdk8] // dir
[Pipeline] [linux-jdk7] // dir
[Pipeline] [windows-jdk7] // dir
[Pipeline] [windows-jdk8] // dir
[Pipeline] [windows-jdk9] // dir
[Pipeline] [linux-jdk8] }
[linux-jdk8] [withMaven] artifactsPublisher - Archive artifact m/archetype-testing/archetype-final/target/test-classes/projects/include-file-with-no-extension/target/generated-sources/archetype/pom.xml under org/codehaus/mojo/archetypes/maven-archetype-test/1.0/maven-archetype-test-1.0.pom
[linux-jdk8] [withMaven] artifactsPublisher - Archive artifact m/archetype-testing/archetype-final/target/test-classes/projects/include-file-with-no-extension/target/generated-sources/archetype/target/maven-archetype-test-1.0.jar under org/codehaus/mojo/archetypes/maven-archetype-test/1.0/maven-archetype-test-1.0.jar
[linux-jdk8] [Fast Archiver] No prior successful build to compare, so performing full copy of artifacts
[linux-jdk8] [TASKS] Scanning folder '/home/jenkins/jenkins-slave/workspace/-wip_maven-archetype_master-VY3HRMKJD7NBKSJUC3K2FGLVMJ3XZ5JVCJPRIMYIS7JQMQITBJLQ' for files matching the pattern '**/*.java' - excludes: null
[linux-jdk8] [TASKS] Found 309 files to scan for tasks
[linux-jdk8] [TASKS] Found 30 open tasks.
[linux-jdk8] Skipping warnings blame since pipelines do not have an SCM link.%n
[linux-jdk8] [withMaven] artifactsPublisher - Archive artifact m/archetype-testing/archetype-final/target/test-classes/projects/included-system-properties/target/generated-sources/archetype/pom.xml under org/codehaus/mojo/archetypes/maven-archetype-test/1.0/maven-archetype-test-1.0.pom
[linux-jdk8] [withMaven] artifactsPublisher - Archive artifact m/archetype-testing/archetype-final/target/test-classes/projects/included-system-properties/target/generated-sources/archetype/target/maven-archetype-test-1.0.jar under org/codehaus/mojo/archetypes/maven-archetype-test/1.0/maven-archetype-test-1.0.jar
[linux-jdk8] [Fast Archiver] No prior successful build to compare, so performing full copy of artifacts
[linux-jdk8] [TASKS] Scanning folder '/home/jenkins/jenkins-slave/workspace/-wip_maven-archetype_master-VY3HRMKJD7NBKSJUC3K2FGLVMJ3XZ5JVCJPRIMYIS7JQMQITBJLQ' for files matching the pattern '**/*.java' - excludes: null
[linux-jdk8] [TASKS] Found 309 files to scan for tasks
[linux-jdk8] [TASKS] Found 30 open tasks.
[linux-jdk8] Skipping warnings blame since pipelines do not have an SCM link.%n
[linux-jdk8] [withMaven] artifactsPublisher - Archive artifact m/archetype-testing/archetype-final/target/test-classes/projects/create-1/target/generated-sources/archetype/pom.xml under org/codehaus/mojo/archetypes/maven-archetype-test/1.0/maven-archetype-test-1.0.pom
[linux-jdk8] [withMaven] artifactsPublisher - Archive artifact m/archetype-testing/archetype-final/target/test-classes/projects/create-1/target/generated-sources/archetype/target/maven-archetype-test-1.0.jar under org/codehaus/mojo/archetypes/maven-archetype-test/1.0/maven-archetype-test-1.0.jar
[linux-jdk8] [Fast Archiver] No prior successful build to compare, so performing full copy of artifacts
[linux-jdk8] [TASKS] Scanning folder '/home/jenkins/jenkins-slave/workspace/-wip_maven-archetype_master-VY3HRMKJD7NBKSJUC3K2FGLVMJ3XZ5JVCJPRIMYIS7JQMQITBJLQ' for files matching the pattern '**/*.java' - excludes: null
[linux-jdk8] [TASKS] Found 309 files to scan for tasks
[linux-jdk8] [TASKS] Found 30 open tasks.
[linux-jdk8] Skipping warnings blame since pipelines do not have an SCM link.%n
[linux-jdk8] [withMaven] One or multiple Maven executions have been ignored by the Jenkins Pipeline Maven Plugin because they have been interrupted before completion (1). See Pipeline Maven Plugin FAQ for more details.
[Pipeline] [linux-jdk7] }
[linux-jdk7] [withMaven] One or multiple Maven executions have been ignored by the Jenkins Pipeline Maven Plugin because they have been interrupted before completion (1). See Pipeline Maven Plugin FAQ for more details.
[Pipeline] [windows-jdk7] }
[windows-jdk7] [withMaven] One or multiple Maven executions have been ignored by the Jenkins Pipeline Maven Plugin because they have been interrupted before completion (1). See Pipeline Maven Plugin FAQ for more details.
[Pipeline] [windows-jdk8] }
[windows-jdk8] [withMaven] One or multiple Maven executions have been ignored by the Jenkins Pipeline Maven Plugin because they have been interrupted before completion (1). See Pipeline Maven Plugin FAQ for more details.
[Pipeline] [windows-jdk9] }
[windows-jdk9] [withMaven] artifactsPublisher - Archive artifact m\pom.xml under org\apache\maven\archetype\maven-archetype\3.0.2-SNAPSHOT\maven-archetype-3.0.2-SNAPSHOT.pom
[windows-jdk9] [withMaven] artifactsPublisher - Archive artifact m\archetype-models\pom.xml under org\apache\maven\archetype\archetype-models\3.0.2-SNAPSHOT\archetype-models-3.0.2-SNAPSHOT.pom
[windows-jdk9] [withMaven] artifactsPublisher - Archive artifact m\archetype-models\archetype-catalog\pom.xml under org\apache\maven\archetype\archetype-catalog\3.0.2-SNAPSHOT\archetype-catalog-3.0.2-SNAPSHOT.pom
[windows-jdk9] [withMaven] artifactsPublisher - Archive artifact m\archetype-models\archetype-catalog\target\archetype-catalog-3.0.2-SNAPSHOT.jar under org\apache\maven\archetype\archetype-catalog\3.0.2-SNAPSHOT\archetype-catalog-3.0.2-SNAPSHOT.jar
[windows-jdk9] [withMaven] artifactsPublisher - Archive artifact m\archetype-models\archetype-descriptor\pom.xml under org\apache\maven\archetype\archetype-descriptor\3.0.2-SNAPSHOT\archetype-descriptor-3.0.2-SNAPSHOT.pom
[windows-jdk9] [withMaven] artifactsPublisher - Archive artifact m\archetype-models\archetype-descriptor\target\archetype-descriptor-3.0.2-SNAPSHOT.jar under org\apache\maven\archetype\archetype-descriptor\3.0.2-SNAPSHOT\archetype-descriptor-3.0.2-SNAPSHOT.jar
[windows-jdk9] [withMaven] artifactsPublisher - Archive artifact m\archetype-testing\pom.xml under org\apache\maven\archetype\archetype-testing\3.0.2-SNAPSHOT\archetype-testing-3.0.2-SNAPSHOT.pom
[windows-jdk9] [withMaven] artifactsPublisher - Archive artifact m\archetype-testing\archetype-repository\pom.xml under org\apache\maven\archetype\archetype-repository\3.0.2-SNAPSHOT\archetype-repository-3.0.2-SNAPSHOT.pom
[windows-jdk9] [withMaven] artifactsPublisher - Archive artifact m\archetype-testing\archetype-repository\target\archetype-repository-3.0.2-SNAPSHOT.war under org\apache\maven\archetype\archetype-repository\3.0.2-SNAPSHOT\archetype-repository-3.0.2-SNAPSHOT.war
[windows-jdk9] [withMaven] artifactsPublisher - Archive artifact m\archetype-testing\archetype-proxy\pom.xml under org\apache\maven\archetype\archetype-proxy\3.0.2-SNAPSHOT\archetype-proxy-3.0.2-SNAPSHOT.pom
[windows-jdk9] [withMaven] artifactsPublisher - Archive artifact m\archetype-testing\archetype-proxy\target\archetype-proxy-3.0.2-SNAPSHOT.war under org\apache\maven\archetype\archetype-proxy\3.0.2-SNAPSHOT\archetype-proxy-3.0.2-SNAPSHOT.war
[windows-jdk9] [withMaven] artifactsPublisher - Archive artifact m\target\maven-archetype-3.0.2-SNAPSHOT-site.xml under org\apache\maven\archetype\maven-archetype\3.0.2-SNAPSHOT\maven-archetype-3.0.2-SNAPSHOT-site.xml
[windows-jdk9] [withMaven] artifactsPublisher - Archive artifact m\archetype-models\target\archetype-models-3.0.2-SNAPSHOT-site.xml under org\apache\maven\archetype\archetype-models\3.0.2-SNAPSHOT\archetype-models-3.0.2-SNAPSHOT-site.xml
[windows-jdk9] [withMaven] artifactsPublisher - Archive artifact m\archetype-testing\target\archetype-testing-3.0.2-SNAPSHOT-site.xml under org\apache\maven\archetype\archetype-testing\3.0.2-SNAPSHOT\archetype-testing-3.0.2-SNAPSHOT-site.xml
[windows-jdk9] [Fast Archiver] No prior successful build to compare, so performing full copy of artifacts
[windows-jdk9] [withMaven] junitPublisher - Archive test results for Maven artifact org.apache.maven.archetype:archetype-catalog:3.0.2-SNAPSHOT generated by maven-surefire-plugin:test (default-test): m\archetype-models\archetype-catalog\target\surefire-reports\*.xml
[windows-jdk9] [withMaven] junitPublisher - Jenkins JUnit Attachments Plugin not found, can't publish test attachments.Recording test results
[windows-jdk9] None of the test reports contained any result
[windows-jdk9] [withMaven] junitPublisher - Archive test results for Maven artifact org.apache.maven.archetype:archetype-descriptor:3.0.2-SNAPSHOT generated by maven-surefire-plugin:test (default-test): m\archetype-models\archetype-descriptor\target\surefire-reports\*.xml
[windows-jdk9] [withMaven] junitPublisher - Jenkins JUnit Attachments Plugin not found, can't publish test attachments.Recording test results
[windows-jdk9] None of the test reports contained any result
[windows-jdk9] [withMaven] junitPublisher - Archive test results for Maven artifact org.apache.maven.archetype:archetype-repository:3.0.2-SNAPSHOT generated by maven-surefire-plugin:test (default-test): m\archetype-testing\archetype-repository\target\surefire-reports\*.xml
[windows-jdk9] [withMaven] junitPublisher - Jenkins JUnit Attachments Plugin not found, can't publish test attachments.Recording test results
[windows-jdk9] None of the test reports contained any result
[windows-jdk9] [withMaven] junitPublisher - Archive test results for Maven artifact org.apache.maven.archetype:archetype-proxy:3.0.2-SNAPSHOT generated by maven-surefire-plugin:test (default-test): m\archetype-testing\archetype-proxy\target\surefire-reports\*.xml
[windows-jdk9] [withMaven] junitPublisher - Jenkins JUnit Attachments Plugin not found, can't publish test attachments.Recording test results
[windows-jdk9] None of the test reports contained any result
[windows-jdk9] [withMaven] openTasksPublisher - Scan Tasks for Maven artifact org.apache.maven.archetype:archetype-repository:3.0.2-SNAPSHOT in source directory m\archetype-testing\archetype-repository\src\main\java
[windows-jdk9] [withMaven] openTasksPublisher - Scan Tasks for Maven artifact org.apache.maven.archetype:archetype-proxy:3.0.2-SNAPSHOT in source directory m\archetype-testing\archetype-proxy\src\main\java
[windows-jdk9] [withMaven] openTasksPublisher - Scan Tasks for Maven artifact org.apache.maven.archetype:archetype-common:3.0.2-SNAPSHOT in source directory m\archetype-common\src\main\java
[windows-jdk9] [TASKS] Scanning folder 'f:\jenkins\jenkins-slave\workspace\-wip_maven-archetype_master-VY3HRMKJD7NBKSJUC3K2FGLVMJ3XZ5JVCJPRIMYIS7JQMQITBJLQ@2' for files matching the pattern 'm\archetype-testing\archetype-repository\src\main\java\**\*,m\archetype-testing\archetype-proxy\src\main\java\**\*,m\archetype-common\src\main\java\**\*' - excludes: null
[windows-jdk9] [TASKS] Found 63 files to scan for tasks
[windows-jdk9] [TASKS] Found 24 open tasks.
[windows-jdk9] Skipping warnings blame since pipelines do not have an SCM link.%n
[Pipeline] [linux-jdk8] // withMaven
[Pipeline] [linux-jdk7] // withMaven
[Pipeline] [windows-jdk7] // withMaven
[Pipeline] [windows-jdk8] // withMaven
[Pipeline] [windows-jdk9] // withMaven
[Pipeline] [linux-jdk8] }
[Pipeline] [linux-jdk7] }
[Pipeline] [windows-jdk7] }
[Pipeline] [windows-jdk8] }
[Pipeline] [windows-jdk9] }
[Pipeline] [linux-jdk8] // stage
[Pipeline] [linux-jdk7] // stage
[Pipeline] [windows-jdk7] // stage
[Pipeline] [windows-jdk8] // stage
[Pipeline] [windows-jdk9] // stage
[Pipeline] [linux-jdk7] }
[Pipeline] [linux-jdk8] }
[Pipeline] [windows-jdk7] }
[Pipeline] [windows-jdk8] }
[Pipeline] [windows-jdk9] }
[Pipeline] [linux-jdk7] // node
[Pipeline] [linux-jdk8] // node
[Pipeline] [windows-jdk7] // node
[Pipeline] [windows-jdk8] // node
[Pipeline] [windows-jdk9] // node
[Pipeline] [linux-jdk7] }
[linux-jdk7] Failed in branch linux-jdk7
[Pipeline] [linux-jdk8] }
[linux-jdk8] Failed in branch linux-jdk8
[Pipeline] [windows-jdk7] }
[Pipeline] [windows-jdk8] }
[Pipeline] [windows-jdk9] }
[windows-jdk9] Failed in branch windows-jdk9
[Pipeline] // parallel
[Pipeline] stage
[Pipeline] { (Notifications)
[Pipeline] echo
Build result: FAILURE
[Pipeline] jiraIssueSelector
[Pipeline] emailext