Build failed in Jenkins: Maven TLP » maven-war-plugin » MWAR-434 #2

classic Classic list List threaded Threaded
1 message Options
Reply | Threaded
Open this post in threaded view
|

Build failed in Jenkins: Maven TLP » maven-war-plugin » MWAR-434 #2

Apache Jenkins Server-2
See https://builds.apache.org/job/maven-box/job/maven-war-plugin/job/MWAR-434/2/

Changes:

* refactor outdated resource management internal API

All tests passed

Build log:
[...truncated 25198 lines...]
[ERROR] For more information about the errors and possible solutions, please read the following articles:
[ERROR] [Help 1] http://cwiki.apache.org/confluence/display/MAVEN/MissingProjectException
[Pipeline] }
[Pipeline] // dir
[Pipeline] }
[Fast Archiver] No prior successful build to compare, so performing full copy of artifacts
[withMaven] Publishers: Generated Artifacts Publisher: 12 ms
[Pipeline] // withMaven
[Pipeline] cleanWs
[WS-CLEANUP] Deleting project workspace...
[WS-CLEANUP] Deferred wipeout is used...
[WS-CLEANUP] done
[Pipeline] cleanWs
[WS-CLEANUP] Deleting project workspace...
[WS-CLEANUP] Deferred wipeout is used...
[WS-CLEANUP] done
[Pipeline] }
[Pipeline] // stage
[Pipeline] }
[Pipeline] // ws
[Pipeline] }
[Pipeline] // node
[Pipeline] }
Running on jenkins-win-he-de-1 in f:\jenkins\jenkins-slave\workspace\en-box_maven-war-plugin_MWAR-434
Failed in branch windows-jdk11-m3.6.x_build
[Pipeline] {
[Pipeline] pwd
[Pipeline] ws
Running in f:\jenkins\jenkins-slave\workspace\en-box_maven-war-plugin_MWAR-434@2
[Pipeline] {
[Pipeline] stage
[Pipeline] { (Checkout windows-jdk14-m3.6.x_build)
[Pipeline] echo
NODE_NAME = jenkins-win-he-de-1
[Pipeline] dir
Running in f:\jenkins\jenkins-slave\workspace\en-box_maven-war-plugin_MWAR-434@2\windows-jdk14-m3.6.x_build
[Pipeline] {
[Pipeline] checkout
[Pipeline] }
[Pipeline] // dir
[Pipeline] }
[Pipeline] // stage
[Pipeline] stage
[Pipeline] { (Build windows-jdk14-m3.6.x_build)
[Pipeline] echo
Local Repo (windows-jdk14-m3.6.x_build): ../.maven_repositories/1
[Pipeline] withMaven
[withMaven] Options: [org.jenkinsci.plugins.pipeline.maven.publishers.GeneratedArtifactsPublisher[disabled=false], JunitTestsPublisher[disabled=false,healthScaleFactor=,keepLongStdio=false,ignoreAttachments=false], org.jenkinsci.plugins.pipeline.maven.publishers.FindbugsAnalysisPublisher[disabled='false', healthy='', unHealthy='', thresholdLimit='low'], org.jenkinsci.plugins.pipeline.maven.publishers.TasksScannerPublisher[disabled='false', healthy='', unHealthy='', thresholdLimit='low'], org.jenkinsci.plugins.pipeline.maven.publishers.DependenciesFingerprintPublisher[disabled=false, scopes=[compile, provided, runtime], versions={snapshot:true, release:false}], org.jenkinsci.plugins.pipeline.maven.publishers.InvokerRunsPublisher[disabled=false], org.jenkinsci.plugins.pipeline.maven.publishers.PipelineGraphPublisher[disabled=false, scopes=[compile, provided, runtime], versions={snapshot:true, release:false}, skipDownstreamTriggers=false, lifecycleThreshold=deploy, ignoreUpstreamTriggers=false], org.jenkinsci.plugins.pipeline.maven.publishers.MavenLinkerPublisher2[disabled=false]]
[withMaven] Available options:
[withMaven] using JDK installation JDK 14 (latest)
[withMaven] using Maven installation 'Maven 3.6.2 (Windows)'
[Pipeline] {
[Pipeline] dir
Running in f:\jenkins\jenkins-slave\workspace\en-box_maven-war-plugin_MWAR-434@2\windows-jdk14-m3.6.x_build
[Pipeline] {
[Pipeline] isUnix
[Pipeline] bat

f:\jenkins\jenkins-slave\workspace\en-box_maven-war-plugin_MWAR-434@2\windows-jdk14-m3.6.x_build>wmic logicaldisk get size,freespace,caption
Caption FreeSpace Size

C: 2149811294208 2198497914880

F: 2963570786304 3000246464512


[Pipeline] bat

f:\jenkins\jenkins-slave\workspace\en-box_maven-war-plugin_MWAR-434@2\windows-jdk14-m3.6.x_build>mvn -P+run-its -Dmaven.test.failure.ignore=true -Dfindbugs.failOnError=false -e clean verify
----- withMaven Wrapper script -----
Picked up JAVA_TOOL_OPTIONS: -Dmaven.ext.class.path="f:\jenkins\jenkins-slave\workspace\en-box_maven-war-plugin_MWAR-434@2@tmp\withMaven89f44b7f\pipeline-maven-spy.jar" -Dorg.jenkinsci.plugins.pipeline.maven.reportsFolder="f:\jenkins\jenkins-slave\workspace\en-box_maven-war-plugin_MWAR-434@2@tmp\withMaven89f44b7f"
Apache Maven 3.6.2 (40f52333136460af0dc0d7232c0dc0bcf0d9e117; 2019-08-27T08:06:16-07:00)
Maven home: F:\jenkins\tools\maven\apache-maven-3.6.2\bin\..
Java version: 14-ea, vendor: Oracle Corporation, runtime: f:\jenkins\tools\java\latest14
Default locale: en_US, platform encoding: Cp1252
OS name: "windows server 2016", version: "10.0", arch: "amd64", family: "windows"
[INFO] [jenkins-event-spy] Generate F:\jenkins\jenkins-slave\workspace\en-box_maven-war-plugin_MWAR-434@2@tmp\withMaven89f44b7f\maven-spy-20200613-092905-20612228790083902738224.log.tmp ...
[INFO] Error stacktraces are turned on.
[INFO] Scanning for projects...
[INFO] ------------------------------------------------------------------------
[INFO] BUILD FAILURE
[INFO] ------------------------------------------------------------------------
[INFO] Total time:  0.090 s
[INFO] Finished at: 2020-06-13T09:29:05-07:00
[INFO] ------------------------------------------------------------------------
[WARNING] The requested profile "run-its" could not be activated because it does not exist.
[INFO] [jenkins-event-spy] Generated F:\jenkins\jenkins-slave\workspace\en-box_maven-war-plugin_MWAR-434@2@tmp\withMaven89f44b7f\maven-spy-20200613-092905-20612228790083902738224.log
[ERROR] The goal you specified requires a project to execute but there is no POM in this directory (f:\jenkins\jenkins-slave\workspace\en-box_maven-war-plugin_MWAR-434@2\windows-jdk14-m3.6.x_build). Please verify you invoked Maven from the correct directory. -> [Help 1]
org.apache.maven.lifecycle.MissingProjectException: The goal you specified requires a project to execute but there is no POM in this directory (f:\jenkins\jenkins-slave\workspace\en-box_maven-war-plugin_MWAR-434@2\windows-jdk14-m3.6.x_build). Please verify you invoked Maven from the correct directory.
    at org.apache.maven.lifecycle.internal.LifecycleStarter.execute (LifecycleStarter.java:85)
    at org.apache.maven.DefaultMaven.doExecute (DefaultMaven.java:305)
    at org.apache.maven.DefaultMaven.doExecute (DefaultMaven.java:192)
    at org.apache.maven.DefaultMaven.execute (DefaultMaven.java:105)
    at org.apache.maven.cli.MavenCli.execute (MavenCli.java:956)
    at org.apache.maven.cli.MavenCli.doMain (MavenCli.java:288)
    at org.apache.maven.cli.MavenCli.main (MavenCli.java:192)
    at jdk.internal.reflect.NativeMethodAccessorImpl.invoke0 (Native Method)
    at jdk.internal.reflect.NativeMethodAccessorImpl.invoke (NativeMethodAccessorImpl.java:62)
    at jdk.internal.reflect.DelegatingMethodAccessorImpl.invoke (DelegatingMethodAccessorImpl.java:43)
    at java.lang.reflect.Method.invoke (Method.java:567)
    at org.codehaus.plexus.classworlds.launcher.Launcher.launchEnhanced (Launcher.java:282)
    at org.codehaus.plexus.classworlds.launcher.Launcher.launch (Launcher.java:225)
    at org.codehaus.plexus.classworlds.launcher.Launcher.mainWithExitCode (Launcher.java:406)
    at org.codehaus.plexus.classworlds.launcher.Launcher.main (Launcher.java:347)
[ERROR]
[ERROR] Re-run Maven using the -X switch to enable full debug logging.
[ERROR]
[ERROR] For more information about the errors and possible solutions, please read the following articles:
[ERROR] [Help 1] http://cwiki.apache.org/confluence/display/MAVEN/MissingProjectException
[Pipeline] }
[Pipeline] // dir
[Pipeline] }
[Fast Archiver] No prior successful build to compare, so performing full copy of artifacts
[withMaven] Publishers: Generated Artifacts Publisher: 12 ms
[Pipeline] // withMaven
[Pipeline] cleanWs
[WS-CLEANUP] Deleting project workspace...
[WS-CLEANUP] Deferred wipeout is used...
[WS-CLEANUP] done
[Pipeline] cleanWs
[WS-CLEANUP] Deleting project workspace...
[WS-CLEANUP] Deferred wipeout is used...
[WS-CLEANUP] done
[Pipeline] }
[Pipeline] // stage
[Pipeline] }
[Pipeline] // ws
[Pipeline] }
[Pipeline] // node
[Pipeline] }
Failed in branch windows-jdk14-m3.6.x_build
Running on jenkins-win-he-de-1 in f:\jenkins\jenkins-slave\workspace\en-box_maven-war-plugin_MWAR-434
[Pipeline] {
[Pipeline] pwd
[Pipeline] ws
Running in f:\jenkins\jenkins-slave\workspace\en-box_maven-war-plugin_MWAR-434@2
[Pipeline] {
[Pipeline] stage
[Pipeline] { (Checkout windows-jdk15-m3.6.x_build)
[Pipeline] echo
NODE_NAME = jenkins-win-he-de-1
[Pipeline] dir
Running in f:\jenkins\jenkins-slave\workspace\en-box_maven-war-plugin_MWAR-434@2\windows-jdk15-m3.6.x_build
[Pipeline] {
[Pipeline] checkout
[Pipeline] }
[Pipeline] // dir
[Pipeline] }
[Pipeline] // stage
[Pipeline] stage
[Pipeline] { (Build windows-jdk15-m3.6.x_build)
[Pipeline] echo
Local Repo (windows-jdk15-m3.6.x_build): ../.maven_repositories/1
[Pipeline] withMaven
[withMaven] Options: [org.jenkinsci.plugins.pipeline.maven.publishers.GeneratedArtifactsPublisher[disabled=false], JunitTestsPublisher[disabled=false,healthScaleFactor=,keepLongStdio=false,ignoreAttachments=false], org.jenkinsci.plugins.pipeline.maven.publishers.FindbugsAnalysisPublisher[disabled='false', healthy='', unHealthy='', thresholdLimit='low'], org.jenkinsci.plugins.pipeline.maven.publishers.TasksScannerPublisher[disabled='false', healthy='', unHealthy='', thresholdLimit='low'], org.jenkinsci.plugins.pipeline.maven.publishers.DependenciesFingerprintPublisher[disabled=false, scopes=[compile, provided, runtime], versions={snapshot:true, release:false}], org.jenkinsci.plugins.pipeline.maven.publishers.InvokerRunsPublisher[disabled=false], org.jenkinsci.plugins.pipeline.maven.publishers.PipelineGraphPublisher[disabled=false, scopes=[compile, provided, runtime], versions={snapshot:true, release:false}, skipDownstreamTriggers=false, lifecycleThreshold=deploy, ignoreUpstreamTriggers=false], org.jenkinsci.plugins.pipeline.maven.publishers.MavenLinkerPublisher2[disabled=false]]
[withMaven] Available options:
[withMaven] using JDK installation JDK 15 (latest)
[withMaven] using Maven installation 'Maven 3.6.2 (Windows)'
[Pipeline] {
[Pipeline] dir
Running in f:\jenkins\jenkins-slave\workspace\en-box_maven-war-plugin_MWAR-434@2\windows-jdk15-m3.6.x_build
[Pipeline] {
[Pipeline] isUnix
[Pipeline] bat

f:\jenkins\jenkins-slave\workspace\en-box_maven-war-plugin_MWAR-434@2\windows-jdk15-m3.6.x_build>wmic logicaldisk get size,freespace,caption
Caption FreeSpace Size

C: 2149816909824 2198497914880

F: 2963570786304 3000246464512


[Pipeline] bat

f:\jenkins\jenkins-slave\workspace\en-box_maven-war-plugin_MWAR-434@2\windows-jdk15-m3.6.x_build>mvn -P+run-its -Dmaven.test.failure.ignore=true -Dfindbugs.failOnError=false -e clean verify
----- withMaven Wrapper script -----
Picked up JAVA_TOOL_OPTIONS: -Dmaven.ext.class.path="f:\jenkins\jenkins-slave\workspace\en-box_maven-war-plugin_MWAR-434@2@tmp\withMavenf43af5f7\pipeline-maven-spy.jar" -Dorg.jenkinsci.plugins.pipeline.maven.reportsFolder="f:\jenkins\jenkins-slave\workspace\en-box_maven-war-plugin_MWAR-434@2@tmp\withMavenf43af5f7"
Apache Maven 3.6.2 (40f52333136460af0dc0d7232c0dc0bcf0d9e117; 2019-08-27T08:06:16-07:00)
Maven home: F:\jenkins\tools\maven\apache-maven-3.6.2\bin\..
Java version: 15-ea, vendor: Oracle Corporation, runtime: f:\jenkins\tools\java\latest15
Default locale: en_US, platform encoding: Cp1252
OS name: "windows server 2016", version: "10.0", arch: "amd64", family: "windows"
[INFO] [jenkins-event-spy] Generate F:\jenkins\jenkins-slave\workspace\en-box_maven-war-plugin_MWAR-434@2@tmp\withMavenf43af5f7\maven-spy-20200613-092908-9771738541133736926155.log.tmp ...
[INFO] Error stacktraces are turned on.
[INFO] Scanning for projects...
[INFO] ------------------------------------------------------------------------
[INFO] BUILD FAILURE
[INFO] ------------------------------------------------------------------------
[INFO] Total time:  0.113 s
[INFO] Finished at: 2020-06-13T09:29:09-07:00
[INFO] ------------------------------------------------------------------------
[WARNING] The requested profile "run-its" could not be activated because it does not exist.
[INFO] [jenkins-event-spy] Generated F:\jenkins\jenkins-slave\workspace\en-box_maven-war-plugin_MWAR-434@2@tmp\withMavenf43af5f7\maven-spy-20200613-092908-9771738541133736926155.log
[ERROR] The goal you specified requires a project to execute but there is no POM in this directory (f:\jenkins\jenkins-slave\workspace\en-box_maven-war-plugin_MWAR-434@2\windows-jdk15-m3.6.x_build). Please verify you invoked Maven from the correct directory. -> [Help 1]
org.apache.maven.lifecycle.MissingProjectException: The goal you specified requires a project to execute but there is no POM in this directory (f:\jenkins\jenkins-slave\workspace\en-box_maven-war-plugin_MWAR-434@2\windows-jdk15-m3.6.x_build). Please verify you invoked Maven from the correct directory.
    at org.apache.maven.lifecycle.internal.LifecycleStarter.execute (LifecycleStarter.java:85)
    at org.apache.maven.DefaultMaven.doExecute (DefaultMaven.java:305)
    at org.apache.maven.DefaultMaven.doExecute (DefaultMaven.java:192)
    at org.apache.maven.DefaultMaven.execute (DefaultMaven.java:105)
    at org.apache.maven.cli.MavenCli.execute (MavenCli.java:956)
    at org.apache.maven.cli.MavenCli.doMain (MavenCli.java:288)
    at org.apache.maven.cli.MavenCli.main (MavenCli.java:192)
    at jdk.internal.reflect.NativeMethodAccessorImpl.invoke0 (Native Method)
    at jdk.internal.reflect.NativeMethodAccessorImpl.invoke (NativeMethodAccessorImpl.java:62)
    at jdk.internal.reflect.DelegatingMethodAccessorImpl.invoke (DelegatingMethodAccessorImpl.java:43)
    at java.lang.reflect.Method.invoke (Method.java:564)
    at org.codehaus.plexus.classworlds.launcher.Launcher.launchEnhanced (Launcher.java:282)
    at org.codehaus.plexus.classworlds.launcher.Launcher.launch (Launcher.java:225)
    at org.codehaus.plexus.classworlds.launcher.Launcher.mainWithExitCode (Launcher.java:406)
    at org.codehaus.plexus.classworlds.launcher.Launcher.main (Launcher.java:347)
[ERROR]
[ERROR] Re-run Maven using the -X switch to enable full debug logging.
[ERROR]
[ERROR] For more information about the errors and possible solutions, please read the following articles:
[ERROR] [Help 1] http://cwiki.apache.org/confluence/display/MAVEN/MissingProjectException
[Pipeline] }
[Pipeline] // dir
[Pipeline] }
[Fast Archiver] No prior successful build to compare, so performing full copy of artifacts
[withMaven] Publishers: Generated Artifacts Publisher: 11 ms
[Pipeline] // withMaven
[Pipeline] cleanWs
[WS-CLEANUP] Deleting project workspace...
[WS-CLEANUP] Deferred wipeout is used...
[WS-CLEANUP] done
[Pipeline] cleanWs
[WS-CLEANUP] Deleting project workspace...
[WS-CLEANUP] Deferred wipeout is used...
[WS-CLEANUP] done
[Pipeline] }
[Pipeline] // stage
[Pipeline] }
[Pipeline] // ws
[Pipeline] }
[Pipeline] // node
[Pipeline] }
Failed in branch windows-jdk15-m3.6.x_build
[Pipeline] // parallel
[Pipeline] stage
[Pipeline] { (Notifications)
[Pipeline] echo
Build result: FAILURE
[Pipeline] jiraIssueSelector
[Pipeline] echo
The authors of changes [hboutemy].
[Pipeline] echo
Sending email ...
[Pipeline] emailext