Build failed in Jenkins: Maven TLP » maven-wagon » WAGON-528 #3

classic Classic list List threaded Threaded
3 messages Options
Reply | Threaded
Open this post in threaded view
|

Build failed in Jenkins: Maven TLP » maven-wagon » WAGON-528 #3

Apache Jenkins Server-2
See https://builds.apache.org/job/maven-box/job/maven-wagon/job/WAGON-528/3/

No changes.

32 tests failed.
FAILED:  org.apache.maven.wagon.providers.http.HttpWagonTimeoutTest.testGetTimeout

Error Message:
Address already in use: bind

Stack Trace:
java.net.BindException: Address already in use: bind
        at org.apache.maven.wagon.providers.http.HttpWagonTimeoutTest.setUp(HttpWagonTimeoutTest.java:45)


FAILED:  org.apache.maven.wagon.providers.http.HttpWagonTimeoutTest.testConnectionTimeout

Error Message:
Address already in use: bind

Stack Trace:
java.net.BindException: Address already in use: bind
        at org.apache.maven.wagon.providers.http.HttpWagonTimeoutTest.setUp(HttpWagonTimeoutTest.java:45)


FAILED:  org.apache.maven.wagon.providers.http.HttpWagonTimeoutTest.testGetFileList

Error Message:
Address already in use: bind

Stack Trace:
java.net.BindException: Address already in use: bind
        at org.apache.maven.wagon.providers.http.HttpWagonTimeoutTest.setUp(HttpWagonTimeoutTest.java:45)


FAILED:  org.apache.maven.wagon.providers.scm.ScmGitExeWagonTest.testFailedGet

Error Message:
Error getting file from SCM

Stack Trace:
org.apache.maven.wagon.TransferFailedException: Error getting file from SCM
Caused by: org.apache.maven.scm.ScmException:
command failed: 'git' is not recognized as an internal or external command,
operable program or batch file.


FAILED:  org.apache.maven.wagon.providers.scm.ScmGitExeWagonTest.testFailedGet

Error Message:
Error getting file from SCM

Stack Trace:
org.apache.maven.wagon.TransferFailedException: Error getting file from SCM
Caused by: org.apache.maven.scm.ScmException:
command failed: 'git' is not recognized as an internal or external command,
operable program or batch file.


FAILED:  org.apache.maven.wagon.providers.scm.ScmGitExeWagonTest.testFailedGet

Error Message:
Error getting file from SCM

Stack Trace:
org.apache.maven.wagon.TransferFailedException: Error getting file from SCM
Caused by: org.apache.maven.scm.ScmException:
command failed: 'git' is not recognized as an internal or external command,
operable program or batch file.


FAILED:  org.apache.maven.wagon.providers.ftp.FtpWagonTest.testDefaultUserName

Error Message:
Cannot login to remote system

Stack Trace:
org.apache.maven.wagon.ConnectionException: Cannot login to remote system
        at org.apache.maven.wagon.providers.ftp.FtpWagonTest.testDefaultUserName(FtpWagonTest.java:178)
Caused by: org.apache.commons.net.ftp.FTPConnectionClosedException: Connection closed without indication.
        at org.apache.maven.wagon.providers.ftp.FtpWagonTest.testDefaultUserName(FtpWagonTest.java:178)


FAILED:  org.apache.maven.wagon.providers.scm.ScmGitExeWagonTest.testWagonPutDirectory

Error Message:
Error checking out: command failed: 'git' is not recognized as an internal or external command,
operable program or batch file.

Stack Trace:
org.apache.maven.wagon.TransferFailedException:
Error checking out: command failed: 'git' is not recognized as an internal or external command,
operable program or batch file.
Caused by: org.apache.maven.scm.ScmException:
command failed: 'git' is not recognized as an internal or external command,
operable program or batch file.


FAILED:  org.apache.maven.wagon.providers.scm.ScmGitExeWagonTest.testWagonPutDirectoryDeepDestination

Error Message:
Error checking out: command failed: 'git' is not recognized as an internal or external command,
operable program or batch file.

Stack Trace:
org.apache.maven.wagon.TransferFailedException:
Error checking out: command failed: 'git' is not recognized as an internal or external command,
operable program or batch file.
Caused by: org.apache.maven.scm.ScmException:
command failed: 'git' is not recognized as an internal or external command,
operable program or batch file.


FAILED:  org.apache.maven.wagon.providers.scm.ScmGitExeWagonTest.testWagon

Error Message:

  Unexpected method call TransferListener.transferError(TransferEvent[GET|ERROR|Repository[scm:git:file:///F:/jenkins/jenkins-slave/workspace/n-box_maven-wagon_WAGON-528-IMNZXLSWVKGSMF6UG52A7YYKAK332OKWF6U6U6HZJQ3V6WNV7M2A/m/wagon-providers/wagon-scm/target/test-classes/test-repo-git-test/]|null|test-resource[len = 18; mod = 1536774110224]]):
    TransferListener.transferCompleted(TransferEvent[PUT|COMPLETED|Repository[scm:git:file:///F:/jenkins/jenkins-slave/workspace/n-box_maven-wagon_WAGON-528-IMNZXLSWVKGSMF6UG52A7YYKAK332OKWF6U6U6HZJQ3V6WNV7M2A/m/wagon-providers/wagon-scm/target/test-classes/test-repo-git-test/]|F:\jenkins\jenkins-slave\workspace\n-box_maven-wagon_WAGON-528-IMNZXLSWVKGSMF6UG52A7YYKAK332OKWF6U6U6HZJQ3V6WNV7M2A\m\wagon-providers\wagon-scm\target\test-output\test-resource|test-resource[len = 18; mod = 1536774110224]]): expected: 1, actual: 0

Stack Trace:
java.lang.AssertionError:

  Unexpected method call TransferListener.transferError(TransferEvent[GET|ERROR|Repository[scm:git:file:///F:/jenkins/jenkins-slave/workspace/n-box_maven-wagon_WAGON-528-IMNZXLSWVKGSMF6UG52A7YYKAK332OKWF6U6U6HZJQ3V6WNV7M2A/m/wagon-providers/wagon-scm/target/test-classes/test-repo-git-test/]|null|test-resource[len = 18; mod = 1536774110224]]):
    TransferListener.transferCompleted(TransferEvent[PUT|COMPLETED|Repository[scm:git:file:///F:/jenkins/jenkins-slave/workspace/n-box_maven-wagon_WAGON-528-IMNZXLSWVKGSMF6UG52A7YYKAK332OKWF6U6U6HZJQ3V6WNV7M2A/m/wagon-providers/wagon-scm/target/test-classes/test-repo-git-test/]|F:\jenkins\jenkins-slave\workspace\n-box_maven-wagon_WAGON-528-IMNZXLSWVKGSMF6UG52A7YYKAK332OKWF6U6U6HZJQ3V6WNV7M2A\m\wagon-providers\wagon-scm\target\test-output\test-resource|test-resource[len = 18; mod = 1536774110224]]): expected: 1, actual: 0


FAILED:  org.apache.maven.wagon.providers.scm.ScmGitExeWagonTest.testWagonPutDirectoryForDot

Error Message:
Error checking out: command failed: 'git' is not recognized as an internal or external command,
operable program or batch file.

Stack Trace:
org.apache.maven.wagon.TransferFailedException:
Error checking out: command failed: 'git' is not recognized as an internal or external command,
operable program or batch file.
Caused by: org.apache.maven.scm.ScmException:
command failed: 'git' is not recognized as an internal or external command,
operable program or batch file.


FAILED:  org.apache.maven.wagon.providers.scm.ScmGitExeWagonTest.testWagonPutDirectoryWhenDirectoryAlreadyExists

Error Message:
Error checking out: command failed: 'git' is not recognized as an internal or external command,
operable program or batch file.

Stack Trace:
org.apache.maven.wagon.TransferFailedException:
Error checking out: command failed: 'git' is not recognized as an internal or external command,
operable program or batch file.
Caused by: org.apache.maven.scm.ScmException:
command failed: 'git' is not recognized as an internal or external command,
operable program or batch file.


FAILED:  org.apache.maven.wagon.providers.scm.ScmGitExeWagonTest.testWagonPutDirectory

Error Message:
Error interacting with SCM: Unable to commit file. The git-commit command failed.
*** Please tell me who you are.

Run

  git config --global user.email "[hidden email]"
  git config --global user.name "Your Name"

to set your account's default identity.
Omit --global to set the identity only in this repository.

fatal:********@asf928.gq1.ygridcore.net>) not allowed


Stack Trace:
org.apache.maven.wagon.TransferFailedException:
Error interacting with SCM: Unable to commit file. The git-commit command failed.
*** Please tell me who you are.

Run

  git config --global user.email "[hidden email]"
  git config --global user.name "Your Name"

to set your account's default identity.
Omit --global to set the identity only in this repository.

fatal:********@asf928.gq1.ygridcore.net>) not allowed

Caused by: org.apache.maven.scm.ScmException:
Unable to commit file. The git-commit command failed.
*** Please tell me who you are.

Run

  git config --global user.email "[hidden email]"
  git config --global user.name "Your Name"

to set your account's default identity.
Omit --global to set the identity only in this repository.

fatal:********@asf928.gq1.ygridcore.net>) not allowed



FAILED:  org.apache.maven.wagon.providers.scm.ScmGitExeWagonTest.testWagonPutDirectoryDeepDestination

Error Message:
Error interacting with SCM: Unable to commit file. The git-commit command failed.
*** Please tell me who you are.

Run

  git config --global user.email "[hidden email]"
  git config --global user.name "Your Name"

to set your account's default identity.
Omit --global to set the identity only in this repository.

fatal:********@asf928.gq1.ygridcore.net>) not allowed


Stack Trace:
org.apache.maven.wagon.TransferFailedException:
Error interacting with SCM: Unable to commit file. The git-commit command failed.
*** Please tell me who you are.

Run

  git config --global user.email "[hidden email]"
  git config --global user.name "Your Name"

to set your account's default identity.
Omit --global to set the identity only in this repository.

fatal:********@asf928.gq1.ygridcore.net>) not allowed

Caused by: org.apache.maven.scm.ScmException:
Unable to commit file. The git-commit command failed.
*** Please tell me who you are.

Run

  git config --global user.email "[hidden email]"
  git config --global user.name "Your Name"

to set your account's default identity.
Omit --global to set the identity only in this repository.

fatal:********@asf928.gq1.ygridcore.net>) not allowed



FAILED:  org.apache.maven.wagon.providers.scm.ScmGitExeWagonTest.testWagon

Error Message:

  Unexpected method call TransferListener.transferError(TransferEvent[PUT|ERROR|Repository[scm:git:file:///home/jenkins/jenkins-slave/workspace/n-box_maven-wagon_WAGON-528-IMNZXLSWVKGSMF6UG52A7YYKAK332OKWF6U6U6HZJQ3V6WNV7M2A/m/wagon-providers/wagon-scm/target/test-classes/test-repo-git-test/]|null|test-resource[len = 18; mod = 1536774189000]]):
    TransferListener.transferCompleted(TransferEvent[PUT|COMPLETED|Repository[scm:git:file:///home/jenkins/jenkins-slave/workspace/n-box_maven-wagon_WAGON-528-IMNZXLSWVKGSMF6UG52A7YYKAK332OKWF6U6U6HZJQ3V6WNV7M2A/m/wagon-providers/wagon-scm/target/test-classes/test-repo-git-test/]|/home/jenkins/jenkins-slave/workspace/n-box_maven-wagon_WAGON-528-IMNZXLSWVKGSMF6UG52A7YYKAK332OKWF6U6U6HZJQ3V6WNV7M2A/m/wagon-providers/wagon-scm/target/test-output/test-resource|test-resource[len = 18; mod = 1536774189000]]): expected: 1, actual: 0

Stack Trace:
java.lang.AssertionError:

  Unexpected method call TransferListener.transferError(TransferEvent[PUT|ERROR|Repository[scm:git:file:///home/jenkins/jenkins-slave/workspace/n-box_maven-wagon_WAGON-528-IMNZXLSWVKGSMF6UG52A7YYKAK332OKWF6U6U6HZJQ3V6WNV7M2A/m/wagon-providers/wagon-scm/target/test-classes/test-repo-git-test/]|null|test-resource[len = 18; mod = 1536774189000]]):
    TransferListener.transferCompleted(TransferEvent[PUT|COMPLETED|Repository[scm:git:file:///home/jenkins/jenkins-slave/workspace/n-box_maven-wagon_WAGON-528-IMNZXLSWVKGSMF6UG52A7YYKAK332OKWF6U6U6HZJQ3V6WNV7M2A/m/wagon-providers/wagon-scm/target/test-classes/test-repo-git-test/]|/home/jenkins/jenkins-slave/workspace/n-box_maven-wagon_WAGON-528-IMNZXLSWVKGSMF6UG52A7YYKAK332OKWF6U6U6HZJQ3V6WNV7M2A/m/wagon-providers/wagon-scm/target/test-output/test-resource|test-resource[len = 18; mod = 1536774189000]]): expected: 1, actual: 0


FAILED:  org.apache.maven.wagon.providers.scm.ScmGitExeWagonTest.testWagonPutDirectoryForDot

Error Message:
Error interacting with SCM: Unable to commit file. The git-commit command failed.
*** Please tell me who you are.

Run

  git config --global user.email "[hidden email]"
  git config --global user.name "Your Name"

to set your account's default identity.
Omit --global to set the identity only in this repository.

fatal:********@asf928.gq1.ygridcore.net>) not allowed


Stack Trace:
org.apache.maven.wagon.TransferFailedException:
Error interacting with SCM: Unable to commit file. The git-commit command failed.
*** Please tell me who you are.

Run

  git config --global user.email "[hidden email]"
  git config --global user.name "Your Name"

to set your account's default identity.
Omit --global to set the identity only in this repository.

fatal:********@asf928.gq1.ygridcore.net>) not allowed

Caused by: org.apache.maven.scm.ScmException:
Unable to commit file. The git-commit command failed.
*** Please tell me who you are.

Run

  git config --global user.email "[hidden email]"
  git config --global user.name "Your Name"

to set your account's default identity.
Omit --global to set the identity only in this repository.

fatal:********@asf928.gq1.ygridcore.net>) not allowed



FAILED:  org.apache.maven.wagon.providers.scm.ScmGitExeWagonTest.testWagonPutDirectoryWhenDirectoryAlreadyExists

Error Message:
Error interacting with SCM: Unable to commit file. The git-commit command failed.
*** Please tell me who you are.

Run

  git config --global user.email "[hidden email]"
  git config --global user.name "Your Name"

to set your account's default identity.
Omit --global to set the identity only in this repository.

fatal:********@asf928.gq1.ygridcore.net>) not allowed


Stack Trace:
org.apache.maven.wagon.TransferFailedException:
Error interacting with SCM: Unable to commit file. The git-commit command failed.
*** Please tell me who you are.

Run

  git config --global user.email "[hidden email]"
  git config --global user.name "Your Name"

to set your account's default identity.
Omit --global to set the identity only in this repository.

fatal:********@asf928.gq1.ygridcore.net>) not allowed

Caused by: org.apache.maven.scm.ScmException:
Unable to commit file. The git-commit command failed.
*** Please tell me who you are.

Run

  git config --global user.email "[hidden email]"
  git config --global user.name "Your Name"

to set your account's default identity.
Omit --global to set the identity only in this repository.

fatal:********@asf928.gq1.ygridcore.net>) not allowed



FAILED:  org.apache.maven.wagon.providers.scm.ScmGitExeWagonTest.testWagonPutDirectory

Error Message:
Error interacting with SCM: Unable to commit file. The git-commit command failed.
*** Please tell me who you are.

Run

  git config --global user.email "[hidden email]"
  git config --global user.name "Your Name"

to set your account's default identity.
Omit --global to set the identity only in this repository.

fatal:********@asf927.gq1.ygridcore.net>) not allowed


Stack Trace:
org.apache.maven.wagon.TransferFailedException:
Error interacting with SCM: Unable to commit file. The git-commit command failed.
*** Please tell me who you are.

Run

  git config --global user.email "[hidden email]"
  git config --global user.name "Your Name"

to set your account's default identity.
Omit --global to set the identity only in this repository.

fatal:********@asf927.gq1.ygridcore.net>) not allowed

Caused by: org.apache.maven.scm.ScmException:
Unable to commit file. The git-commit command failed.
*** Please tell me who you are.

Run

  git config --global user.email "[hidden email]"
  git config --global user.name "Your Name"

to set your account's default identity.
Omit --global to set the identity only in this repository.

fatal:********@asf927.gq1.ygridcore.net>) not allowed



FAILED:  org.apache.maven.wagon.providers.scm.ScmGitExeWagonTest.testWagonPutDirectoryDeepDestination

Error Message:
Error interacting with SCM: Unable to commit file. The git-commit command failed.
*** Please tell me who you are.

Run

  git config --global user.email "[hidden email]"
  git config --global user.name "Your Name"

to set your account's default identity.
Omit --global to set the identity only in this repository.

fatal:********@asf927.gq1.ygridcore.net>) not allowed


Stack Trace:
org.apache.maven.wagon.TransferFailedException:
Error interacting with SCM: Unable to commit file. The git-commit command failed.
*** Please tell me who you are.

Run

  git config --global user.email "[hidden email]"
  git config --global user.name "Your Name"

to set your account's default identity.
Omit --global to set the identity only in this repository.

fatal:********@asf927.gq1.ygridcore.net>) not allowed

Caused by: org.apache.maven.scm.ScmException:
Unable to commit file. The git-commit command failed.
*** Please tell me who you are.

Run

  git config --global user.email "[hidden email]"
  git config --global user.name "Your Name"

to set your account's default identity.
Omit --global to set the identity only in this repository.

fatal:********@asf927.gq1.ygridcore.net>) not allowed



FAILED:  org.apache.maven.wagon.providers.scm.ScmGitExeWagonTest.testWagon

Error Message:

  Unexpected method call TransferListener.transferError(TransferEvent[PUT|ERROR|Repository[scm:git:file:///home/jenkins/jenkins-slave/workspace/n-box_maven-wagon_WAGON-528-IMNZXLSWVKGSMF6UG52A7YYKAK332OKWF6U6U6HZJQ3V6WNV7M2A/m/wagon-providers/wagon-scm/target/test-classes/test-repo-git-test/]|null|test-resource[len = 18; mod = 1536774486000]]):
    TransferListener.transferCompleted(TransferEvent[PUT|COMPLETED|Repository[scm:git:file:///home/jenkins/jenkins-slave/workspace/n-box_maven-wagon_WAGON-528-IMNZXLSWVKGSMF6UG52A7YYKAK332OKWF6U6U6HZJQ3V6WNV7M2A/m/wagon-providers/wagon-scm/target/test-classes/test-repo-git-test/]|/home/jenkins/jenkins-slave/workspace/n-box_maven-wagon_WAGON-528-IMNZXLSWVKGSMF6UG52A7YYKAK332OKWF6U6U6HZJQ3V6WNV7M2A/m/wagon-providers/wagon-scm/target/test-output/test-resource|test-resource[len = 18; mod = 1536774486000]]): expected: 1, actual: 0

Stack Trace:
java.lang.AssertionError:

  Unexpected method call TransferListener.transferError(TransferEvent[PUT|ERROR|Repository[scm:git:file:///home/jenkins/jenkins-slave/workspace/n-box_maven-wagon_WAGON-528-IMNZXLSWVKGSMF6UG52A7YYKAK332OKWF6U6U6HZJQ3V6WNV7M2A/m/wagon-providers/wagon-scm/target/test-classes/test-repo-git-test/]|null|test-resource[len = 18; mod = 1536774486000]]):
    TransferListener.transferCompleted(TransferEvent[PUT|COMPLETED|Repository[scm:git:file:///home/jenkins/jenkins-slave/workspace/n-box_maven-wagon_WAGON-528-IMNZXLSWVKGSMF6UG52A7YYKAK332OKWF6U6U6HZJQ3V6WNV7M2A/m/wagon-providers/wagon-scm/target/test-classes/test-repo-git-test/]|/home/jenkins/jenkins-slave/workspace/n-box_maven-wagon_WAGON-528-IMNZXLSWVKGSMF6UG52A7YYKAK332OKWF6U6U6HZJQ3V6WNV7M2A/m/wagon-providers/wagon-scm/target/test-output/test-resource|test-resource[len = 18; mod = 1536774486000]]): expected: 1, actual: 0


FAILED:  org.apache.maven.wagon.providers.scm.ScmGitExeWagonTest.testWagonPutDirectoryForDot

Error Message:
Error interacting with SCM: Unable to commit file. The git-commit command failed.
*** Please tell me who you are.

Run

  git config --global user.email "[hidden email]"
  git config --global user.name "Your Name"

to set your account's default identity.
Omit --global to set the identity only in this repository.

fatal:********@asf927.gq1.ygridcore.net>) not allowed


Stack Trace:
org.apache.maven.wagon.TransferFailedException:
Error interacting with SCM: Unable to commit file. The git-commit command failed.
*** Please tell me who you are.

Run

  git config --global user.email "[hidden email]"
  git config --global user.name "Your Name"

to set your account's default identity.
Omit --global to set the identity only in this repository.

fatal:********@asf927.gq1.ygridcore.net>) not allowed

Caused by: org.apache.maven.scm.ScmException:
Unable to commit file. The git-commit command failed.
*** Please tell me who you are.

Run

  git config --global user.email "[hidden email]"
  git config --global user.name "Your Name"

to set your account's default identity.
Omit --global to set the identity only in this repository.

fatal:********@asf927.gq1.ygridcore.net>) not allowed



FAILED:  org.apache.maven.wagon.providers.scm.ScmGitExeWagonTest.testWagonPutDirectoryWhenDirectoryAlreadyExists

Error Message:
Error interacting with SCM: Unable to commit file. The git-commit command failed.
*** Please tell me who you are.

Run

  git config --global user.email "[hidden email]"
  git config --global user.name "Your Name"

to set your account's default identity.
Omit --global to set the identity only in this repository.

fatal:********@asf927.gq1.ygridcore.net>) not allowed


Stack Trace:
org.apache.maven.wagon.TransferFailedException:
Error interacting with SCM: Unable to commit file. The git-commit command failed.
*** Please tell me who you are.

Run

  git config --global user.email "[hidden email]"
  git config --global user.name "Your Name"

to set your account's default identity.
Omit --global to set the identity only in this repository.

fatal:********@asf927.gq1.ygridcore.net>) not allowed

Caused by: org.apache.maven.scm.ScmException:
Unable to commit file. The git-commit command failed.
*** Please tell me who you are.

Run

  git config --global user.email "[hidden email]"
  git config --global user.name "Your Name"

to set your account's default identity.
Omit --global to set the identity only in this repository.

fatal:********@asf927.gq1.ygridcore.net>) not allowed



FAILED:  org.apache.maven.wagon.providers.scm.ScmGitExeWagonTest.testWagonPutDirectory

Error Message:
Error checking out: command failed: 'git' is not recognized as an internal or external command,
operable program or batch file.

Stack Trace:
org.apache.maven.wagon.TransferFailedException:
Error checking out: command failed: 'git' is not recognized as an internal or external command,
operable program or batch file.
Caused by: org.apache.maven.scm.ScmException:
command failed: 'git' is not recognized as an internal or external command,
operable program or batch file.


FAILED:  org.apache.maven.wagon.providers.scm.ScmGitExeWagonTest.testWagonPutDirectoryDeepDestination

Error Message:
Error checking out: command failed: 'git' is not recognized as an internal or external command,
operable program or batch file.

Stack Trace:
org.apache.maven.wagon.TransferFailedException:
Error checking out: command failed: 'git' is not recognized as an internal or external command,
operable program or batch file.
Caused by: org.apache.maven.scm.ScmException:
command failed: 'git' is not recognized as an internal or external command,
operable program or batch file.


FAILED:  org.apache.maven.wagon.providers.scm.ScmGitExeWagonTest.testWagon

Error Message:

  Unexpected method call TransferListener.transferError(TransferEvent[GET|ERROR|Repository[scm:git:file:///F:/jenkins/jenkins-slave/workspace/n-box_maven-wagon_WAGON-528-IMNZXLSWVKGSMF6UG52A7YYKAK332OKWF6U6U6HZJQ3V6WNV7M2A/m/wagon-providers/wagon-scm/target/test-classes/test-repo-git-test/]|null|test-resource[len = 18; mod = 1536774690624]]):
    TransferListener.transferCompleted(TransferEvent[PUT|COMPLETED|Repository[scm:git:file:///F:/jenkins/jenkins-slave/workspace/n-box_maven-wagon_WAGON-528-IMNZXLSWVKGSMF6UG52A7YYKAK332OKWF6U6U6HZJQ3V6WNV7M2A/m/wagon-providers/wagon-scm/target/test-classes/test-repo-git-test/]|F:\jenkins\jenkins-slave\workspace\n-box_maven-wagon_WAGON-528-IMNZXLSWVKGSMF6UG52A7YYKAK332OKWF6U6U6HZJQ3V6WNV7M2A\m\wagon-providers\wagon-scm\target\test-output\test-resource|test-resource[len = 18; mod = 1536774690624]]): expected: 1, actual: 0

Stack Trace:
java.lang.AssertionError:

  Unexpected method call TransferListener.transferError(TransferEvent[GET|ERROR|Repository[scm:git:file:///F:/jenkins/jenkins-slave/workspace/n-box_maven-wagon_WAGON-528-IMNZXLSWVKGSMF6UG52A7YYKAK332OKWF6U6U6HZJQ3V6WNV7M2A/m/wagon-providers/wagon-scm/target/test-classes/test-repo-git-test/]|null|test-resource[len = 18; mod = 1536774690624]]):
    TransferListener.transferCompleted(TransferEvent[PUT|COMPLETED|Repository[scm:git:file:///F:/jenkins/jenkins-slave/workspace/n-box_maven-wagon_WAGON-528-IMNZXLSWVKGSMF6UG52A7YYKAK332OKWF6U6U6HZJQ3V6WNV7M2A/m/wagon-providers/wagon-scm/target/test-classes/test-repo-git-test/]|F:\jenkins\jenkins-slave\workspace\n-box_maven-wagon_WAGON-528-IMNZXLSWVKGSMF6UG52A7YYKAK332OKWF6U6U6HZJQ3V6WNV7M2A\m\wagon-providers\wagon-scm\target\test-output\test-resource|test-resource[len = 18; mod = 1536774690624]]): expected: 1, actual: 0


FAILED:  org.apache.maven.wagon.providers.scm.ScmGitExeWagonTest.testWagonPutDirectoryForDot

Error Message:
Error checking out: command failed: 'git' is not recognized as an internal or external command,
operable program or batch file.

Stack Trace:
org.apache.maven.wagon.TransferFailedException:
Error checking out: command failed: 'git' is not recognized as an internal or external command,
operable program or batch file.
Caused by: org.apache.maven.scm.ScmException:
command failed: 'git' is not recognized as an internal or external command,
operable program or batch file.


FAILED:  org.apache.maven.wagon.providers.scm.ScmGitExeWagonTest.testWagonPutDirectoryWhenDirectoryAlreadyExists

Error Message:
Error checking out: command failed: 'git' is not recognized as an internal or external command,
operable program or batch file.

Stack Trace:
org.apache.maven.wagon.TransferFailedException:
Error checking out: command failed: 'git' is not recognized as an internal or external command,
operable program or batch file.
Caused by: org.apache.maven.scm.ScmException:
command failed: 'git' is not recognized as an internal or external command,
operable program or batch file.


FAILED:  org.apache.maven.wagon.providers.scm.ScmGitExeWagonTest.testWagonPutDirectory

Error Message:
Error checking out: command failed: 'git' is not recognized as an internal or external command,
operable program or batch file.

Stack Trace:
org.apache.maven.wagon.TransferFailedException:
Error checking out: command failed: 'git' is not recognized as an internal or external command,
operable program or batch file.
Caused by: org.apache.maven.scm.ScmException:
command failed: 'git' is not recognized as an internal or external command,
operable program or batch file.


FAILED:  org.apache.maven.wagon.providers.scm.ScmGitExeWagonTest.testWagonPutDirectoryDeepDestination

Error Message:
Error checking out: command failed: 'git' is not recognized as an internal or external command,
operable program or batch file.

Stack Trace:
org.apache.maven.wagon.TransferFailedException:
Error checking out: command failed: 'git' is not recognized as an internal or external command,
operable program or batch file.
Caused by: org.apache.maven.scm.ScmException:
command failed: 'git' is not recognized as an internal or external command,
operable program or batch file.


FAILED:  org.apache.maven.wagon.providers.scm.ScmGitExeWagonTest.testWagon

Error Message:

  Unexpected method call TransferListener.transferError(TransferEvent[GET|ERROR|Repository[scm:git:file:///F:/jenkins/jenkins-slave/workspace/n-box_maven-wagon_WAGON-528-IMNZXLSWVKGSMF6UG52A7YYKAK332OKWF6U6U6HZJQ3V6WNV7M2A/m/wagon-providers/wagon-scm/target/test-classes/test-repo-git-test/]|null|test-resource[len = 18; mod = 1536775033705]]):
    TransferListener.transferCompleted(TransferEvent[PUT|COMPLETED|Repository[scm:git:file:///F:/jenkins/jenkins-slave/workspace/n-box_maven-wagon_WAGON-528-IMNZXLSWVKGSMF6UG52A7YYKAK332OKWF6U6U6HZJQ3V6WNV7M2A/m/wagon-providers/wagon-scm/target/test-classes/test-repo-git-test/]|F:\jenkins\jenkins-slave\workspace\n-box_maven-wagon_WAGON-528-IMNZXLSWVKGSMF6UG52A7YYKAK332OKWF6U6U6HZJQ3V6WNV7M2A\m\wagon-providers\wagon-scm\target\test-output\test-resource|test-resource[len = 18; mod = 1536775033705]]): expected: 1, actual: 0

Stack Trace:
java.lang.AssertionError:

  Unexpected method call TransferListener.transferError(TransferEvent[GET|ERROR|Repository[scm:git:file:///F:/jenkins/jenkins-slave/workspace/n-box_maven-wagon_WAGON-528-IMNZXLSWVKGSMF6UG52A7YYKAK332OKWF6U6U6HZJQ3V6WNV7M2A/m/wagon-providers/wagon-scm/target/test-classes/test-repo-git-test/]|null|test-resource[len = 18; mod = 1536775033705]]):
    TransferListener.transferCompleted(TransferEvent[PUT|COMPLETED|Repository[scm:git:file:///F:/jenkins/jenkins-slave/workspace/n-box_maven-wagon_WAGON-528-IMNZXLSWVKGSMF6UG52A7YYKAK332OKWF6U6U6HZJQ3V6WNV7M2A/m/wagon-providers/wagon-scm/target/test-classes/test-repo-git-test/]|F:\jenkins\jenkins-slave\workspace\n-box_maven-wagon_WAGON-528-IMNZXLSWVKGSMF6UG52A7YYKAK332OKWF6U6U6HZJQ3V6WNV7M2A\m\wagon-providers\wagon-scm\target\test-output\test-resource|test-resource[len = 18; mod = 1536775033705]]): expected: 1, actual: 0


FAILED:  org.apache.maven.wagon.providers.scm.ScmGitExeWagonTest.testWagonPutDirectoryForDot

Error Message:
Error checking out: command failed: 'git' is not recognized as an internal or external command,
operable program or batch file.

Stack Trace:
org.apache.maven.wagon.TransferFailedException:
Error checking out: command failed: 'git' is not recognized as an internal or external command,
operable program or batch file.
Caused by: org.apache.maven.scm.ScmException:
command failed: 'git' is not recognized as an internal or external command,
operable program or batch file.


FAILED:  org.apache.maven.wagon.providers.scm.ScmGitExeWagonTest.testWagonPutDirectoryWhenDirectoryAlreadyExists

Error Message:
Error checking out: command failed: 'git' is not recognized as an internal or external command,
operable program or batch file.

Stack Trace:
org.apache.maven.wagon.TransferFailedException:
Error checking out: command failed: 'git' is not recognized as an internal or external command,
operable program or batch file.
Caused by: org.apache.maven.scm.ScmException:
command failed: 'git' is not recognized as an internal or external command,
operable program or batch file.




Build log:
[...truncated 3.35 MB...]
[windows-jdk9] [INFO]
[windows-jdk9] [INFO] --- maven-enforcer-plugin:1.4.1:enforce (default) @ wagon-ssh ---
[windows-jdk9] [INFO]
[windows-jdk9] [INFO] --- apache-rat-plugin:0.12:check (rat-check) @ wagon-ssh ---
[windows-jdk9] [INFO] Enabled default license matchers.
[windows-jdk9] [INFO] Will parse SCM ignores for exclusions...
[windows-jdk9] [INFO] Finished adding exclusions from SCM ignore files.
[windows-jdk9] [INFO] 61 implicit excludes (use -debug for more details).
[windows-jdk9] [INFO] Exclude: .checkstyle
[windows-jdk9] [INFO] Exclude: **/*.odg
[windows-jdk9] [INFO] Exclude: src/test/resources/**
[windows-jdk9] [INFO] Exclude: src/main/resources/default-server-root/**
[windows-jdk9] [INFO] Exclude: src/main/resources/ssh-keys/**
[windows-jdk9] [INFO] Exclude: src/test/ssh-keys/**
[windows-jdk9] [INFO] Exclude: .repository/**
[windows-jdk9] [INFO] Exclude: out/**
[windows-jdk9] [INFO] Exclude: .repository/**
[windows-jdk9] [INFO] Exclude: .maven/spy.log
[windows-jdk9] [INFO] Exclude: dependency-reduced-pom.xml
[windows-jdk9] [INFO] Exclude: .java-version
[windows-jdk9] [INFO] 19 resources included (use -debug for more details)
[windows-jdk9] [INFO] Rat check: Summary over all files. Unapproved: 0, unknown: 0, generated: 0, approved: 19 licenses.
[windows-jdk9] [INFO]
[windows-jdk9] [INFO] --- maven-remote-resources-plugin:1.5:process (process-resource-bundles) @ wagon-ssh ---
[windows-jdk9] [INFO]
[windows-jdk9] [INFO] --- maven-resources-plugin:3.0.2:resources (default-resources) @ wagon-ssh ---
[windows-jdk9] [INFO] Using 'UTF-8' encoding to copy filtered resources.
[windows-jdk9] [INFO] skip non existing resourceDirectory F:\jenkins\jenkins-slave\workspace\n-box_maven-wagon_WAGON-528-IMNZXLSWVKGSMF6UG52A7YYKAK332OKWF6U6U6HZJQ3V6WNV7M2A\m\wagon-providers\wagon-ssh\src\main\resources
[windows-jdk9] [INFO] Copying 3 resources
[windows-jdk9] [INFO]
[windows-jdk9] [INFO] --- maven-compiler-plugin:3.7.0:compile (default-compile) @ wagon-ssh ---
[windows-jdk9] [INFO] Changes detected - recompiling the module!
[windows-jdk9] [INFO] Compiling 7 source files to F:\jenkins\jenkins-slave\workspace\n-box_maven-wagon_WAGON-528-IMNZXLSWVKGSMF6UG52A7YYKAK332OKWF6U6U6HZJQ3V6WNV7M2A\m\wagon-providers\wagon-ssh\target\classes
[windows-jdk9] [INFO]
[windows-jdk9] [INFO] --- plexus-component-metadata:1.7.1:generate-metadata (generate) @ wagon-ssh ---
[windows-jdk9] [INFO] Discovered 4 component descriptors(s)
[windows-jdk9] [INFO]
[windows-jdk9] [INFO] --- animal-sniffer-maven-plugin:1.15:check (check-java-1.7-compat) @ wagon-ssh ---
[windows-jdk9] [INFO] Checking unresolved references to org.codehaus.mojo.signature:java17:1.0
[windows-jdk9] [INFO]
[windows-jdk9] [INFO] --- maven-resources-plugin:3.0.2:testResources (default-testResources) @ wagon-ssh ---
[windows-jdk9] [INFO] Using 'UTF-8' encoding to copy filtered resources.
[windows-jdk9] [INFO] Copying 6 resources
[windows-jdk9] [INFO] Copying 3 resources
[windows-jdk9] [INFO]
[windows-jdk9] [INFO] --- maven-compiler-plugin:3.7.0:testCompile (default-testCompile) @ wagon-ssh ---
[windows-jdk9] [INFO] Changes detected - recompiling the module!
[windows-jdk9] [INFO] Compiling 8 source files to F:\jenkins\jenkins-slave\workspace\n-box_maven-wagon_WAGON-528-IMNZXLSWVKGSMF6UG52A7YYKAK332OKWF6U6U6HZJQ3V6WNV7M2A\m\wagon-providers\wagon-ssh\target\test-classes
[windows-jdk9] [INFO] /F:/jenkins/jenkins-slave/workspace/n-box_maven-wagon_WAGON-528-IMNZXLSWVKGSMF6UG52A7YYKAK332OKWF6U6U6HZJQ3V6WNV7M2A/m/wagon-providers/wagon-ssh/src/test/java/org/apache/maven/wagon/providers/ssh/jsch/ScpWagonWithSshPrivateKeySearchTest.java: F:\jenkins\jenkins-slave\workspace\n-box_maven-wagon_WAGON-528-IMNZXLSWVKGSMF6UG52A7YYKAK332OKWF6U6U6HZJQ3V6WNV7M2A\m\wagon-providers\wagon-ssh\src\test\java\org\apache\maven\wagon\providers\ssh\jsch\ScpWagonWithSshPrivateKeySearchTest.java uses or overrides a deprecated API.
[windows-jdk9] [INFO] /F:/jenkins/jenkins-slave/workspace/n-box_maven-wagon_WAGON-528-IMNZXLSWVKGSMF6UG52A7YYKAK332OKWF6U6U6HZJQ3V6WNV7M2A/m/wagon-providers/wagon-ssh/src/test/java/org/apache/maven/wagon/providers/ssh/jsch/ScpWagonWithSshPrivateKeySearchTest.java: Recompile with -Xlint:deprecation for details.
[windows-jdk9] [INFO]
[windows-jdk9] [INFO] --- maven-surefire-plugin:2.20:test (default-test) @ wagon-ssh ---
[windows-jdk9] [INFO]
[windows-jdk9] [INFO] --- maven-jar-plugin:3.0.2:jar (default-jar) @ wagon-ssh ---
[windows-jdk9] [INFO] Building jar: F:\jenkins\jenkins-slave\workspace\n-box_maven-wagon_WAGON-528-IMNZXLSWVKGSMF6UG52A7YYKAK332OKWF6U6U6HZJQ3V6WNV7M2A\m\wagon-providers\wagon-ssh\target\wagon-ssh-3.1.1-SNAPSHOT.jar
[windows-jdk9] [INFO]
[windows-jdk9] [INFO] --- maven-site-plugin:3.7:attach-descriptor (attach-descriptor) @ wagon-ssh ---
[windows-jdk9] [INFO] Skipping because packaging 'jar' is not pom.
[windows-jdk9] [INFO]
[windows-jdk9] [INFO] --- maven-checkstyle-plugin:3.0.0:check (checkstyle-check) @ wagon-ssh ---
[windows-jdk9] [INFO] There is 1 error reported by Checkstyle 6.18 with config/maven_checks.xml ruleset.
[windows-jdk9] [INFO] Ignored 1 error, 0 violation remaining.
[windows-jdk9] [INFO]
[windows-jdk9] [INFO] ------------------------------------------------------------------------
[windows-jdk9] [INFO] Building Apache Maven Wagon :: Providers :: WebDAV Provider 3.1.1-SNAPSHOT
[windows-jdk9] [INFO] ------------------------------------------------------------------------
[windows-jdk9] [INFO] Downloading from central: https://repo.maven.apache.org/maven2/org/apache/jackrabbit/jackrabbit-webdav/2.14.4/jackrabbit-webdav-2.14.4.pom
[windows-jdk9] [INFO] Downloaded from central: https://repo.maven.apache.org/maven2/org/apache/jackrabbit/jackrabbit-webdav/2.14.4/jackrabbit-webdav-2.14.4.pom (4.0 kB at 104 kB/s)
[windows-jdk9] [INFO] Downloading from central: https://repo.maven.apache.org/maven2/org/apache/jackrabbit/jackrabbit-parent/2.14.4/jackrabbit-parent-2.14.4.pom
[windows-jdk9] [INFO] Downloaded from central: https://repo.maven.apache.org/maven2/org/apache/jackrabbit/jackrabbit-parent/2.14.4/jackrabbit-parent-2.14.4.pom (35 kB at 144 kB/s)
[windows-jdk9] [INFO] Downloading from central: https://repo.maven.apache.org/maven2/it/could/webdav/0.4/webdav-0.4.pom
[windows-jdk9] [INFO] Downloaded from central: https://repo.maven.apache.org/maven2/it/could/webdav/0.4/webdav-0.4.pom (1.1 kB at 36 kB/s)
[windows-jdk9] [INFO] Downloading from central: https://repo.maven.apache.org/maven2/biz/aQute/bnd/1.50.0/bnd-1.50.0.pom
[windows-jdk9] [INFO] Downloaded from central: https://repo.maven.apache.org/maven2/biz/aQute/bnd/1.50.0/bnd-1.50.0.pom (1.3 kB at 46 kB/s)
[windows-jdk9] [INFO] Downloading from central: https://repo.maven.apache.org/maven2/it/could/webdav/0.4/webdav-0.4.jar
[windows-jdk9] [INFO] Downloading from central: https://repo.maven.apache.org/maven2/javax/servlet/servlet-api/2.3/servlet-api-2.3.jar
[windows-jdk9] [INFO] Downloading from central: https://repo.maven.apache.org/maven2/biz/aQute/bnd/1.50.0/bnd-1.50.0.jar
[windows-jdk9] [INFO] Downloading from central: https://repo.maven.apache.org/maven2/org/apache/jackrabbit/jackrabbit-webdav/2.14.4/jackrabbit-webdav-2.14.4.jar
[windows-jdk9] [INFO] Downloaded from central: https://repo.maven.apache.org/maven2/javax/servlet/servlet-api/2.3/servlet-api-2.3.jar (78 kB at 2.0 MB/s)
[windows-jdk9] [INFO] Downloaded from central: https://repo.maven.apache.org/maven2/org/apache/jackrabbit/jackrabbit-webdav/2.14.4/jackrabbit-webdav-2.14.4.jar (365 kB at 7.8 MB/s)
[windows-jdk9] [INFO] Downloaded from central: https://repo.maven.apache.org/maven2/it/could/webdav/0.4/webdav-0.4.jar (103 kB at 2.2 MB/s)
[windows-jdk9] [INFO] Downloaded from central: https://repo.maven.apache.org/maven2/biz/aQute/bnd/1.50.0/bnd-1.50.0.jar (828 kB at 15 MB/s)
[windows-jdk9] [INFO]
[windows-jdk9] [INFO] --- maven-clean-plugin:3.0.0:clean (default-clean) @ wagon-webdav-jackrabbit ---
[windows-jdk9] [INFO]
[windows-jdk9] [INFO] --- maven-enforcer-plugin:1.4.1:enforce (enforce-maven-version) @ wagon-webdav-jackrabbit ---
[windows-jdk9] [INFO]
[windows-jdk9] [INFO] --- maven-enforcer-plugin:1.4.1:enforce (enforce-bytecode-version) @ wagon-webdav-jackrabbit ---
[windows-jdk9] [INFO]
[windows-jdk9] [INFO] --- maven-enforcer-plugin:1.4.1:enforce (ban-known-bad-maven-versions) @ wagon-webdav-jackrabbit ---
[windows-jdk9] [INFO]
[windows-jdk9] [INFO] --- maven-enforcer-plugin:1.4.1:enforce (default) @ wagon-webdav-jackrabbit ---
[windows-jdk9] [INFO]
[windows-jdk9] [INFO] --- apache-rat-plugin:0.12:check (rat-check) @ wagon-webdav-jackrabbit ---
[windows-jdk9] [INFO] Enabled default license matchers.
[windows-jdk9] [INFO] Will parse SCM ignores for exclusions...
[windows-jdk9] [INFO] Finished adding exclusions from SCM ignore files.
[windows-jdk9] [INFO] 61 implicit excludes (use -debug for more details).
[windows-jdk9] [INFO] Exclude: .checkstyle
[windows-jdk9] [INFO] Exclude: **/*.odg
[windows-jdk9] [INFO] Exclude: src/test/resources/**
[windows-jdk9] [INFO] Exclude: src/main/resources/default-server-root/**
[windows-jdk9] [INFO] Exclude: src/main/resources/ssh-keys/**
[windows-jdk9] [INFO] Exclude: src/test/ssh-keys/**
[windows-jdk9] [INFO] Exclude: .repository/**
[windows-jdk9] [INFO] Exclude: out/**
[windows-jdk9] [INFO] Exclude: .repository/**
[windows-jdk9] [INFO] Exclude: .maven/spy.log
[windows-jdk9] [INFO] Exclude: dependency-reduced-pom.xml
[windows-jdk9] [INFO] Exclude: .java-version
[windows-jdk9] [INFO] 12 resources included (use -debug for more details)
[windows-jdk9] [INFO] Rat check: Summary over all files. Unapproved: 0, unknown: 0, generated: 0, approved: 12 licenses.
[windows-jdk9] [INFO]
[windows-jdk9] [INFO] --- maven-remote-resources-plugin:1.5:process (process-resource-bundles) @ wagon-webdav-jackrabbit ---
[windows-jdk9] [INFO]
[windows-jdk9] [INFO] --- maven-resources-plugin:3.0.2:resources (default-resources) @ wagon-webdav-jackrabbit ---
[windows-jdk9] [INFO] Using 'UTF-8' encoding to copy filtered resources.
[windows-jdk9] [INFO] Copying 1 resource
[windows-jdk9] [INFO] Copying 3 resources
[windows-jdk9] [INFO]
[windows-jdk9] [INFO] --- maven-compiler-plugin:3.7.0:compile (default-compile) @ wagon-webdav-jackrabbit ---
[windows-jdk9] [INFO] Changes detected - recompiling the module!
[windows-jdk9] [INFO] Compiling 4 source files to F:\jenkins\jenkins-slave\workspace\n-box_maven-wagon_WAGON-528-IMNZXLSWVKGSMF6UG52A7YYKAK332OKWF6U6U6HZJQ3V6WNV7M2A\m\wagon-providers\wagon-webdav-jackrabbit\target\classes
[windows-jdk9] [INFO] /F:/jenkins/jenkins-slave/workspace/n-box_maven-wagon_WAGON-528-IMNZXLSWVKGSMF6UG52A7YYKAK332OKWF6U6U6HZJQ3V6WNV7M2A/m/wagon-providers/wagon-webdav-jackrabbit/src/main/java/org/apache/maven/wagon/providers/webdav/WebDavWagon.java: F:\jenkins\jenkins-slave\workspace\n-box_maven-wagon_WAGON-528-IMNZXLSWVKGSMF6UG52A7YYKAK332OKWF6U6U6HZJQ3V6WNV7M2A\m\wagon-providers\wagon-webdav-jackrabbit\src\main\java\org\apache\maven\wagon\providers\webdav\WebDavWagon.java uses or overrides a deprecated API.
[windows-jdk9] [INFO] /F:/jenkins/jenkins-slave/workspace/n-box_maven-wagon_WAGON-528-IMNZXLSWVKGSMF6UG52A7YYKAK332OKWF6U6U6HZJQ3V6WNV7M2A/m/wagon-providers/wagon-webdav-jackrabbit/src/main/java/org/apache/maven/wagon/providers/webdav/WebDavWagon.java: Recompile with -Xlint:deprecation for details.
[windows-jdk9] [INFO]
[windows-jdk9] [INFO] --- plexus-component-metadata:1.7.1:generate-metadata (generate) @ wagon-webdav-jackrabbit ---
[windows-jdk9] [INFO] Discovered 1 component descriptors(s)
[windows-jdk9] [INFO]
[windows-jdk9] [INFO] --- animal-sniffer-maven-plugin:1.15:check (check-java-1.7-compat) @ wagon-webdav-jackrabbit ---
[windows-jdk9] [INFO] Checking unresolved references to org.codehaus.mojo.signature:java17:1.0
[windows-jdk9] [INFO]
[windows-jdk9] [INFO] --- maven-resources-plugin:3.0.2:testResources (default-testResources) @ wagon-webdav-jackrabbit ---
[windows-jdk9] [INFO] Using 'UTF-8' encoding to copy filtered resources.
[windows-jdk9] [INFO] Copying 2 resources
[windows-jdk9] [INFO] Copying 3 resources
[windows-jdk9] [INFO]
[windows-jdk9] [INFO] --- maven-compiler-plugin:3.7.0:testCompile (default-testCompile) @ wagon-webdav-jackrabbit ---
[windows-jdk9] [INFO] Changes detected - recompiling the module!
[windows-jdk9] [INFO] Compiling 4 source files to F:\jenkins\jenkins-slave\workspace\n-box_maven-wagon_WAGON-528-IMNZXLSWVKGSMF6UG52A7YYKAK332OKWF6U6U6HZJQ3V6WNV7M2A\m\wagon-providers\wagon-webdav-jackrabbit\target\test-classes
[windows-jdk9] [INFO] /F:/jenkins/jenkins-slave/workspace/n-box_maven-wagon_WAGON-528-IMNZXLSWVKGSMF6UG52A7YYKAK332OKWF6U6U6HZJQ3V6WNV7M2A/m/wagon-providers/wagon-webdav-jackrabbit/src/test/java/org/apache/maven/wagon/providers/webdav/HttpClientWagonTest.java: F:\jenkins\jenkins-slave\workspace\n-box_maven-wagon_WAGON-528-IMNZXLSWVKGSMF6UG52A7YYKAK332OKWF6U6U6HZJQ3V6WNV7M2A\m\wagon-providers\wagon-webdav-jackrabbit\src\test\java\org\apache\maven\wagon\providers\webdav\HttpClientWagonTest.java uses or overrides a deprecated API.
[windows-jdk9] [INFO] /F:/jenkins/jenkins-slave/workspace/n-box_maven-wagon_WAGON-528-IMNZXLSWVKGSMF6UG52A7YYKAK332OKWF6U6U6HZJQ3V6WNV7M2A/m/wagon-providers/wagon-webdav-jackrabbit/src/test/java/org/apache/maven/wagon/providers/webdav/HttpClientWagonTest.java: Recompile with -Xlint:deprecation for details.
[windows-jdk9] [INFO]
[windows-jdk9] [INFO] --- maven-surefire-plugin:2.20:test (default-test) @ wagon-webdav-jackrabbit ---
[windows-jdk9] [INFO]
[windows-jdk9] [INFO] -------------------------------------------------------
[windows-jdk9] [INFO]  T E S T S
[windows-jdk9] [INFO] -------------------------------------------------------
[windows-jdk9] [INFO] Running org.apache.maven.wagon.providers.webdav.HttpClientWagonTest
[windows-jdk9] [INFO] Tests run: 6, Failures: 0, Errors: 0, Skipped: 0, Time elapsed: 1.257 s - in org.apache.maven.wagon.providers.webdav.HttpClientWagonTest
[windows-jdk9] [INFO] Running org.apache.maven.wagon.providers.webdav.PathNavigatorTest
[windows-jdk9] [INFO] Tests run: 1, Failures: 0, Errors: 0, Skipped: 0, Time elapsed: 0 s - in org.apache.maven.wagon.providers.webdav.PathNavigatorTest
[windows-jdk9] [INFO] Running org.apache.maven.wagon.providers.webdav.WebDavsWagonTest
[windows-jdk9] [INFO] Tests run: 69, Failures: 0, Errors: 0, Skipped: 0, Time elapsed: 33.914 s - in org.apache.maven.wagon.providers.webdav.WebDavsWagonTest
[windows-jdk9] [INFO] Running org.apache.maven.wagon.providers.webdav.WebDavWagonTest
[windows-jdk9] [INFO] Tests run: 69, Failures: 0, Errors: 0, Skipped: 0, Time elapsed: 27.145 s - in org.apache.maven.wagon.providers.webdav.WebDavWagonTest
[windows-jdk9] [INFO]
[windows-jdk9] [INFO] Results:
[windows-jdk9] [INFO]
[windows-jdk9] [INFO] Tests run: 145, Failures: 0, Errors: 0, Skipped: 0
[windows-jdk9] [INFO]
[windows-jdk9] [INFO]
[windows-jdk9] [INFO] --- maven-jar-plugin:3.0.2:jar (default-jar) @ wagon-webdav-jackrabbit ---
[windows-jdk9] [INFO] Building jar: F:\jenkins\jenkins-slave\workspace\n-box_maven-wagon_WAGON-528-IMNZXLSWVKGSMF6UG52A7YYKAK332OKWF6U6U6HZJQ3V6WNV7M2A\m\wagon-providers\wagon-webdav-jackrabbit\target\wagon-webdav-jackrabbit-3.1.1-SNAPSHOT.jar
[windows-jdk9] [INFO]
[windows-jdk9] [INFO] --- maven-site-plugin:3.7:attach-descriptor (attach-descriptor) @ wagon-webdav-jackrabbit ---
[windows-jdk9] [INFO] Skipping because packaging 'jar' is not pom.
[windows-jdk9] [INFO]
[windows-jdk9] [INFO] --- maven-checkstyle-plugin:3.0.0:check (checkstyle-check) @ wagon-webdav-jackrabbit ---
[windows-jdk9] [INFO] ------------------------------------------------------------------------
[windows-jdk9] [INFO] Reactor Summary:
[windows-jdk9] [INFO]
[windows-jdk9] [INFO] Apache Maven Wagon ................................. SUCCESS [ 57.929 s]
[windows-jdk9] [INFO] Apache Maven Wagon :: API .......................... SUCCESS [ 18.840 s]
[windows-jdk9] [INFO] Apache Maven Wagon :: Provider Test ................ SUCCESS [  4.813 s]
[windows-jdk9] [INFO] Apache Maven Wagon :: Providers .................... SUCCESS [  1.547 s]
[windows-jdk9] [INFO] Apache Maven Wagon :: Providers :: File Provider ... SUCCESS [  4.399 s]
[windows-jdk9] [INFO] Apache Maven Wagon :: Providers :: FTP Provider .... SUCCESS [  8.562 s]
[windows-jdk9] [INFO] Apache Maven Wagon :: Providers :: HTTP Shared Library SUCCESS [  5.618 s]
[windows-jdk9] [INFO] Apache Maven Wagon :: Test Compatibility Kits ...... SUCCESS [  1.211 s]
[windows-jdk9] [INFO] Apache Maven Wagon :: HTTP Test Compatibility Kit .. SUCCESS [  3.167 s]
[windows-jdk9] [INFO] Apache Maven Wagon :: Providers :: HTTP Provider ... SUCCESS [05:10 min]
[windows-jdk9] [INFO] Apache Maven Wagon :: Providers :: Lightweight HTTP Provider SUCCESS [02:13 min]
[windows-jdk9] [INFO] Apache Maven Wagon :: Providers :: SCM Provider .... SUCCESS [ 40.930 s]
[windows-jdk9] [INFO] Apache Maven Wagon :: Providers :: SSH Common Library SUCCESS [  4.320 s]
[windows-jdk9] [INFO] Apache Maven Wagon :: Providers :: SSH Common Tests  SUCCESS [  3.495 s]
[windows-jdk9] [INFO] Apache Maven Wagon :: Providers :: SSH External Provider SUCCESS [  2.458 s]
[windows-jdk9] [INFO] Apache Maven Wagon :: Providers :: SSH Provider .... SUCCESS [  6.023 s]
[windows-jdk9] [INFO] Apache Maven Wagon :: Providers :: WebDAV Provider . SUCCESS [01:08 min]
[windows-jdk9] [INFO] ------------------------------------------------------------------------
[windows-jdk9] [INFO] BUILD SUCCESS
[windows-jdk9] [INFO] ------------------------------------------------------------------------
[windows-jdk9] [INFO] Total time: 11:18 min
[windows-jdk9] [INFO] Finished at: 2018-09-12T10:59:12-07:00
[windows-jdk9] [INFO] Final Memory: 45M/152M
[windows-jdk9] [INFO] ------------------------------------------------------------------------
[windows-jdk9] [WARNING] The requested profile "run-its" could not be activated because it does not exist.
[windows-jdk9] [INFO] [jenkins-event-spy] Generated F:\jenkins\jenkins-slave\workspace\n-box_maven-wagon_WAGON-528-IMNZXLSWVKGSMF6UG52A7YYKAK332OKWF6U6U6HZJQ3V6WNV7M2A@tmp\withMavenb56e0629\maven-spy-20180912-104753-8201007460813226919053.log
[Pipeline] [windows-jdk9] }
[Pipeline] [windows-jdk9] // dir
[Pipeline] [windows-jdk9] }
[windows-jdk9] [withMaven] junitPublisher - Archive test results for Maven artifact org.apache.maven.wagon:wagon-provider-api:3.1.1-SNAPSHOT generated by maven-surefire-plugin:test (default-test): m\wagon-provider-api\target\surefire-reports\*.xml
[windows-jdk9] Recording test results
[windows-jdk9] [withMaven] junitPublisher - Archive test results for Maven artifact org.apache.maven.wagon:wagon-provider-test:3.1.1-SNAPSHOT generated by maven-surefire-plugin:test (default-test): m\wagon-provider-test\target\surefire-reports\*.xml
[windows-jdk9] Recording test results
[windows-jdk9] None of the test reports contained any result
[windows-jdk9] [withMaven] junitPublisher - Archive test results for Maven artifact org.apache.maven.wagon:wagon-file:3.1.1-SNAPSHOT generated by maven-surefire-plugin:test (default-test): m\wagon-providers\wagon-file\target\surefire-reports\*.xml
[windows-jdk9] Recording test results
[windows-jdk9] [withMaven] junitPublisher - Archive test results for Maven artifact org.apache.maven.wagon:wagon-ftp:3.1.1-SNAPSHOT generated by maven-surefire-plugin:test (default-test): m\wagon-providers\wagon-ftp\target\surefire-reports\*.xml
[windows-jdk9] Recording test results
[windows-jdk9] [withMaven] junitPublisher - Archive test results for Maven artifact org.apache.maven.wagon:wagon-http-shared:3.1.1-SNAPSHOT generated by maven-surefire-plugin:test (default-test): m\wagon-providers\wagon-http-shared\target\surefire-reports\*.xml
[windows-jdk9] Recording test results
[windows-jdk9] [withMaven] junitPublisher - Archive test results for Maven artifact org.apache.maven.wagon:wagon-tck-http:3.1.1-SNAPSHOT generated by maven-surefire-plugin:test (default-test): m\wagon-tcks\wagon-tck-http\target\surefire-reports\*.xml
[windows-jdk9] Recording test results
[windows-jdk9] None of the test reports contained any result
[windows-jdk9] [withMaven] junitPublisher - Archive test results for Maven artifact org.apache.maven.wagon:wagon-http:3.1.1-SNAPSHOT generated by maven-surefire-plugin:test (default-test): m\wagon-providers\wagon-http\target\surefire-reports\*.xml
[windows-jdk9] Recording test results
[windows-jdk9] [withMaven] junitPublisher - Archive test results for Maven artifact org.apache.maven.wagon:wagon-http-lightweight:3.1.1-SNAPSHOT generated by maven-surefire-plugin:test (default-test): m\wagon-providers\wagon-http-lightweight\target\surefire-reports\*.xml
[windows-jdk9] Recording test results
[windows-jdk9] [withMaven] junitPublisher - Archive test results for Maven artifact org.apache.maven.wagon:wagon-scm:3.1.1-SNAPSHOT generated by maven-surefire-plugin:test (default-test): m\wagon-providers\wagon-scm\target\surefire-reports\*.xml
[windows-jdk9] Recording test results
[windows-jdk9] [withMaven] junitPublisher - Archive test results for Maven artifact org.apache.maven.wagon:wagon-ssh-common:3.1.1-SNAPSHOT generated by maven-surefire-plugin:test (default-test): m\wagon-providers\wagon-ssh-common\target\surefire-reports\*.xml
[windows-jdk9] Recording test results
[windows-jdk9] [withMaven] junitPublisher - Archive test results for Maven artifact org.apache.maven.wagon:wagon-ssh-common-test:3.1.1-SNAPSHOT generated by maven-surefire-plugin:test (default-test): m\wagon-providers\wagon-ssh-common-test\target\surefire-reports\*.xml
[windows-jdk9] Recording test results
[windows-jdk9] None of the test reports contained any result
[windows-jdk9] [withMaven] junitPublisher - Archive test results for Maven artifact org.apache.maven.wagon:wagon-ssh-external:3.1.1-SNAPSHOT generated by maven-surefire-plugin:test (default-test): m\wagon-providers\wagon-ssh-external\target\surefire-reports\*.xml
[windows-jdk9] Recording test results
[windows-jdk9] None of the test reports contained any result
[windows-jdk9] [withMaven] junitPublisher - Archive test results for Maven artifact org.apache.maven.wagon:wagon-ssh:3.1.1-SNAPSHOT generated by maven-surefire-plugin:test (default-test): m\wagon-providers\wagon-ssh\target\surefire-reports\*.xml
[windows-jdk9] Recording test results
[windows-jdk9] None of the test reports contained any result
[windows-jdk9] [withMaven] junitPublisher - Archive test results for Maven artifact org.apache.maven.wagon:wagon-webdav-jackrabbit:3.1.1-SNAPSHOT generated by maven-surefire-plugin:test (default-test): m\wagon-providers\wagon-webdav-jackrabbit\target\surefire-reports\*.xml
[windows-jdk9] Recording test results
[Pipeline] [windows-jdk9] // withMaven
[Pipeline] [windows-jdk9] cleanWs
[windows-jdk9] [WS-CLEANUP] Deleting project workspace...[WS-CLEANUP] done
[Pipeline] [windows-jdk9] }
[Pipeline] [windows-jdk9] // stage
[Pipeline] [windows-jdk9] }
[Pipeline] [windows-jdk9] // node
[Pipeline] [windows-jdk9] }
[Pipeline] // parallel
[Pipeline] stage
[Pipeline] { (Notifications)
[Pipeline] echo
Build result: FAILURE
[Pipeline] jiraIssueSelector
[Pipeline] emailext
Reply | Threaded
Open this post in threaded view
|

Build failed in Jenkins: Maven TLP » maven-wagon » WAGON-528 #4

Apache Jenkins Server-2
See https://builds.apache.org/job/maven-box/job/maven-wagon/job/WAGON-528/4/

No changes.

55 tests failed.
FAILED:  org.apache.maven.wagon.providers.scm.ScmSvnExeWagonTest.testWagonPutDirectory

Error Message:
Error checking out: command failed: svn: E170013: Unable to connect to a repository at URL 'file://2/m/wagon-providers/wagon-scm/target/test-classes/test-repo-svn-test'
svn: E170000: Local URL 'file://2/m/wagon-providers/wagon-scm/target/test-classes/test-repo-svn-test' contains unsupported hostname

Stack Trace:
org.apache.maven.wagon.TransferFailedException:
Error checking out: command failed: svn: E170013: Unable to connect to a repository at URL 'file://2/m/wagon-providers/wagon-scm/target/test-classes/test-repo-svn-test'
svn: E170000: Local URL 'file://2/m/wagon-providers/wagon-scm/target/test-classes/test-repo-svn-test' contains unsupported hostname
Caused by: org.apache.maven.scm.ScmException:
command failed: svn: E170013: Unable to connect to a repository at URL 'file://2/m/wagon-providers/wagon-scm/target/test-classes/test-repo-svn-test'
svn: E170000: Local URL 'file://2/m/wagon-providers/wagon-scm/target/test-classes/test-repo-svn-test' contains unsupported hostname


FAILED:  org.apache.maven.wagon.providers.scm.ScmSvnExeWagonTest.testWagonPutDirectoryDeepDestination

Error Message:
Error checking out: command failed: svn: E170013: Unable to connect to a repository at URL 'file://2/m/wagon-providers/wagon-scm/target/test-classes/test-repo-svn-test'
svn: E170000: Local URL 'file://2/m/wagon-providers/wagon-scm/target/test-classes/test-repo-svn-test' contains unsupported hostname

Stack Trace:
org.apache.maven.wagon.TransferFailedException:
Error checking out: command failed: svn: E170013: Unable to connect to a repository at URL 'file://2/m/wagon-providers/wagon-scm/target/test-classes/test-repo-svn-test'
svn: E170000: Local URL 'file://2/m/wagon-providers/wagon-scm/target/test-classes/test-repo-svn-test' contains unsupported hostname
Caused by: org.apache.maven.scm.ScmException:
command failed: svn: E170013: Unable to connect to a repository at URL 'file://2/m/wagon-providers/wagon-scm/target/test-classes/test-repo-svn-test'
svn: E170000: Local URL 'file://2/m/wagon-providers/wagon-scm/target/test-classes/test-repo-svn-test' contains unsupported hostname


FAILED:  org.apache.maven.wagon.providers.scm.ScmSvnExeWagonTest.testWagon

Error Message:

  Unexpected method call TransferListener.transferError(TransferEvent[GET|ERROR|Repository[scm:svn:file://2/m/wagon-providers/wagon-scm/target/test-classes/test-repo-svn-test]|null|test-resource[len = 18; mod = 1536860631990]]):
    TransferListener.transferCompleted(TransferEvent[PUT|COMPLETED|Repository[scm:svn:file://2/m/wagon-providers/wagon-scm/target/test-classes/test-repo-svn-test]|/home/jenkins/jenkins-slave/workspace/n-box_maven-wagon_WAGON-528-IMNZXLSWVKGSMF6UG52A7YYKAK332OKWF6U6U6HZJQ3V6WNV7M2A@2/m/wagon-providers/wagon-scm/target/test-output/test-resource|test-resource[len = 18; mod = 1536860631990]]): expected: 1, actual: 0

Stack Trace:
java.lang.AssertionError:

  Unexpected method call TransferListener.transferError(TransferEvent[GET|ERROR|Repository[scm:svn:file://2/m/wagon-providers/wagon-scm/target/test-classes/test-repo-svn-test]|null|test-resource[len = 18; mod = 1536860631990]]):
    TransferListener.transferCompleted(TransferEvent[PUT|COMPLETED|Repository[scm:svn:file://2/m/wagon-providers/wagon-scm/target/test-classes/test-repo-svn-test]|/home/jenkins/jenkins-slave/workspace/n-box_maven-wagon_WAGON-528-IMNZXLSWVKGSMF6UG52A7YYKAK332OKWF6U6U6HZJQ3V6WNV7M2A@2/m/wagon-providers/wagon-scm/target/test-output/test-resource|test-resource[len = 18; mod = 1536860631990]]): expected: 1, actual: 0


FAILED:  org.apache.maven.wagon.providers.scm.ScmSvnExeWagonTest.testWagonPutDirectoryForDot

Error Message:
Error checking out: command failed: svn: E170013: Unable to connect to a repository at URL 'file://2/m/wagon-providers/wagon-scm/target/test-classes/test-repo-svn-test'
svn: E170000: Local URL 'file://2/m/wagon-providers/wagon-scm/target/test-classes/test-repo-svn-test' contains unsupported hostname

Stack Trace:
org.apache.maven.wagon.TransferFailedException:
Error checking out: command failed: svn: E170013: Unable to connect to a repository at URL 'file://2/m/wagon-providers/wagon-scm/target/test-classes/test-repo-svn-test'
svn: E170000: Local URL 'file://2/m/wagon-providers/wagon-scm/target/test-classes/test-repo-svn-test' contains unsupported hostname
Caused by: org.apache.maven.scm.ScmException:
command failed: svn: E170013: Unable to connect to a repository at URL 'file://2/m/wagon-providers/wagon-scm/target/test-classes/test-repo-svn-test'
svn: E170000: Local URL 'file://2/m/wagon-providers/wagon-scm/target/test-classes/test-repo-svn-test' contains unsupported hostname


FAILED:  org.apache.maven.wagon.providers.scm.ScmSvnExeWagonTest.testWagonGetFileList

Error Message:

  Unexpected method call TransferListener.transferError(TransferEvent[GET|ERROR|Repository[scm:svn:file://2/m/wagon-providers/wagon-scm/target/test-classes/test-repo-svn-test]|null|file-list/test-resource.txt[len = 18; mod = 1536860632142]]):
    TransferListener.transferCompleted(TransferEvent[PUT|COMPLETED|Repository[scm:svn:file://2/m/wagon-providers/wagon-scm/target/test-classes/test-repo-svn-test]|/home/jenkins/jenkins-slave/workspace/n-box_maven-wagon_WAGON-528-IMNZXLSWVKGSMF6UG52A7YYKAK332OKWF6U6U6HZJQ3V6WNV7M2A@2/m/wagon-providers/wagon-scm/target/test-output/file-list/test-resource.txt|file-list/test-resource.txt[len = 18; mod = 1536860632142]]): expected: 1, actual: 0

Stack Trace:
java.lang.AssertionError:

  Unexpected method call TransferListener.transferError(TransferEvent[GET|ERROR|Repository[scm:svn:file://2/m/wagon-providers/wagon-scm/target/test-classes/test-repo-svn-test]|null|file-list/test-resource.txt[len = 18; mod = 1536860632142]]):
    TransferListener.transferCompleted(TransferEvent[PUT|COMPLETED|Repository[scm:svn:file://2/m/wagon-providers/wagon-scm/target/test-classes/test-repo-svn-test]|/home/jenkins/jenkins-slave/workspace/n-box_maven-wagon_WAGON-528-IMNZXLSWVKGSMF6UG52A7YYKAK332OKWF6U6U6HZJQ3V6WNV7M2A@2/m/wagon-providers/wagon-scm/target/test-output/file-list/test-resource.txt|file-list/test-resource.txt[len = 18; mod = 1536860632142]]): expected: 1, actual: 0


FAILED:  org.apache.maven.wagon.providers.scm.ScmSvnExeWagonTest.testFailedGet

Error Message:
Error getting file from SCM

Stack Trace:
org.apache.maven.wagon.TransferFailedException: Error getting file from SCM
Caused by: org.apache.maven.scm.ScmException:
command failed: svn: E170013: Unable to connect to a repository at URL 'file://2/m/wagon-providers/wagon-scm/target/test-classes/test-repo-svn-test'
svn: E170000: Local URL 'file://2/m/wagon-providers/wagon-scm/target/test-classes/test-repo-svn-test' contains unsupported hostname


FAILED:  org.apache.maven.wagon.providers.scm.ScmSvnExeWagonTest.testWagonPutDirectoryWhenDirectoryAlreadyExists

Error Message:
Error checking out: command failed: svn: E170013: Unable to connect to a repository at URL 'file://2/m/wagon-providers/wagon-scm/target/test-classes/test-repo-svn-test'
svn: E170000: Local URL 'file://2/m/wagon-providers/wagon-scm/target/test-classes/test-repo-svn-test' contains unsupported hostname

Stack Trace:
org.apache.maven.wagon.TransferFailedException:
Error checking out: command failed: svn: E170013: Unable to connect to a repository at URL 'file://2/m/wagon-providers/wagon-scm/target/test-classes/test-repo-svn-test'
svn: E170000: Local URL 'file://2/m/wagon-providers/wagon-scm/target/test-classes/test-repo-svn-test' contains unsupported hostname
Caused by: org.apache.maven.scm.ScmException:
command failed: svn: E170013: Unable to connect to a repository at URL 'file://2/m/wagon-providers/wagon-scm/target/test-classes/test-repo-svn-test'
svn: E170000: Local URL 'file://2/m/wagon-providers/wagon-scm/target/test-classes/test-repo-svn-test' contains unsupported hostname


FAILED:  org.apache.maven.wagon.providers.scm.ScmSvnExeWagonTest.testWagonResourceExists

Error Message:

  Unexpected method call TransferListener.transferError(TransferEvent[GET|ERROR|Repository[scm:svn:file://2/m/wagon-providers/wagon-scm/target/test-classes/test-repo-svn-test]|null|test-resource[len = 18; mod = 1536860632278]]):
    TransferListener.transferCompleted(TransferEvent[PUT|COMPLETED|Repository[scm:svn:file://2/m/wagon-providers/wagon-scm/target/test-classes/test-repo-svn-test]|/home/jenkins/jenkins-slave/workspace/n-box_maven-wagon_WAGON-528-IMNZXLSWVKGSMF6UG52A7YYKAK332OKWF6U6U6HZJQ3V6WNV7M2A@2/m/wagon-providers/wagon-scm/target/test-output/test-resource|test-resource[len = 18; mod = 1536860632278]]): expected: 1, actual: 0

Stack Trace:
java.lang.AssertionError:

  Unexpected method call TransferListener.transferError(TransferEvent[GET|ERROR|Repository[scm:svn:file://2/m/wagon-providers/wagon-scm/target/test-classes/test-repo-svn-test]|null|test-resource[len = 18; mod = 1536860632278]]):
    TransferListener.transferCompleted(TransferEvent[PUT|COMPLETED|Repository[scm:svn:file://2/m/wagon-providers/wagon-scm/target/test-classes/test-repo-svn-test]|/home/jenkins/jenkins-slave/workspace/n-box_maven-wagon_WAGON-528-IMNZXLSWVKGSMF6UG52A7YYKAK332OKWF6U6U6HZJQ3V6WNV7M2A@2/m/wagon-providers/wagon-scm/target/test-output/test-resource|test-resource[len = 18; mod = 1536860632278]]): expected: 1, actual: 0


FAILED:  org.apache.maven.wagon.providers.scm.ScmSvnExeWagonTest.testWagonPutDirectory

Error Message:
Error checking out: command failed: svn: E180001: Unable to connect to a repository at URL 'file://2/m/wagon-providers/wagon-scm/target/test-classes/test-repo-svn-test'
svn: E180001: Unable to open an ra_local session to URL
svn: E180001: Unable to open repository 'file://2/m/wagon-providers/wagon-scm/target/test-classes/test-repo-svn-test'

Stack Trace:
org.apache.maven.wagon.TransferFailedException:
Error checking out: command failed: svn: E180001: Unable to connect to a repository at URL 'file://2/m/wagon-providers/wagon-scm/target/test-classes/test-repo-svn-test'
svn: E180001: Unable to open an ra_local session to URL
svn: E180001: Unable to open repository 'file://2/m/wagon-providers/wagon-scm/target/test-classes/test-repo-svn-test'
Caused by: org.apache.maven.scm.ScmException:
command failed: svn: E180001: Unable to connect to a repository at URL 'file://2/m/wagon-providers/wagon-scm/target/test-classes/test-repo-svn-test'
svn: E180001: Unable to open an ra_local session to URL
svn: E180001: Unable to open repository 'file://2/m/wagon-providers/wagon-scm/target/test-classes/test-repo-svn-test'


FAILED:  org.apache.maven.wagon.providers.scm.ScmSvnExeWagonTest.testWagonPutDirectoryDeepDestination

Error Message:
Error checking out: command failed: svn: E180001: Unable to connect to a repository at URL 'file://2/m/wagon-providers/wagon-scm/target/test-classes/test-repo-svn-test'
svn: E180001: Unable to open an ra_local session to URL
svn: E180001: Unable to open repository 'file://2/m/wagon-providers/wagon-scm/target/test-classes/test-repo-svn-test'

Stack Trace:
org.apache.maven.wagon.TransferFailedException:
Error checking out: command failed: svn: E180001: Unable to connect to a repository at URL 'file://2/m/wagon-providers/wagon-scm/target/test-classes/test-repo-svn-test'
svn: E180001: Unable to open an ra_local session to URL
svn: E180001: Unable to open repository 'file://2/m/wagon-providers/wagon-scm/target/test-classes/test-repo-svn-test'
Caused by: org.apache.maven.scm.ScmException:
command failed: svn: E180001: Unable to connect to a repository at URL 'file://2/m/wagon-providers/wagon-scm/target/test-classes/test-repo-svn-test'
svn: E180001: Unable to open an ra_local session to URL
svn: E180001: Unable to open repository 'file://2/m/wagon-providers/wagon-scm/target/test-classes/test-repo-svn-test'


FAILED:  org.apache.maven.wagon.providers.scm.ScmSvnExeWagonTest.testWagon

Error Message:

  Unexpected method call TransferListener.transferError(TransferEvent[GET|ERROR|Repository[scm:svn:file://2/m/wagon-providers/wagon-scm/target/test-classes/test-repo-svn-test]|null|test-resource[len = 18; mod = 1536860737460]]):
    TransferListener.transferCompleted(TransferEvent[PUT|COMPLETED|Repository[scm:svn:file://2/m/wagon-providers/wagon-scm/target/test-classes/test-repo-svn-test]|F:\jenkins\jenkins-slave\workspace\n-box_maven-wagon_WAGON-528-IMNZXLSWVKGSMF6UG52A7YYKAK332OKWF6U6U6HZJQ3V6WNV7M2A@2\m\wagon-providers\wagon-scm\target\test-output\test-resource|test-resource[len = 18; mod = 1536860737460]]): expected: 1, actual: 0

Stack Trace:
java.lang.AssertionError:

  Unexpected method call TransferListener.transferError(TransferEvent[GET|ERROR|Repository[scm:svn:file://2/m/wagon-providers/wagon-scm/target/test-classes/test-repo-svn-test]|null|test-resource[len = 18; mod = 1536860737460]]):
    TransferListener.transferCompleted(TransferEvent[PUT|COMPLETED|Repository[scm:svn:file://2/m/wagon-providers/wagon-scm/target/test-classes/test-repo-svn-test]|F:\jenkins\jenkins-slave\workspace\n-box_maven-wagon_WAGON-528-IMNZXLSWVKGSMF6UG52A7YYKAK332OKWF6U6U6HZJQ3V6WNV7M2A@2\m\wagon-providers\wagon-scm\target\test-output\test-resource|test-resource[len = 18; mod = 1536860737460]]): expected: 1, actual: 0


FAILED:  org.apache.maven.wagon.providers.scm.ScmSvnExeWagonTest.testWagonPutDirectoryForDot

Error Message:
Error checking out: command failed: svn: E180001: Unable to connect to a repository at URL 'file://2/m/wagon-providers/wagon-scm/target/test-classes/test-repo-svn-test'
svn: E180001: Unable to open an ra_local session to URL
svn: E180001: Unable to open repository 'file://2/m/wagon-providers/wagon-scm/target/test-classes/test-repo-svn-test'

Stack Trace:
org.apache.maven.wagon.TransferFailedException:
Error checking out: command failed: svn: E180001: Unable to connect to a repository at URL 'file://2/m/wagon-providers/wagon-scm/target/test-classes/test-repo-svn-test'
svn: E180001: Unable to open an ra_local session to URL
svn: E180001: Unable to open repository 'file://2/m/wagon-providers/wagon-scm/target/test-classes/test-repo-svn-test'
Caused by: org.apache.maven.scm.ScmException:
command failed: svn: E180001: Unable to connect to a repository at URL 'file://2/m/wagon-providers/wagon-scm/target/test-classes/test-repo-svn-test'
svn: E180001: Unable to open an ra_local session to URL
svn: E180001: Unable to open repository 'file://2/m/wagon-providers/wagon-scm/target/test-classes/test-repo-svn-test'


FAILED:  org.apache.maven.wagon.providers.scm.ScmSvnExeWagonTest.testWagonGetFileList

Error Message:

  Unexpected method call TransferListener.transferError(TransferEvent[GET|ERROR|Repository[scm:svn:file://2/m/wagon-providers/wagon-scm/target/test-classes/test-repo-svn-test]|null|file-list/test-resource.txt[len = 18; mod = 1536860738394]]):
    TransferListener.transferCompleted(TransferEvent[PUT|COMPLETED|Repository[scm:svn:file://2/m/wagon-providers/wagon-scm/target/test-classes/test-repo-svn-test]|F:\jenkins\jenkins-slave\workspace\n-box_maven-wagon_WAGON-528-IMNZXLSWVKGSMF6UG52A7YYKAK332OKWF6U6U6HZJQ3V6WNV7M2A@2\m\wagon-providers\wagon-scm\target\test-output\file-list\test-resource.txt|file-list/test-resource.txt[len = 18; mod = 1536860738394]]): expected: 1, actual: 0

Stack Trace:
java.lang.AssertionError:

  Unexpected method call TransferListener.transferError(TransferEvent[GET|ERROR|Repository[scm:svn:file://2/m/wagon-providers/wagon-scm/target/test-classes/test-repo-svn-test]|null|file-list/test-resource.txt[len = 18; mod = 1536860738394]]):
    TransferListener.transferCompleted(TransferEvent[PUT|COMPLETED|Repository[scm:svn:file://2/m/wagon-providers/wagon-scm/target/test-classes/test-repo-svn-test]|F:\jenkins\jenkins-slave\workspace\n-box_maven-wagon_WAGON-528-IMNZXLSWVKGSMF6UG52A7YYKAK332OKWF6U6U6HZJQ3V6WNV7M2A@2\m\wagon-providers\wagon-scm\target\test-output\file-list\test-resource.txt|file-list/test-resource.txt[len = 18; mod = 1536860738394]]): expected: 1, actual: 0


FAILED:  org.apache.maven.wagon.providers.scm.ScmSvnExeWagonTest.testFailedGet

Error Message:
Error getting file from SCM

Stack Trace:
org.apache.maven.wagon.TransferFailedException: Error getting file from SCM
Caused by: org.apache.maven.scm.ScmException:
command failed: svn: E180001: Unable to connect to a repository at URL 'file://2/m/wagon-providers/wagon-scm/target/test-classes/test-repo-svn-test'
svn: E180001: Unable to open an ra_local session to URL
svn: E180001: Unable to open repository 'file://2/m/wagon-providers/wagon-scm/target/test-classes/test-repo-svn-test'


FAILED:  org.apache.maven.wagon.providers.scm.ScmSvnExeWagonTest.testWagonPutDirectoryWhenDirectoryAlreadyExists

Error Message:
Error checking out: command failed: svn: E180001: Unable to connect to a repository at URL 'file://2/m/wagon-providers/wagon-scm/target/test-classes/test-repo-svn-test'
svn: E180001: Unable to open an ra_local session to URL
svn: E180001: Unable to open repository 'file://2/m/wagon-providers/wagon-scm/target/test-classes/test-repo-svn-test'

Stack Trace:
org.apache.maven.wagon.TransferFailedException:
Error checking out: command failed: svn: E180001: Unable to connect to a repository at URL 'file://2/m/wagon-providers/wagon-scm/target/test-classes/test-repo-svn-test'
svn: E180001: Unable to open an ra_local session to URL
svn: E180001: Unable to open repository 'file://2/m/wagon-providers/wagon-scm/target/test-classes/test-repo-svn-test'
Caused by: org.apache.maven.scm.ScmException:
command failed: svn: E180001: Unable to connect to a repository at URL 'file://2/m/wagon-providers/wagon-scm/target/test-classes/test-repo-svn-test'
svn: E180001: Unable to open an ra_local session to URL
svn: E180001: Unable to open repository 'file://2/m/wagon-providers/wagon-scm/target/test-classes/test-repo-svn-test'


FAILED:  org.apache.maven.wagon.providers.scm.ScmSvnExeWagonTest.testWagonResourceExists

Error Message:

  Unexpected method call TransferListener.transferError(TransferEvent[GET|ERROR|Repository[scm:svn:file://2/m/wagon-providers/wagon-scm/target/test-classes/test-repo-svn-test]|null|test-resource[len = 18; mod = 1536860739373]]):
    TransferListener.transferCompleted(TransferEvent[PUT|COMPLETED|Repository[scm:svn:file://2/m/wagon-providers/wagon-scm/target/test-classes/test-repo-svn-test]|F:\jenkins\jenkins-slave\workspace\n-box_maven-wagon_WAGON-528-IMNZXLSWVKGSMF6UG52A7YYKAK332OKWF6U6U6HZJQ3V6WNV7M2A@2\m\wagon-providers\wagon-scm\target\test-output\test-resource|test-resource[len = 18; mod = 1536860739373]]): expected: 1, actual: 0

Stack Trace:
java.lang.AssertionError:

  Unexpected method call TransferListener.transferError(TransferEvent[GET|ERROR|Repository[scm:svn:file://2/m/wagon-providers/wagon-scm/target/test-classes/test-repo-svn-test]|null|test-resource[len = 18; mod = 1536860739373]]):
    TransferListener.transferCompleted(TransferEvent[PUT|COMPLETED|Repository[scm:svn:file://2/m/wagon-providers/wagon-scm/target/test-classes/test-repo-svn-test]|F:\jenkins\jenkins-slave\workspace\n-box_maven-wagon_WAGON-528-IMNZXLSWVKGSMF6UG52A7YYKAK332OKWF6U6U6HZJQ3V6WNV7M2A@2\m\wagon-providers\wagon-scm\target\test-output\test-resource|test-resource[len = 18; mod = 1536860739373]]): expected: 1, actual: 0


FAILED:  org.apache.maven.wagon.providers.scm.ScmGitExeWagonTest.testFailedGet

Error Message:
Error getting file from SCM

Stack Trace:
org.apache.maven.wagon.TransferFailedException: Error getting file from SCM
Caused by: org.apache.maven.scm.ScmException:
command failed: Cloning into '/home/jenkins/jenkins-slave/workspace/n-box_maven-wagon_WAGON-528-IMNZXLSWVKGSMF6UG52A7YYKAK332OKWF6U6U6HZJQ3V6WNV7M2A@2/m/wagon-providers/wagon-scm/target/test-output/checkout-org.apache.maven.scm.provider.git.gitexe.GitExeScmProvider'...
fatal: '/m/wagon-providers/wagon-scm/target/test-classes/test-repo-git-test/' does not appear to be a git repository
fatal: Could not read from remote repository.

Please make sure you have the correct access rights
and the repository exists.


FAILED:  org.apache.maven.wagon.providers.scm.ScmGitExeWagonTest.testFailedGet

Error Message:
Error getting file from SCM

Stack Trace:
org.apache.maven.wagon.TransferFailedException: Error getting file from SCM
Caused by: org.apache.maven.scm.ScmException:
command failed: Cloning into 'F:********@2\m\wagon-providers\wagon-scm\target\test-output\checkout-org.apache.maven.scm.provider.git.gitexe.GitExeScmProvider'...
fatal: '//2/m/wagon-providers/wagon-scm/target/test-classes/test-repo-git-test/' does not appear to be a git repository
fatal: Could not read from remote repository.

Please make sure you have the correct access rights
and the repository exists.


FAILED:  org.apache.maven.wagon.providers.scm.ScmGitExeWagonTest.testFailedGet

Error Message:
Error getting file from SCM

Stack Trace:
org.apache.maven.wagon.TransferFailedException: Error getting file from SCM
Caused by: org.apache.maven.scm.ScmException:
command failed: Cloning into 'F:\jenkins\jenkins-slave\workspace\n-box_maven-wagon_WAGON-528-IMNZXLSWVKGSMF6UG52A7YYKAK332OKWF6U6U6HZJQ3V6WNV7M2A\m\wagon-providers\wagon-scm\target\test-output\checkout-org.apache.maven.scm.provider.git.gitexe.GitExeScmProvider'...
fatal: '$GIT_DIR' too big
fatal: index-pack failed


FAILED:  org.apache.maven.wagon.providers.scm.ScmGitExeWagonTest.testFailedGet

Error Message:
Error getting file from SCM

Stack Trace:
org.apache.maven.wagon.TransferFailedException: Error getting file from SCM
Caused by: org.apache.maven.scm.ScmException:
command failed: Cloning into 'F:\jenkins\jenkins-slave\workspace\n-box_maven-wagon_WAGON-528-IMNZXLSWVKGSMF6UG52A7YYKAK332OKWF6U6U6HZJQ3V6WNV7M2A\m\wagon-providers\wagon-scm\target\test-output\checkout-org.apache.maven.scm.provider.git.gitexe.GitExeScmProvider'...
fatal: '$GIT_DIR' too big
fatal: index-pack failed


FAILED:  org.apache.maven.wagon.providers.scm.ScmGitExeWagonTest.testWagonPutDirectory

Error Message:
Error interacting with SCM: Unable to commit file. The git-commit command failed.
*** Please tell me who you are.

Run

  git config --global user.email "[hidden email]"
  git config --global user.name "Your Name"

to set your account's default identity.
Omit --global to set the identity only in this repository.

fatal:********@asf929.gq1.ygridcore.net>) not allowed


Stack Trace:
org.apache.maven.wagon.TransferFailedException:
Error interacting with SCM: Unable to commit file. The git-commit command failed.
*** Please tell me who you are.

Run

  git config --global user.email "[hidden email]"
  git config --global user.name "Your Name"

to set your account's default identity.
Omit --global to set the identity only in this repository.

fatal:********@asf929.gq1.ygridcore.net>) not allowed

Caused by: org.apache.maven.scm.ScmException:
Unable to commit file. The git-commit command failed.
*** Please tell me who you are.

Run

  git config --global user.email "[hidden email]"
  git config --global user.name "Your Name"

to set your account's default identity.
Omit --global to set the identity only in this repository.

fatal:********@asf929.gq1.ygridcore.net>) not allowed



FAILED:  org.apache.maven.wagon.providers.scm.ScmGitExeWagonTest.testWagonPutDirectoryDeepDestination

Error Message:
Error interacting with SCM: Unable to commit file. The git-commit command failed.
*** Please tell me who you are.

Run

  git config --global user.email "[hidden email]"
  git config --global user.name "Your Name"

to set your account's default identity.
Omit --global to set the identity only in this repository.

fatal:********@asf929.gq1.ygridcore.net>) not allowed


Stack Trace:
org.apache.maven.wagon.TransferFailedException:
Error interacting with SCM: Unable to commit file. The git-commit command failed.
*** Please tell me who you are.

Run

  git config --global user.email "[hidden email]"
  git config --global user.name "Your Name"

to set your account's default identity.
Omit --global to set the identity only in this repository.

fatal:********@asf929.gq1.ygridcore.net>) not allowed

Caused by: org.apache.maven.scm.ScmException:
Unable to commit file. The git-commit command failed.
*** Please tell me who you are.

Run

  git config --global user.email "[hidden email]"
  git config --global user.name "Your Name"

to set your account's default identity.
Omit --global to set the identity only in this repository.

fatal:********@asf929.gq1.ygridcore.net>) not allowed



FAILED:  org.apache.maven.wagon.providers.scm.ScmGitExeWagonTest.testWagon

Error Message:

  Unexpected method call TransferListener.transferError(TransferEvent[PUT|ERROR|Repository[scm:git:file:///home/jenkins/jenkins-slave/workspace/n-box_maven-wagon_WAGON-528-IMNZXLSWVKGSMF6UG52A7YYKAK332OKWF6U6U6HZJQ3V6WNV7M2A/m/wagon-providers/wagon-scm/target/test-classes/test-repo-git-test/]|null|test-resource[len = 18; mod = 1536860567000]]):
    TransferListener.transferCompleted(TransferEvent[PUT|COMPLETED|Repository[scm:git:file:///home/jenkins/jenkins-slave/workspace/n-box_maven-wagon_WAGON-528-IMNZXLSWVKGSMF6UG52A7YYKAK332OKWF6U6U6HZJQ3V6WNV7M2A/m/wagon-providers/wagon-scm/target/test-classes/test-repo-git-test/]|/home/jenkins/jenkins-slave/workspace/n-box_maven-wagon_WAGON-528-IMNZXLSWVKGSMF6UG52A7YYKAK332OKWF6U6U6HZJQ3V6WNV7M2A/m/wagon-providers/wagon-scm/target/test-output/test-resource|test-resource[len = 18; mod = 1536860567000]]): expected: 1, actual: 0

Stack Trace:
java.lang.AssertionError:

  Unexpected method call TransferListener.transferError(TransferEvent[PUT|ERROR|Repository[scm:git:file:///home/jenkins/jenkins-slave/workspace/n-box_maven-wagon_WAGON-528-IMNZXLSWVKGSMF6UG52A7YYKAK332OKWF6U6U6HZJQ3V6WNV7M2A/m/wagon-providers/wagon-scm/target/test-classes/test-repo-git-test/]|null|test-resource[len = 18; mod = 1536860567000]]):
    TransferListener.transferCompleted(TransferEvent[PUT|COMPLETED|Repository[scm:git:file:///home/jenkins/jenkins-slave/workspace/n-box_maven-wagon_WAGON-528-IMNZXLSWVKGSMF6UG52A7YYKAK332OKWF6U6U6HZJQ3V6WNV7M2A/m/wagon-providers/wagon-scm/target/test-classes/test-repo-git-test/]|/home/jenkins/jenkins-slave/workspace/n-box_maven-wagon_WAGON-528-IMNZXLSWVKGSMF6UG52A7YYKAK332OKWF6U6U6HZJQ3V6WNV7M2A/m/wagon-providers/wagon-scm/target/test-output/test-resource|test-resource[len = 18; mod = 1536860567000]]): expected: 1, actual: 0


FAILED:  org.apache.maven.wagon.providers.scm.ScmGitExeWagonTest.testWagonPutDirectoryForDot

Error Message:
Error interacting with SCM: Unable to commit file. The git-commit command failed.
*** Please tell me who you are.

Run

  git config --global user.email "[hidden email]"
  git config --global user.name "Your Name"

to set your account's default identity.
Omit --global to set the identity only in this repository.

fatal:********@asf929.gq1.ygridcore.net>) not allowed


Stack Trace:
org.apache.maven.wagon.TransferFailedException:
Error interacting with SCM: Unable to commit file. The git-commit command failed.
*** Please tell me who you are.

Run

  git config --global user.email "[hidden email]"
  git config --global user.name "Your Name"

to set your account's default identity.
Omit --global to set the identity only in this repository.

fatal:********@asf929.gq1.ygridcore.net>) not allowed

Caused by: org.apache.maven.scm.ScmException:
Unable to commit file. The git-commit command failed.
*** Please tell me who you are.

Run

  git config --global user.email "[hidden email]"
  git config --global user.name "Your Name"

to set your account's default identity.
Omit --global to set the identity only in this repository.

fatal:********@asf929.gq1.ygridcore.net>) not allowed



FAILED:  org.apache.maven.wagon.providers.scm.ScmGitExeWagonTest.testWagonPutDirectoryWhenDirectoryAlreadyExists

Error Message:
Error interacting with SCM: Unable to commit file. The git-commit command failed.
*** Please tell me who you are.

Run

  git config --global user.email "[hidden email]"
  git config --global user.name "Your Name"

to set your account's default identity.
Omit --global to set the identity only in this repository.

fatal:********@asf929.gq1.ygridcore.net>) not allowed


Stack Trace:
org.apache.maven.wagon.TransferFailedException:
Error interacting with SCM: Unable to commit file. The git-commit command failed.
*** Please tell me who you are.

Run

  git config --global user.email "[hidden email]"
  git config --global user.name "Your Name"

to set your account's default identity.
Omit --global to set the identity only in this repository.

fatal:********@asf929.gq1.ygridcore.net>) not allowed

Caused by: org.apache.maven.scm.ScmException:
Unable to commit file. The git-commit command failed.
*** Please tell me who you are.

Run

  git config --global user.email "[hidden email]"
  git config --global user.name "Your Name"

to set your account's default identity.
Omit --global to set the identity only in this repository.

fatal:********@asf929.gq1.ygridcore.net>) not allowed



FAILED:  org.apache.maven.wagon.providers.scm.ScmGitExeWagonTest.testWagonPutDirectory

Error Message:
Error interacting with SCM: Unable to commit file. The git-commit command failed.
*** Please tell me who you are.

Run

  git config --global user.email "[hidden email]"
  git config --global user.name "Your Name"

to set your account's default identity.
Omit --global to set the identity only in this repository.

fatal:********@asf933.gq1.ygridcore.net>) not allowed


Stack Trace:
org.apache.maven.wagon.TransferFailedException:
Error interacting with SCM: Unable to commit file. The git-commit command failed.
*** Please tell me who you are.

Run

  git config --global user.email "[hidden email]"
  git config --global user.name "Your Name"

to set your account's default identity.
Omit --global to set the identity only in this repository.

fatal:********@asf933.gq1.ygridcore.net>) not allowed

Caused by: org.apache.maven.scm.ScmException:
Unable to commit file. The git-commit command failed.
*** Please tell me who you are.

Run

  git config --global user.email "[hidden email]"
  git config --global user.name "Your Name"

to set your account's default identity.
Omit --global to set the identity only in this repository.

fatal:********@asf933.gq1.ygridcore.net>) not allowed



FAILED:  org.apache.maven.wagon.providers.scm.ScmGitExeWagonTest.testWagonPutDirectoryDeepDestination

Error Message:
Error interacting with SCM: Unable to commit file. The git-commit command failed.
*** Please tell me who you are.

Run

  git config --global user.email "[hidden email]"
  git config --global user.name "Your Name"

to set your account's default identity.
Omit --global to set the identity only in this repository.

fatal:********@asf933.gq1.ygridcore.net>) not allowed


Stack Trace:
org.apache.maven.wagon.TransferFailedException:
Error interacting with SCM: Unable to commit file. The git-commit command failed.
*** Please tell me who you are.

Run

  git config --global user.email "[hidden email]"
  git config --global user.name "Your Name"

to set your account's default identity.
Omit --global to set the identity only in this repository.

fatal:********@asf933.gq1.ygridcore.net>) not allowed

Caused by: org.apache.maven.scm.ScmException:
Unable to commit file. The git-commit command failed.
*** Please tell me who you are.

Run

  git config --global user.email "[hidden email]"
  git config --global user.name "Your Name"

to set your account's default identity.
Omit --global to set the identity only in this repository.

fatal:********@asf933.gq1.ygridcore.net>) not allowed



FAILED:  org.apache.maven.wagon.providers.scm.ScmGitExeWagonTest.testWagon

Error Message:

  Unexpected method call TransferListener.transferError(TransferEvent[PUT|ERROR|Repository[scm:git:file:///home/jenkins/jenkins-slave/workspace/n-box_maven-wagon_WAGON-528-IMNZXLSWVKGSMF6UG52A7YYKAK332OKWF6U6U6HZJQ3V6WNV7M2A/m/wagon-providers/wagon-scm/target/test-classes/test-repo-git-test/]|null|test-resource[len = 18; mod = 1536860608000]]):
    TransferListener.transferCompleted(TransferEvent[PUT|COMPLETED|Repository[scm:git:file:///home/jenkins/jenkins-slave/workspace/n-box_maven-wagon_WAGON-528-IMNZXLSWVKGSMF6UG52A7YYKAK332OKWF6U6U6HZJQ3V6WNV7M2A/m/wagon-providers/wagon-scm/target/test-classes/test-repo-git-test/]|/home/jenkins/jenkins-slave/workspace/n-box_maven-wagon_WAGON-528-IMNZXLSWVKGSMF6UG52A7YYKAK332OKWF6U6U6HZJQ3V6WNV7M2A/m/wagon-providers/wagon-scm/target/test-output/test-resource|test-resource[len = 18; mod = 1536860608000]]): expected: 1, actual: 0

Stack Trace:
java.lang.AssertionError:

  Unexpected method call TransferListener.transferError(TransferEvent[PUT|ERROR|Repository[scm:git:file:///home/jenkins/jenkins-slave/workspace/n-box_maven-wagon_WAGON-528-IMNZXLSWVKGSMF6UG52A7YYKAK332OKWF6U6U6HZJQ3V6WNV7M2A/m/wagon-providers/wagon-scm/target/test-classes/test-repo-git-test/]|null|test-resource[len = 18; mod = 1536860608000]]):
    TransferListener.transferCompleted(TransferEvent[PUT|COMPLETED|Repository[scm:git:file:///home/jenkins/jenkins-slave/workspace/n-box_maven-wagon_WAGON-528-IMNZXLSWVKGSMF6UG52A7YYKAK332OKWF6U6U6HZJQ3V6WNV7M2A/m/wagon-providers/wagon-scm/target/test-classes/test-repo-git-test/]|/home/jenkins/jenkins-slave/workspace/n-box_maven-wagon_WAGON-528-IMNZXLSWVKGSMF6UG52A7YYKAK332OKWF6U6U6HZJQ3V6WNV7M2A/m/wagon-providers/wagon-scm/target/test-output/test-resource|test-resource[len = 18; mod = 1536860608000]]): expected: 1, actual: 0


FAILED:  org.apache.maven.wagon.providers.scm.ScmGitExeWagonTest.testWagonPutDirectoryForDot

Error Message:
Error interacting with SCM: Unable to commit file. The git-commit command failed.
*** Please tell me who you are.

Run

  git config --global user.email "[hidden email]"
  git config --global user.name "Your Name"

to set your account's default identity.
Omit --global to set the identity only in this repository.

fatal:********@asf933.gq1.ygridcore.net>) not allowed


Stack Trace:
org.apache.maven.wagon.TransferFailedException:
Error interacting with SCM: Unable to commit file. The git-commit command failed.
*** Please tell me who you are.

Run

  git config --global user.email "[hidden email]"
  git config --global user.name "Your Name"

to set your account's default identity.
Omit --global to set the identity only in this repository.

fatal:********@asf933.gq1.ygridcore.net>) not allowed

Caused by: org.apache.maven.scm.ScmException:
Unable to commit file. The git-commit command failed.
*** Please tell me who you are.

Run

  git config --global user.email "[hidden email]"
  git config --global user.name "Your Name"

to set your account's default identity.
Omit --global to set the identity only in this repository.

fatal:********@asf933.gq1.ygridcore.net>) not allowed



FAILED:  org.apache.maven.wagon.providers.scm.ScmGitExeWagonTest.testWagonPutDirectoryWhenDirectoryAlreadyExists

Error Message:
Error interacting with SCM: Unable to commit file. The git-commit command failed.
*** Please tell me who you are.

Run

  git config --global user.email "[hidden email]"
  git config --global user.name "Your Name"

to set your account's default identity.
Omit --global to set the identity only in this repository.

fatal:********@asf933.gq1.ygridcore.net>) not allowed


Stack Trace:
org.apache.maven.wagon.TransferFailedException:
Error interacting with SCM: Unable to commit file. The git-commit command failed.
*** Please tell me who you are.

Run

  git config --global user.email "[hidden email]"
  git config --global user.name "Your Name"

to set your account's default identity.
Omit --global to set the identity only in this repository.

fatal:********@asf933.gq1.ygridcore.net>) not allowed

Caused by: org.apache.maven.scm.ScmException:
Unable to commit file. The git-commit command failed.
*** Please tell me who you are.

Run

  git config --global user.email "[hidden email]"
  git config --global user.name "Your Name"

to set your account's default identity.
Omit --global to set the identity only in this repository.

fatal:********@asf933.gq1.ygridcore.net>) not allowed



FAILED:  org.apache.maven.wagon.providers.scm.ScmGitExeWagonTest.testWagonPutDirectory

Error Message:
Error interacting with SCM: Unable to commit file. The git-commit command failed.
*** Please tell me who you are.

Run

  git config --global user.email "[hidden email]"
  git config --global user.name "Your Name"

to set your account's default identity.
Omit --global to set the identity only in this repository.

fatal:********@asf935.gq1.ygridcore.net>) not allowed


Stack Trace:
org.apache.maven.wagon.TransferFailedException:
Error interacting with SCM: Unable to commit file. The git-commit command failed.
*** Please tell me who you are.

Run

  git config --global user.email "[hidden email]"
  git config --global user.name "Your Name"

to set your account's default identity.
Omit --global to set the identity only in this repository.

fatal:********@asf935.gq1.ygridcore.net>) not allowed

Caused by: org.apache.maven.scm.ScmException:
Unable to commit file. The git-commit command failed.
*** Please tell me who you are.

Run

  git config --global user.email "[hidden email]"
  git config --global user.name "Your Name"

to set your account's default identity.
Omit --global to set the identity only in this repository.

fatal:********@asf935.gq1.ygridcore.net>) not allowed



FAILED:  org.apache.maven.wagon.providers.scm.ScmGitExeWagonTest.testWagonPutDirectoryDeepDestination

Error Message:
Error interacting with SCM: Unable to commit file. The git-commit command failed.
*** Please tell me who you are.

Run

  git config --global user.email "[hidden email]"
  git config --global user.name "Your Name"

to set your account's default identity.
Omit --global to set the identity only in this repository.

fatal:********@asf935.gq1.ygridcore.net>) not allowed


Stack Trace:
org.apache.maven.wagon.TransferFailedException:
Error interacting with SCM: Unable to commit file. The git-commit command failed.
*** Please tell me who you are.

Run

  git config --global user.email "[hidden email]"
  git config --global user.name "Your Name"

to set your account's default identity.
Omit --global to set the identity only in this repository.

fatal:********@asf935.gq1.ygridcore.net>) not allowed

Caused by: org.apache.maven.scm.ScmException:
Unable to commit file. The git-commit command failed.
*** Please tell me who you are.

Run

  git config --global user.email "[hidden email]"
  git config --global user.name "Your Name"

to set your account's default identity.
Omit --global to set the identity only in this repository.

fatal:********@asf935.gq1.ygridcore.net>) not allowed



FAILED:  org.apache.maven.wagon.providers.scm.ScmGitExeWagonTest.testWagon

Error Message:

  Unexpected method call TransferListener.transferError(TransferEvent[PUT|ERROR|Repository[scm:git:file:///home/jenkins/jenkins-slave/workspace/n-box_maven-wagon_WAGON-528-IMNZXLSWVKGSMF6UG52A7YYKAK332OKWF6U6U6HZJQ3V6WNV7M2A/m/wagon-providers/wagon-scm/target/test-classes/test-repo-git-test/]|null|test-resource[len = 18; mod = 1536860623000]]):
    TransferListener.transferCompleted(TransferEvent[PUT|COMPLETED|Repository[scm:git:file:///home/jenkins/jenkins-slave/workspace/n-box_maven-wagon_WAGON-528-IMNZXLSWVKGSMF6UG52A7YYKAK332OKWF6U6U6HZJQ3V6WNV7M2A/m/wagon-providers/wagon-scm/target/test-classes/test-repo-git-test/]|/home/jenkins/jenkins-slave/workspace/n-box_maven-wagon_WAGON-528-IMNZXLSWVKGSMF6UG52A7YYKAK332OKWF6U6U6HZJQ3V6WNV7M2A/m/wagon-providers/wagon-scm/target/test-output/test-resource|test-resource[len = 18; mod = 1536860623000]]): expected: 1, actual: 0

Stack Trace:
java.lang.AssertionError:

  Unexpected method call TransferListener.transferError(TransferEvent[PUT|ERROR|Repository[scm:git:file:///home/jenkins/jenkins-slave/workspace/n-box_maven-wagon_WAGON-528-IMNZXLSWVKGSMF6UG52A7YYKAK332OKWF6U6U6HZJQ3V6WNV7M2A/m/wagon-providers/wagon-scm/target/test-classes/test-repo-git-test/]|null|test-resource[len = 18; mod = 1536860623000]]):
    TransferListener.transferCompleted(TransferEvent[PUT|COMPLETED|Repository[scm:git:file:///home/jenkins/jenkins-slave/workspace/n-box_maven-wagon_WAGON-528-IMNZXLSWVKGSMF6UG52A7YYKAK332OKWF6U6U6HZJQ3V6WNV7M2A/m/wagon-providers/wagon-scm/target/test-classes/test-repo-git-test/]|/home/jenkins/jenkins-slave/workspace/n-box_maven-wagon_WAGON-528-IMNZXLSWVKGSMF6UG52A7YYKAK332OKWF6U6U6HZJQ3V6WNV7M2A/m/wagon-providers/wagon-scm/target/test-output/test-resource|test-resource[len = 18; mod = 1536860623000]]): expected: 1, actual: 0


FAILED:  org.apache.maven.wagon.providers.scm.ScmGitExeWagonTest.testWagonPutDirectoryForDot

Error Message:
Error interacting with SCM: Unable to commit file. The git-commit command failed.
*** Please tell me who you are.

Run

  git config --global user.email "[hidden email]"
  git config --global user.name "Your Name"

to set your account's default identity.
Omit --global to set the identity only in this repository.

fatal:********@asf935.gq1.ygridcore.net>) not allowed


Stack Trace:
org.apache.maven.wagon.TransferFailedException:
Error interacting with SCM: Unable to commit file. The git-commit command failed.
*** Please tell me who you are.

Run

  git config --global user.email "[hidden email]"
  git config --global user.name "Your Name"

to set your account's default identity.
Omit --global to set the identity only in this repository.

fatal:********@asf935.gq1.ygridcore.net>) not allowed

Caused by: org.apache.maven.scm.ScmException:
Unable to commit file. The git-commit command failed.
*** Please tell me who you are.

Run

  git config --global user.email "[hidden email]"
  git config --global user.name "Your Name"

to set your account's default identity.
Omit --global to set the identity only in this repository.

fatal:********@asf935.gq1.ygridcore.net>) not allowed



FAILED:  org.apache.maven.wagon.providers.scm.ScmGitExeWagonTest.testWagonPutDirectoryWhenDirectoryAlreadyExists

Error Message:
Error interacting with SCM: Unable to commit file. The git-commit command failed.
*** Please tell me who you are.

Run

  git config --global user.email "[hidden email]"
  git config --global user.name "Your Name"

to set your account's default identity.
Omit --global to set the identity only in this repository.

fatal:********@asf935.gq1.ygridcore.net>) not allowed


Stack Trace:
org.apache.maven.wagon.TransferFailedException:
Error interacting with SCM: Unable to commit file. The git-commit command failed.
*** Please tell me who you are.

Run

  git config --global user.email "[hidden email]"
  git config --global user.name "Your Name"

to set your account's default identity.
Omit --global to set the identity only in this repository.

fatal:********@asf935.gq1.ygridcore.net>) not allowed

Caused by: org.apache.maven.scm.ScmException:
Unable to commit file. The git-commit command failed.
*** Please tell me who you are.

Run

  git config --global user.email "[hidden email]"
  git config --global user.name "Your Name"

to set your account's default identity.
Omit --global to set the identity only in this repository.

fatal:********@asf935.gq1.ygridcore.net>) not allowed



FAILED:  org.apache.maven.wagon.providers.scm.ScmGitExeWagonTest.testWagonPutDirectory

Error Message:
Error checking out: command failed: Cloning into '/home/jenkins/jenkins-slave/workspace/n-box_maven-wagon_WAGON-528-IMNZXLSWVKGSMF6UG52A7YYKAK332OKWF6U6U6HZJQ3V6WNV7M2A@2/m/wagon-providers/wagon-scm/target/test-output/checkout-org.apache.maven.scm.provider.git.gitexe.GitExeScmProvider'...
fatal: '/m/wagon-providers/wagon-scm/target/test-classes/test-repo-git-test/' does not appear to be a git repository
fatal: Could not read from remote repository.

Please make sure you have the correct access rights
and the repository exists.

Stack Trace:
org.apache.maven.wagon.TransferFailedException:
Error checking out: command failed: Cloning into '/home/jenkins/jenkins-slave/workspace/n-box_maven-wagon_WAGON-528-IMNZXLSWVKGSMF6UG52A7YYKAK332OKWF6U6U6HZJQ3V6WNV7M2A@2/m/wagon-providers/wagon-scm/target/test-output/checkout-org.apache.maven.scm.provider.git.gitexe.GitExeScmProvider'...
fatal: '/m/wagon-providers/wagon-scm/target/test-classes/test-repo-git-test/' does not appear to be a git repository
fatal: Could not read from remote repository.

Please make sure you have the correct access rights
and the repository exists.
Caused by: org.apache.maven.scm.ScmException:
command failed: Cloning into '/home/jenkins/jenkins-slave/workspace/n-box_maven-wagon_WAGON-528-IMNZXLSWVKGSMF6UG52A7YYKAK332OKWF6U6U6HZJQ3V6WNV7M2A@2/m/wagon-providers/wagon-scm/target/test-output/checkout-org.apache.maven.scm.provider.git.gitexe.GitExeScmProvider'...
fatal: '/m/wagon-providers/wagon-scm/target/test-classes/test-repo-git-test/' does not appear to be a git repository
fatal: Could not read from remote repository.

Please make sure you have the correct access rights
and the repository exists.


FAILED:  org.apache.maven.wagon.providers.scm.ScmGitExeWagonTest.testWagonPutDirectoryDeepDestination

Error Message:
Error checking out: command failed: Cloning into '/home/jenkins/jenkins-slave/workspace/n-box_maven-wagon_WAGON-528-IMNZXLSWVKGSMF6UG52A7YYKAK332OKWF6U6U6HZJQ3V6WNV7M2A@2/m/wagon-providers/wagon-scm/target/test-output/checkout-org.apache.maven.scm.provider.git.gitexe.GitExeScmProvider'...
fatal: '/m/wagon-providers/wagon-scm/target/test-classes/test-repo-git-test/' does not appear to be a git repository
fatal: Could not read from remote repository.

Please make sure you have the correct access rights
and the repository exists.

Stack Trace:
org.apache.maven.wagon.TransferFailedException:
Error checking out: command failed: Cloning into '/home/jenkins/jenkins-slave/workspace/n-box_maven-wagon_WAGON-528-IMNZXLSWVKGSMF6UG52A7YYKAK332OKWF6U6U6HZJQ3V6WNV7M2A@2/m/wagon-providers/wagon-scm/target/test-output/checkout-org.apache.maven.scm.provider.git.gitexe.GitExeScmProvider'...
fatal: '/m/wagon-providers/wagon-scm/target/test-classes/test-repo-git-test/' does not appear to be a git repository
fatal: Could not read from remote repository.

Please make sure you have the correct access rights
and the repository exists.
Caused by: org.apache.maven.scm.ScmException:
command failed: Cloning into '/home/jenkins/jenkins-slave/workspace/n-box_maven-wagon_WAGON-528-IMNZXLSWVKGSMF6UG52A7YYKAK332OKWF6U6U6HZJQ3V6WNV7M2A@2/m/wagon-providers/wagon-scm/target/test-output/checkout-org.apache.maven.scm.provider.git.gitexe.GitExeScmProvider'...
fatal: '/m/wagon-providers/wagon-scm/target/test-classes/test-repo-git-test/' does not appear to be a git repository
fatal: Could not read from remote repository.

Please make sure you have the correct access rights
and the repository exists.


FAILED:  org.apache.maven.wagon.providers.scm.ScmGitExeWagonTest.testWagon

Error Message:

  Unexpected method call TransferListener.transferError(TransferEvent[GET|ERROR|Repository[scm:git:file://2/m/wagon-providers/wagon-scm/target/test-classes/test-repo-git-test/]|null|test-resource[len = 18; mod = 1536860631574]]):
    TransferListener.transferCompleted(TransferEvent[PUT|COMPLETED|Repository[scm:git:file://2/m/wagon-providers/wagon-scm/target/test-classes/test-repo-git-test/]|/home/jenkins/jenkins-slave/workspace/n-box_maven-wagon_WAGON-528-IMNZXLSWVKGSMF6UG52A7YYKAK332OKWF6U6U6HZJQ3V6WNV7M2A@2/m/wagon-providers/wagon-scm/target/test-output/test-resource|test-resource[len = 18; mod = 1536860631574]]): expected: 1, actual: 0

Stack Trace:
java.lang.AssertionError:

  Unexpected method call TransferListener.transferError(TransferEvent[GET|ERROR|Repository[scm:git:file://2/m/wagon-providers/wagon-scm/target/test-classes/test-repo-git-test/]|null|test-resource[len = 18; mod = 1536860631574]]):
    TransferListener.transferCompleted(TransferEvent[PUT|COMPLETED|Repository[scm:git:file://2/m/wagon-providers/wagon-scm/target/test-classes/test-repo-git-test/]|/home/jenkins/jenkins-slave/workspace/n-box_maven-wagon_WAGON-528-IMNZXLSWVKGSMF6UG52A7YYKAK332OKWF6U6U6HZJQ3V6WNV7M2A@2/m/wagon-providers/wagon-scm/target/test-output/test-resource|test-resource[len = 18; mod = 1536860631574]]): expected: 1, actual: 0


FAILED:  org.apache.maven.wagon.providers.scm.ScmGitExeWagonTest.testWagonPutDirectoryForDot

Error Message:
Error checking out: command failed: Cloning into '/home/jenkins/jenkins-slave/workspace/n-box_maven-wagon_WAGON-528-IMNZXLSWVKGSMF6UG52A7YYKAK332OKWF6U6U6HZJQ3V6WNV7M2A@2/m/wagon-providers/wagon-scm/target/test-output/checkout-org.apache.maven.scm.provider.git.gitexe.GitExeScmProvider'...
fatal: '/m/wagon-providers/wagon-scm/target/test-classes/test-repo-git-test/' does not appear to be a git repository
fatal: Could not read from remote repository.

Please make sure you have the correct access rights
and the repository exists.

Stack Trace:
org.apache.maven.wagon.TransferFailedException:
Error checking out: command failed: Cloning into '/home/jenkins/jenkins-slave/workspace/n-box_maven-wagon_WAGON-528-IMNZXLSWVKGSMF6UG52A7YYKAK332OKWF6U6U6HZJQ3V6WNV7M2A@2/m/wagon-providers/wagon-scm/target/test-output/checkout-org.apache.maven.scm.provider.git.gitexe.GitExeScmProvider'...
fatal: '/m/wagon-providers/wagon-scm/target/test-classes/test-repo-git-test/' does not appear to be a git repository
fatal: Could not read from remote repository.

Please make sure you have the correct access rights
and the repository exists.
Caused by: org.apache.maven.scm.ScmException:
command failed: Cloning into '/home/jenkins/jenkins-slave/workspace/n-box_maven-wagon_WAGON-528-IMNZXLSWVKGSMF6UG52A7YYKAK332OKWF6U6U6HZJQ3V6WNV7M2A@2/m/wagon-providers/wagon-scm/target/test-output/checkout-org.apache.maven.scm.provider.git.gitexe.GitExeScmProvider'...
fatal: '/m/wagon-providers/wagon-scm/target/test-classes/test-repo-git-test/' does not appear to be a git repository
fatal: Could not read from remote repository.

Please make sure you have the correct access rights
and the repository exists.


FAILED:  org.apache.maven.wagon.providers.scm.ScmGitExeWagonTest.testWagonPutDirectoryWhenDirectoryAlreadyExists

Error Message:
Error checking out: command failed: Cloning into '/home/jenkins/jenkins-slave/workspace/n-box_maven-wagon_WAGON-528-IMNZXLSWVKGSMF6UG52A7YYKAK332OKWF6U6U6HZJQ3V6WNV7M2A@2/m/wagon-providers/wagon-scm/target/test-output/checkout-org.apache.maven.scm.provider.git.gitexe.GitExeScmProvider'...
fatal: '/m/wagon-providers/wagon-scm/target/test-classes/test-repo-git-test/' does not appear to be a git repository
fatal: Could not read from remote repository.

Please make sure you have the correct access rights
and the repository exists.

Stack Trace:
org.apache.maven.wagon.TransferFailedException:
Error checking out: command failed: Cloning into '/home/jenkins/jenkins-slave/workspace/n-box_maven-wagon_WAGON-528-IMNZXLSWVKGSMF6UG52A7YYKAK332OKWF6U6U6HZJQ3V6WNV7M2A@2/m/wagon-providers/wagon-scm/target/test-output/checkout-org.apache.maven.scm.provider.git.gitexe.GitExeScmProvider'...
fatal: '/m/wagon-providers/wagon-scm/target/test-classes/test-repo-git-test/' does not appear to be a git repository
fatal: Could not read from remote repository.

Please make sure you have the correct access rights
and the repository exists.
Caused by: org.apache.maven.scm.ScmException:
command failed: Cloning into '/home/jenkins/jenkins-slave/workspace/n-box_maven-wagon_WAGON-528-IMNZXLSWVKGSMF6UG52A7YYKAK332OKWF6U6U6HZJQ3V6WNV7M2A@2/m/wagon-providers/wagon-scm/target/test-output/checkout-org.apache.maven.scm.provider.git.gitexe.GitExeScmProvider'...
fatal: '/m/wagon-providers/wagon-scm/target/test-classes/test-repo-git-test/' does not appear to be a git repository
fatal: Could not read from remote repository.

Please make sure you have the correct access rights
and the repository exists.


FAILED:  org.apache.maven.wagon.providers.scm.ScmGitExeWagonTest.testWagonPutDirectory

Error Message:
Error checking out: command failed: Cloning into 'F:********@2\m\wagon-providers\wagon-scm\target\test-output\checkout-org.apache.maven.scm.provider.git.gitexe.GitExeScmProvider'...
fatal: '//2/m/wagon-providers/wagon-scm/target/test-classes/test-repo-git-test/' does not appear to be a git repository
fatal: Could not read from remote repository.

Please make sure you have the correct access rights
and the repository exists.

Stack Trace:
org.apache.maven.wagon.TransferFailedException:
Error checking out: command failed: Cloning into 'F:********@2\m\wagon-providers\wagon-scm\target\test-output\checkout-org.apache.maven.scm.provider.git.gitexe.GitExeScmProvider'...
fatal: '//2/m/wagon-providers/wagon-scm/target/test-classes/test-repo-git-test/' does not appear to be a git repository
fatal: Could not read from remote repository.

Please make sure you have the correct access rights
and the repository exists.
Caused by: org.apache.maven.scm.ScmException:
command failed: Cloning into 'F:********@2\m\wagon-providers\wagon-scm\target\test-output\checkout-org.apache.maven.scm.provider.git.gitexe.GitExeScmProvider'...
fatal: '//2/m/wagon-providers/wagon-scm/target/test-classes/test-repo-git-test/' does not appear to be a git repository
fatal: Could not read from remote repository.

Please make sure you have the correct access rights
and the repository exists.


FAILED:  org.apache.maven.wagon.providers.scm.ScmGitExeWagonTest.testWagonPutDirectoryDeepDestination

Error Message:
Error checking out: command failed: Cloning into 'F:********@2\m\wagon-providers\wagon-scm\target\test-output\checkout-org.apache.maven.scm.provider.git.gitexe.GitExeScmProvider'...
fatal: '//2/m/wagon-providers/wagon-scm/target/test-classes/test-repo-git-test/' does not appear to be a git repository
fatal: Could not read from remote repository.

Please make sure you have the correct access rights
and the repository exists.

Stack Trace:
org.apache.maven.wagon.TransferFailedException:
Error checking out: command failed: Cloning into 'F:********@2\m\wagon-providers\wagon-scm\target\test-output\checkout-org.apache.maven.scm.provider.git.gitexe.GitExeScmProvider'...
fatal: '//2/m/wagon-providers/wagon-scm/target/test-classes/test-repo-git-test/' does not appear to be a git repository
fatal: Could not read from remote repository.

Please make sure you have the correct access rights
and the repository exists.
Caused by: org.apache.maven.scm.ScmException:
command failed: Cloning into 'F:********@2\m\wagon-providers\wagon-scm\target\test-output\checkout-org.apache.maven.scm.provider.git.gitexe.GitExeScmProvider'...
fatal: '//2/m/wagon-providers/wagon-scm/target/test-classes/test-repo-git-test/' does not appear to be a git repository
fatal: Could not read from remote repository.

Please make sure you have the correct access rights
and the repository exists.


FAILED:  org.apache.maven.wagon.providers.scm.ScmGitExeWagonTest.testWagon

Error Message:

  Unexpected method call TransferListener.transferError(TransferEvent[GET|ERROR|Repository[scm:git:file://2/m/wagon-providers/wagon-scm/target/test-classes/test-repo-git-test/]|null|test-resource[len = 18; mod = 1536860734111]]):
    TransferListener.transferCompleted(TransferEvent[PUT|COMPLETED|Repository[scm:git:file://2/m/wagon-providers/wagon-scm/target/test-classes/test-repo-git-test/]|F:\jenkins\jenkins-slave\workspace\n-box_maven-wagon_WAGON-528-IMNZXLSWVKGSMF6UG52A7YYKAK332OKWF6U6U6HZJQ3V6WNV7M2A@2\m\wagon-providers\wagon-scm\target\test-output\test-resource|test-resource[len = 18; mod = 1536860734111]]): expected: 1, actual: 0

Stack Trace:
java.lang.AssertionError:

  Unexpected method call TransferListener.transferError(TransferEvent[GET|ERROR|Repository[scm:git:file://2/m/wagon-providers/wagon-scm/target/test-classes/test-repo-git-test/]|null|test-resource[len = 18; mod = 1536860734111]]):
    TransferListener.transferCompleted(TransferEvent[PUT|COMPLETED|Repository[scm:git:file://2/m/wagon-providers/wagon-scm/target/test-classes/test-repo-git-test/]|F:\jenkins\jenkins-slave\workspace\n-box_maven-wagon_WAGON-528-IMNZXLSWVKGSMF6UG52A7YYKAK332OKWF6U6U6HZJQ3V6WNV7M2A@2\m\wagon-providers\wagon-scm\target\test-output\test-resource|test-resource[len = 18; mod = 1536860734111]]): expected: 1, actual: 0


FAILED:  org.apache.maven.wagon.providers.scm.ScmGitExeWagonTest.testWagonPutDirectoryForDot

Error Message:
Error checking out: command failed: Cloning into 'F:********@2\m\wagon-providers\wagon-scm\target\test-output\checkout-org.apache.maven.scm.provider.git.gitexe.GitExeScmProvider'...
fatal: '//2/m/wagon-providers/wagon-scm/target/test-classes/test-repo-git-test/' does not appear to be a git repository
fatal: Could not read from remote repository.

Please make sure you have the correct access rights
and the repository exists.

Stack Trace:
org.apache.maven.wagon.TransferFailedException:
Error checking out: command failed: Cloning into 'F:********@2\m\wagon-providers\wagon-scm\target\test-output\checkout-org.apache.maven.scm.provider.git.gitexe.GitExeScmProvider'...
fatal: '//2/m/wagon-providers/wagon-scm/target/test-classes/test-repo-git-test/' does not appear to be a git repository
fatal: Could not read from remote repository.

Please make sure you have the correct access rights
and the repository exists.
Caused by: org.apache.maven.scm.ScmException:
command failed: Cloning into 'F:********@2\m\wagon-providers\wagon-scm\target\test-output\checkout-org.apache.maven.scm.provider.git.gitexe.GitExeScmProvider'...
fatal: '//2/m/wagon-providers/wagon-scm/target/test-classes/test-repo-git-test/' does not appear to be a git repository
fatal: Could not read from remote repository.

Please make sure you have the correct access rights
and the repository exists.


FAILED:  org.apache.maven.wagon.providers.scm.ScmGitExeWagonTest.testWagonPutDirectoryWhenDirectoryAlreadyExists

Error Message:
Error checking out: command failed: Cloning into 'F:********@2\m\wagon-providers\wagon-scm\target\test-output\checkout-org.apache.maven.scm.provider.git.gitexe.GitExeScmProvider'...
fatal: '//2/m/wagon-providers/wagon-scm/target/test-classes/test-repo-git-test/' does not appear to be a git repository
fatal: Could not read from remote repository.

Please make sure you have the correct access rights
and the repository exists.

Stack Trace:
org.apache.maven.wagon.TransferFailedException:
Error checking out: command failed: Cloning into 'F:********@2\m\wagon-providers\wagon-scm\target\test-output\checkout-org.apache.maven.scm.provider.git.gitexe.GitExeScmProvider'...
fatal: '//2/m/wagon-providers/wagon-scm/target/test-classes/test-repo-git-test/' does not appear to be a git repository
fatal: Could not read from remote repository.

Please make sure you have the correct access rights
and the repository exists.
Caused by: org.apache.maven.scm.ScmException:
command failed: Cloning into 'F:********@2\m\wagon-providers\wagon-scm\target\test-output\checkout-org.apache.maven.scm.provider.git.gitexe.GitExeScmProvider'...
fatal: '//2/m/wagon-providers/wagon-scm/target/test-classes/test-repo-git-test/' does not appear to be a git repository
fatal: Could not read from remote repository.

Please make sure you have the correct access rights
and the repository exists.


FAILED:  org.apache.maven.wagon.providers.scm.ScmGitExeWagonTest.testWagonPutDirectory

Error Message:
Error checking out: command failed: Cloning into 'F:\jenkins\jenkins-slave\workspace\n-box_maven-wagon_WAGON-528-IMNZXLSWVKGSMF6UG52A7YYKAK332OKWF6U6U6HZJQ3V6WNV7M2A\m\wagon-providers\wagon-scm\target\test-output\checkout-org.apache.maven.scm.provider.git.gitexe.GitExeScmProvider'...
fatal: '$GIT_DIR' too big
fatal: index-pack failed

Stack Trace:
org.apache.maven.wagon.TransferFailedException:
Error checking out: command failed: Cloning into 'F:\jenkins\jenkins-slave\workspace\n-box_maven-wagon_WAGON-528-IMNZXLSWVKGSMF6UG52A7YYKAK332OKWF6U6U6HZJQ3V6WNV7M2A\m\wagon-providers\wagon-scm\target\test-output\checkout-org.apache.maven.scm.provider.git.gitexe.GitExeScmProvider'...
fatal: '$GIT_DIR' too big
fatal: index-pack failed
Caused by: org.apache.maven.scm.ScmException:
command failed: Cloning into 'F:\jenkins\jenkins-slave\workspace\n-box_maven-wagon_WAGON-528-IMNZXLSWVKGSMF6UG52A7YYKAK332OKWF6U6U6HZJQ3V6WNV7M2A\m\wagon-providers\wagon-scm\target\test-output\checkout-org.apache.maven.scm.provider.git.gitexe.GitExeScmProvider'...
fatal: '$GIT_DIR' too big
fatal: index-pack failed


FAILED:  org.apache.maven.wagon.providers.scm.ScmGitExeWagonTest.testWagonPutDirectoryDeepDestination

Error Message:
Error checking out: command failed: Cloning into 'F:\jenkins\jenkins-slave\workspace\n-box_maven-wagon_WAGON-528-IMNZXLSWVKGSMF6UG52A7YYKAK332OKWF6U6U6HZJQ3V6WNV7M2A\m\wagon-providers\wagon-scm\target\test-output\checkout-org.apache.maven.scm.provider.git.gitexe.GitExeScmProvider'...
fatal: '$GIT_DIR' too big
fatal: index-pack failed

Stack Trace:
org.apache.maven.wagon.TransferFailedException:
Error checking out: command failed: Cloning into 'F:\jenkins\jenkins-slave\workspace\n-box_maven-wagon_WAGON-528-IMNZXLSWVKGSMF6UG52A7YYKAK332OKWF6U6U6HZJQ3V6WNV7M2A\m\wagon-providers\wagon-scm\target\test-output\checkout-org.apache.maven.scm.provider.git.gitexe.GitExeScmProvider'...
fatal: '$GIT_DIR' too big
fatal: index-pack failed
Caused by: org.apache.maven.scm.ScmException:
command failed: Cloning into 'F:\jenkins\jenkins-slave\workspace\n-box_maven-wagon_WAGON-528-IMNZXLSWVKGSMF6UG52A7YYKAK332OKWF6U6U6HZJQ3V6WNV7M2A\m\wagon-providers\wagon-scm\target\test-output\checkout-org.apache.maven.scm.provider.git.gitexe.GitExeScmProvider'...
fatal: '$GIT_DIR' too big
fatal: index-pack failed


FAILED:  org.apache.maven.wagon.providers.scm.ScmGitExeWagonTest.testWagon

Error Message:

  Unexpected method call TransferListener.transferError(TransferEvent[GET|ERROR|Repository[scm:git:file:///F:/jenkins/jenkins-slave/workspace/n-box_maven-wagon_WAGON-528-IMNZXLSWVKGSMF6UG52A7YYKAK332OKWF6U6U6HZJQ3V6WNV7M2A/m/wagon-providers/wagon-scm/target/test-classes/test-repo-git-test/]|null|test-resource[len = 18; mod = 1536860720570]]):
    TransferListener.transferCompleted(TransferEvent[PUT|COMPLETED|Repository[scm:git:file:///F:/jenkins/jenkins-slave/workspace/n-box_maven-wagon_WAGON-528-IMNZXLSWVKGSMF6UG52A7YYKAK332OKWF6U6U6HZJQ3V6WNV7M2A/m/wagon-providers/wagon-scm/target/test-classes/test-repo-git-test/]|F:\jenkins\jenkins-slave\workspace\n-box_maven-wagon_WAGON-528-IMNZXLSWVKGSMF6UG52A7YYKAK332OKWF6U6U6HZJQ3V6WNV7M2A\m\wagon-providers\wagon-scm\target\test-output\test-resource|test-resource[len = 18; mod = 1536860720570]]): expected: 1, actual: 0

Stack Trace:
java.lang.AssertionError:

  Unexpected method call TransferListener.transferError(TransferEvent[GET|ERROR|Repository[scm:git:file:///F:/jenkins/jenkins-slave/workspace/n-box_maven-wagon_WAGON-528-IMNZXLSWVKGSMF6UG52A7YYKAK332OKWF6U6U6HZJQ3V6WNV7M2A/m/wagon-providers/wagon-scm/target/test-classes/test-repo-git-test/]|null|test-resource[len = 18; mod = 1536860720570]]):
    TransferListener.transferCompleted(TransferEvent[PUT|COMPLETED|Repository[scm:git:file:///F:/jenkins/jenkins-slave/workspace/n-box_maven-wagon_WAGON-528-IMNZXLSWVKGSMF6UG52A7YYKAK332OKWF6U6U6HZJQ3V6WNV7M2A/m/wagon-providers/wagon-scm/target/test-classes/test-repo-git-test/]|F:\jenkins\jenkins-slave\workspace\n-box_maven-wagon_WAGON-528-IMNZXLSWVKGSMF6UG52A7YYKAK332OKWF6U6U6HZJQ3V6WNV7M2A\m\wagon-providers\wagon-scm\target\test-output\test-resource|test-resource[len = 18; mod = 1536860720570]]): expected: 1, actual: 0


FAILED:  org.apache.maven.wagon.providers.scm.ScmGitExeWagonTest.testWagonPutDirectoryForDot

Error Message:
Error checking out: command failed: Cloning into 'F:\jenkins\jenkins-slave\workspace\n-box_maven-wagon_WAGON-528-IMNZXLSWVKGSMF6UG52A7YYKAK332OKWF6U6U6HZJQ3V6WNV7M2A\m\wagon-providers\wagon-scm\target\test-output\checkout-org.apache.maven.scm.provider.git.gitexe.GitExeScmProvider'...
fatal: '$GIT_DIR' too big
fatal: index-pack failed

Stack Trace:
org.apache.maven.wagon.TransferFailedException:
Error checking out: command failed: Cloning into 'F:\jenkins\jenkins-slave\workspace\n-box_maven-wagon_WAGON-528-IMNZXLSWVKGSMF6UG52A7YYKAK332OKWF6U6U6HZJQ3V6WNV7M2A\m\wagon-providers\wagon-scm\target\test-output\checkout-org.apache.maven.scm.provider.git.gitexe.GitExeScmProvider'...
fatal: '$GIT_DIR' too big
fatal: index-pack failed
Caused by: org.apache.maven.scm.ScmException:
command failed: Cloning into 'F:\jenkins\jenkins-slave\workspace\n-box_maven-wagon_WAGON-528-IMNZXLSWVKGSMF6UG52A7YYKAK332OKWF6U6U6HZJQ3V6WNV7M2A\m\wagon-providers\wagon-scm\target\test-output\checkout-org.apache.maven.scm.provider.git.gitexe.GitExeScmProvider'...
fatal: '$GIT_DIR' too big
fatal: index-pack failed


FAILED:  org.apache.maven.wagon.providers.scm.ScmGitExeWagonTest.testWagonPutDirectoryWhenDirectoryAlreadyExists

Error Message:
Error checking out: command failed: Cloning into 'F:\jenkins\jenkins-slave\workspace\n-box_maven-wagon_WAGON-528-IMNZXLSWVKGSMF6UG52A7YYKAK332OKWF6U6U6HZJQ3V6WNV7M2A\m\wagon-providers\wagon-scm\target\test-output\checkout-org.apache.maven.scm.provider.git.gitexe.GitExeScmProvider'...
fatal: '$GIT_DIR' too big
fatal: index-pack failed

Stack Trace:
org.apache.maven.wagon.TransferFailedException:
Error checking out: command failed: Cloning into 'F:\jenkins\jenkins-slave\workspace\n-box_maven-wagon_WAGON-528-IMNZXLSWVKGSMF6UG52A7YYKAK332OKWF6U6U6HZJQ3V6WNV7M2A\m\wagon-providers\wagon-scm\target\test-output\checkout-org.apache.maven.scm.provider.git.gitexe.GitExeScmProvider'...
fatal: '$GIT_DIR' too big
fatal: index-pack failed
Caused by: org.apache.maven.scm.ScmException:
command failed: Cloning into 'F:\jenkins\jenkins-slave\workspace\n-box_maven-wagon_WAGON-528-IMNZXLSWVKGSMF6UG52A7YYKAK332OKWF6U6U6HZJQ3V6WNV7M2A\m\wagon-providers\wagon-scm\target\test-output\checkout-org.apache.maven.scm.provider.git.gitexe.GitExeScmProvider'...
fatal: '$GIT_DIR' too big
fatal: index-pack failed


FAILED:  org.apache.maven.wagon.providers.scm.ScmGitExeWagonTest.testWagonPutDirectory

Error Message:
Error checking out: command failed: Cloning into 'F:\jenkins\jenkins-slave\workspace\n-box_maven-wagon_WAGON-528-IMNZXLSWVKGSMF6UG52A7YYKAK332OKWF6U6U6HZJQ3V6WNV7M2A\m\wagon-providers\wagon-scm\target\test-output\checkout-org.apache.maven.scm.provider.git.gitexe.GitExeScmProvider'...
fatal: '$GIT_DIR' too big
fatal: index-pack failed

Stack Trace:
org.apache.maven.wagon.TransferFailedException:
Error checking out: command failed: Cloning into 'F:\jenkins\jenkins-slave\workspace\n-box_maven-wagon_WAGON-528-IMNZXLSWVKGSMF6UG52A7YYKAK332OKWF6U6U6HZJQ3V6WNV7M2A\m\wagon-providers\wagon-scm\target\test-output\checkout-org.apache.maven.scm.provider.git.gitexe.GitExeScmProvider'...
fatal: '$GIT_DIR' too big
fatal: index-pack failed
Caused by: org.apache.maven.scm.ScmException:
command failed: Cloning into 'F:\jenkins\jenkins-slave\workspace\n-box_maven-wagon_WAGON-528-IMNZXLSWVKGSMF6UG52A7YYKAK332OKWF6U6U6HZJQ3V6WNV7M2A\m\wagon-providers\wagon-scm\target\test-output\checkout-org.apache.maven.scm.provider.git.gitexe.GitExeScmProvider'...
fatal: '$GIT_DIR' too big
fatal: index-pack failed


FAILED:  org.apache.maven.wagon.providers.scm.ScmGitExeWagonTest.testWagonPutDirectoryDeepDestination

Error Message:
Error checking out: command failed: Cloning into 'F:\jenkins\jenkins-slave\workspace\n-box_maven-wagon_WAGON-528-IMNZXLSWVKGSMF6UG52A7YYKAK332OKWF6U6U6HZJQ3V6WNV7M2A\m\wagon-providers\wagon-scm\target\test-output\checkout-org.apache.maven.scm.provider.git.gitexe.GitExeScmProvider'...
fatal: '$GIT_DIR' too big
fatal: index-pack failed

Stack Trace:
org.apache.maven.wagon.TransferFailedException:
Error checking out: command failed: Cloning into 'F:\jenkins\jenkins-slave\workspace\n-box_maven-wagon_WAGON-528-IMNZXLSWVKGSMF6UG52A7YYKAK332OKWF6U6U6HZJQ3V6WNV7M2A\m\wagon-providers\wagon-scm\target\test-output\checkout-org.apache.maven.scm.provider.git.gitexe.GitExeScmProvider'...
fatal: '$GIT_DIR' too big
fatal: index-pack failed
Caused by: org.apache.maven.scm.ScmException:
command failed: Cloning into 'F:\jenkins\jenkins-slave\workspace\n-box_maven-wagon_WAGON-528-IMNZXLSWVKGSMF6UG52A7YYKAK332OKWF6U6U6HZJQ3V6WNV7M2A\m\wagon-providers\wagon-scm\target\test-output\checkout-org.apache.maven.scm.provider.git.gitexe.GitExeScmProvider'...
fatal: '$GIT_DIR' too big
fatal: index-pack failed


FAILED:  org.apache.maven.wagon.providers.scm.ScmGitExeWagonTest.testWagon

Error Message:

  Unexpected method call TransferListener.transferError(TransferEvent[GET|ERROR|Repository[scm:git:file:///F:/jenkins/jenkins-slave/workspace/n-box_maven-wagon_WAGON-528-IMNZXLSWVKGSMF6UG52A7YYKAK332OKWF6U6U6HZJQ3V6WNV7M2A/m/wagon-providers/wagon-scm/target/test-classes/test-repo-git-test/]|null|test-resource[len = 18; mod = 1536861060619]]):
    TransferListener.transferCompleted(TransferEvent[PUT|COMPLETED|Repository[scm:git:file:///F:/jenkins/jenkins-slave/workspace/n-box_maven-wagon_WAGON-528-IMNZXLSWVKGSMF6UG52A7YYKAK332OKWF6U6U6HZJQ3V6WNV7M2A/m/wagon-providers/wagon-scm/target/test-classes/test-repo-git-test/]|F:\jenkins\jenkins-slave\workspace\n-box_maven-wagon_WAGON-528-IMNZXLSWVKGSMF6UG52A7YYKAK332OKWF6U6U6HZJQ3V6WNV7M2A\m\wagon-providers\wagon-scm\target\test-output\test-resource|test-resource[len = 18; mod = 1536861060619]]): expected: 1, actual: 0

Stack Trace:
java.lang.AssertionError:

  Unexpected method call TransferListener.transferError(TransferEvent[GET|ERROR|Repository[scm:git:file:///F:/jenkins/jenkins-slave/workspace/n-box_maven-wagon_WAGON-528-IMNZXLSWVKGSMF6UG52A7YYKAK332OKWF6U6U6HZJQ3V6WNV7M2A/m/wagon-providers/wagon-scm/target/test-classes/test-repo-git-test/]|null|test-resource[len = 18; mod = 1536861060619]]):
    TransferListener.transferCompleted(TransferEvent[PUT|COMPLETED|Repository[scm:git:file:///F:/jenkins/jenkins-slave/workspace/n-box_maven-wagon_WAGON-528-IMNZXLSWVKGSMF6UG52A7YYKAK332OKWF6U6U6HZJQ3V6WNV7M2A/m/wagon-providers/wagon-scm/target/test-classes/test-repo-git-test/]|F:\jenkins\jenkins-slave\workspace\n-box_maven-wagon_WAGON-528-IMNZXLSWVKGSMF6UG52A7YYKAK332OKWF6U6U6HZJQ3V6WNV7M2A\m\wagon-providers\wagon-scm\target\test-output\test-resource|test-resource[len = 18; mod = 1536861060619]]): expected: 1, actual: 0


FAILED:  org.apache.maven.wagon.providers.scm.ScmGitExeWagonTest.testWagonPutDirectoryForDot

Error Message:
Error checking out: command failed: Cloning into 'F:\jenkins\jenkins-slave\workspace\n-box_maven-wagon_WAGON-528-IMNZXLSWVKGSMF6UG52A7YYKAK332OKWF6U6U6HZJQ3V6WNV7M2A\m\wagon-providers\wagon-scm\target\test-output\checkout-org.apache.maven.scm.provider.git.gitexe.GitExeScmProvider'...
fatal: '$GIT_DIR' too big
fatal: index-pack failed

Stack Trace:
org.apache.maven.wagon.TransferFailedException:
Error checking out: command failed: Cloning into 'F:\jenkins\jenkins-slave\workspace\n-box_maven-wagon_WAGON-528-IMNZXLSWVKGSMF6UG52A7YYKAK332OKWF6U6U6HZJQ3V6WNV7M2A\m\wagon-providers\wagon-scm\target\test-output\checkout-org.apache.maven.scm.provider.git.gitexe.GitExeScmProvider'...
fatal: '$GIT_DIR' too big
fatal: index-pack failed
Caused by: org.apache.maven.scm.ScmException:
command failed: Cloning into 'F:\jenkins\jenkins-slave\workspace\n-box_maven-wagon_WAGON-528-IMNZXLSWVKGSMF6UG52A7YYKAK332OKWF6U6U6HZJQ3V6WNV7M2A\m\wagon-providers\wagon-scm\target\test-output\checkout-org.apache.maven.scm.provider.git.gitexe.GitExeScmProvider'...
fatal: '$GIT_DIR' too big
fatal: index-pack failed


FAILED:  org.apache.maven.wagon.providers.scm.ScmGitExeWagonTest.testWagonPutDirectoryWhenDirectoryAlreadyExists

Error Message:
Error checking out: command failed: Cloning into 'F:\jenkins\jenkins-slave\workspace\n-box_maven-wagon_WAGON-528-IMNZXLSWVKGSMF6UG52A7YYKAK332OKWF6U6U6HZJQ3V6WNV7M2A\m\wagon-providers\wagon-scm\target\test-output\checkout-org.apache.maven.scm.provider.git.gitexe.GitExeScmProvider'...
fatal: '$GIT_DIR' too big
fatal: index-pack failed

Stack Trace:
org.apache.maven.wagon.TransferFailedException:
Error checking out: command failed: Cloning into 'F:\jenkins\jenkins-slave\workspace\n-box_maven-wagon_WAGON-528-IMNZXLSWVKGSMF6UG52A7YYKAK332OKWF6U6U6HZJQ3V6WNV7M2A\m\wagon-providers\wagon-scm\target\test-output\checkout-org.apache.maven.scm.provider.git.gitexe.GitExeScmProvider'...
fatal: '$GIT_DIR' too big
fatal: index-pack failed
Caused by: org.apache.maven.scm.ScmException:
command failed: Cloning into 'F:\jenkins\jenkins-slave\workspace\n-box_maven-wagon_WAGON-528-IMNZXLSWVKGSMF6UG52A7YYKAK332OKWF6U6U6HZJQ3V6WNV7M2A\m\wagon-providers\wagon-scm\target\test-output\checkout-org.apache.maven.scm.provider.git.gitexe.GitExeScmProvider'...
fatal: '$GIT_DIR' too big
fatal: index-pack failed




Build log:
[...truncated 3.40 MB...]
[windows-jdk9] [INFO]
[windows-jdk9] [INFO] --- maven-enforcer-plugin:1.4.1:enforce (default) @ wagon-ssh ---
[windows-jdk9] [INFO]
[windows-jdk9] [INFO] --- apache-rat-plugin:0.12:check (rat-check) @ wagon-ssh ---
[windows-jdk9] [INFO] Enabled default license matchers.
[windows-jdk9] [INFO] Will parse SCM ignores for exclusions...
[windows-jdk9] [INFO] Finished adding exclusions from SCM ignore files.
[windows-jdk9] [INFO] 61 implicit excludes (use -debug for more details).
[windows-jdk9] [INFO] Exclude: .checkstyle
[windows-jdk9] [INFO] Exclude: **/*.odg
[windows-jdk9] [INFO] Exclude: src/test/resources/**
[windows-jdk9] [INFO] Exclude: src/main/resources/default-server-root/**
[windows-jdk9] [INFO] Exclude: src/main/resources/ssh-keys/**
[windows-jdk9] [INFO] Exclude: src/test/ssh-keys/**
[windows-jdk9] [INFO] Exclude: .repository/**
[windows-jdk9] [INFO] Exclude: out/**
[windows-jdk9] [INFO] Exclude: .repository/**
[windows-jdk9] [INFO] Exclude: .maven/spy.log
[windows-jdk9] [INFO] Exclude: dependency-reduced-pom.xml
[windows-jdk9] [INFO] Exclude: .java-version
[windows-jdk9] [INFO] 19 resources included (use -debug for more details)
[windows-jdk9] [INFO] Rat check: Summary over all files. Unapproved: 0, unknown: 0, generated: 0, approved: 19 licenses.
[windows-jdk9] [INFO]
[windows-jdk9] [INFO] --- maven-remote-resources-plugin:1.5:process (process-resource-bundles) @ wagon-ssh ---
[windows-jdk9] [INFO]
[windows-jdk9] [INFO] --- maven-resources-plugin:3.0.2:resources (default-resources) @ wagon-ssh ---
[windows-jdk9] [INFO] Using 'UTF-8' encoding to copy filtered resources.
[windows-jdk9] [INFO] skip non existing resourceDirectory F:\jenkins\jenkins-slave\workspace\n-box_maven-wagon_WAGON-528-IMNZXLSWVKGSMF6UG52A7YYKAK332OKWF6U6U6HZJQ3V6WNV7M2A\m\wagon-providers\wagon-ssh\src\main\resources
[windows-jdk9] [INFO] Copying 3 resources
[windows-jdk9] [INFO]
[windows-jdk9] [INFO] --- maven-compiler-plugin:3.7.0:compile (default-compile) @ wagon-ssh ---
[windows-jdk9] [INFO] Changes detected - recompiling the module!
[windows-jdk9] [INFO] Compiling 7 source files to F:\jenkins\jenkins-slave\workspace\n-box_maven-wagon_WAGON-528-IMNZXLSWVKGSMF6UG52A7YYKAK332OKWF6U6U6HZJQ3V6WNV7M2A\m\wagon-providers\wagon-ssh\target\classes
[windows-jdk9] [INFO]
[windows-jdk9] [INFO] --- plexus-component-metadata:1.7.1:generate-metadata (generate) @ wagon-ssh ---
[windows-jdk9] [INFO] Discovered 4 component descriptors(s)
[windows-jdk9] [INFO]
[windows-jdk9] [INFO] --- animal-sniffer-maven-plugin:1.15:check (check-java-1.7-compat) @ wagon-ssh ---
[windows-jdk9] [INFO] Checking unresolved references to org.codehaus.mojo.signature:java17:1.0
[windows-jdk9] [INFO]
[windows-jdk9] [INFO] --- maven-resources-plugin:3.0.2:testResources (default-testResources) @ wagon-ssh ---
[windows-jdk9] [INFO] Using 'UTF-8' encoding to copy filtered resources.
[windows-jdk9] [INFO] Copying 6 resources
[windows-jdk9] [INFO] Copying 3 resources
[windows-jdk9] [INFO]
[windows-jdk9] [INFO] --- maven-compiler-plugin:3.7.0:testCompile (default-testCompile) @ wagon-ssh ---
[windows-jdk9] [INFO] Changes detected - recompiling the module!
[windows-jdk9] [INFO] Compiling 8 source files to F:\jenkins\jenkins-slave\workspace\n-box_maven-wagon_WAGON-528-IMNZXLSWVKGSMF6UG52A7YYKAK332OKWF6U6U6HZJQ3V6WNV7M2A\m\wagon-providers\wagon-ssh\target\test-classes
[windows-jdk9] [INFO] /F:/jenkins/jenkins-slave/workspace/n-box_maven-wagon_WAGON-528-IMNZXLSWVKGSMF6UG52A7YYKAK332OKWF6U6U6HZJQ3V6WNV7M2A/m/wagon-providers/wagon-ssh/src/test/java/org/apache/maven/wagon/providers/ssh/jsch/ScpWagonWithSshPrivateKeySearchTest.java: F:\jenkins\jenkins-slave\workspace\n-box_maven-wagon_WAGON-528-IMNZXLSWVKGSMF6UG52A7YYKAK332OKWF6U6U6HZJQ3V6WNV7M2A\m\wagon-providers\wagon-ssh\src\test\java\org\apache\maven\wagon\providers\ssh\jsch\ScpWagonWithSshPrivateKeySearchTest.java uses or overrides a deprecated API.
[windows-jdk9] [INFO] /F:/jenkins/jenkins-slave/workspace/n-box_maven-wagon_WAGON-528-IMNZXLSWVKGSMF6UG52A7YYKAK332OKWF6U6U6HZJQ3V6WNV7M2A/m/wagon-providers/wagon-ssh/src/test/java/org/apache/maven/wagon/providers/ssh/jsch/ScpWagonWithSshPrivateKeySearchTest.java: Recompile with -Xlint:deprecation for details.
[windows-jdk9] [INFO]
[windows-jdk9] [INFO] --- maven-surefire-plugin:2.20:test (default-test) @ wagon-ssh ---
[windows-jdk9] [INFO]
[windows-jdk9] [INFO] --- maven-jar-plugin:3.0.2:jar (default-jar) @ wagon-ssh ---
[windows-jdk9] [INFO] Building jar: F:\jenkins\jenkins-slave\workspace\n-box_maven-wagon_WAGON-528-IMNZXLSWVKGSMF6UG52A7YYKAK332OKWF6U6U6HZJQ3V6WNV7M2A\m\wagon-providers\wagon-ssh\target\wagon-ssh-3.1.1-SNAPSHOT.jar
[windows-jdk9] [INFO]
[windows-jdk9] [INFO] --- maven-site-plugin:3.7:attach-descriptor (attach-descriptor) @ wagon-ssh ---
[windows-jdk9] [INFO] Skipping because packaging 'jar' is not pom.
[windows-jdk9] [INFO]
[windows-jdk9] [INFO] --- maven-checkstyle-plugin:3.0.0:check (checkstyle-check) @ wagon-ssh ---
[windows-jdk9] [INFO] There is 1 error reported by Checkstyle 6.18 with config/maven_checks.xml ruleset.
[windows-jdk9] [INFO] Ignored 1 error, 0 violation remaining.
[windows-jdk9] [INFO]
[windows-jdk9] [INFO] ------------------------------------------------------------------------
[windows-jdk9] [INFO] Building Apache Maven Wagon :: Providers :: WebDAV Provider 3.1.1-SNAPSHOT
[windows-jdk9] [INFO] ------------------------------------------------------------------------
[windows-jdk9] [INFO] Downloading from central: https://repo.maven.apache.org/maven2/org/apache/jackrabbit/jackrabbit-webdav/2.14.4/jackrabbit-webdav-2.14.4.pom
[windows-jdk9] [INFO] Downloaded from central: https://repo.maven.apache.org/maven2/org/apache/jackrabbit/jackrabbit-webdav/2.14.4/jackrabbit-webdav-2.14.4.pom (4.0 kB at 439 kB/s)
[windows-jdk9] [INFO] Downloading from central: https://repo.maven.apache.org/maven2/org/apache/jackrabbit/jackrabbit-parent/2.14.4/jackrabbit-parent-2.14.4.pom
[windows-jdk9] [INFO] Downloaded from central: https://repo.maven.apache.org/maven2/org/apache/jackrabbit/jackrabbit-parent/2.14.4/jackrabbit-parent-2.14.4.pom (35 kB at 4.3 MB/s)
[windows-jdk9] [INFO] Downloading from central: https://repo.maven.apache.org/maven2/it/could/webdav/0.4/webdav-0.4.pom
[windows-jdk9] [INFO] Downloaded from central: https://repo.maven.apache.org/maven2/it/could/webdav/0.4/webdav-0.4.pom (1.1 kB at 178 kB/s)
[windows-jdk9] [INFO] Downloading from central: https://repo.maven.apache.org/maven2/biz/aQute/bnd/1.50.0/bnd-1.50.0.pom
[windows-jdk9] [INFO] Downloaded from central: https://repo.maven.apache.org/maven2/biz/aQute/bnd/1.50.0/bnd-1.50.0.pom (1.3 kB at 142 kB/s)
[windows-jdk9] [INFO] Downloading from central: https://repo.maven.apache.org/maven2/it/could/webdav/0.4/webdav-0.4.jar
[windows-jdk9] [INFO] Downloading from central: https://repo.maven.apache.org/maven2/javax/servlet/servlet-api/2.3/servlet-api-2.3.jar
[windows-jdk9] [INFO] Downloading from central: https://repo.maven.apache.org/maven2/biz/aQute/bnd/1.50.0/bnd-1.50.0.jar
[windows-jdk9] [INFO] Downloading from central: https://repo.maven.apache.org/maven2/org/apache/jackrabbit/jackrabbit-webdav/2.14.4/jackrabbit-webdav-2.14.4.jar
[windows-jdk9] [INFO] Downloaded from central: https://repo.maven.apache.org/maven2/it/could/webdav/0.4/webdav-0.4.jar (103 kB at 5.4 MB/s)
[windows-jdk9] [INFO] Downloaded from central: https://repo.maven.apache.org/maven2/org/apache/jackrabbit/jackrabbit-webdav/2.14.4/jackrabbit-webdav-2.14.4.jar (365 kB at 10 MB/s)
[windows-jdk9] [INFO] Downloaded from central: https://repo.maven.apache.org/maven2/biz/aQute/bnd/1.50.0/bnd-1.50.0.jar (828 kB at 15 MB/s)
[windows-jdk9] [INFO] Downloaded from central: https://repo.maven.apache.org/maven2/javax/servlet/servlet-api/2.3/servlet-api-2.3.jar (78 kB at 1.4 MB/s)
[windows-jdk9] [INFO]
[windows-jdk9] [INFO] --- maven-clean-plugin:3.0.0:clean (default-clean) @ wagon-webdav-jackrabbit ---
[windows-jdk9] [INFO]
[windows-jdk9] [INFO] --- maven-enforcer-plugin:1.4.1:enforce (enforce-maven-version) @ wagon-webdav-jackrabbit ---
[windows-jdk9] [INFO]
[windows-jdk9] [INFO] --- maven-enforcer-plugin:1.4.1:enforce (enforce-bytecode-version) @ wagon-webdav-jackrabbit ---
[windows-jdk9] [INFO]
[windows-jdk9] [INFO] --- maven-enforcer-plugin:1.4.1:enforce (ban-known-bad-maven-versions) @ wagon-webdav-jackrabbit ---
[windows-jdk9] [INFO]
[windows-jdk9] [INFO] --- maven-enforcer-plugin:1.4.1:enforce (default) @ wagon-webdav-jackrabbit ---
[windows-jdk9] [INFO]
[windows-jdk9] [INFO] --- apache-rat-plugin:0.12:check (rat-check) @ wagon-webdav-jackrabbit ---
[windows-jdk9] [INFO] Enabled default license matchers.
[windows-jdk9] [INFO] Will parse SCM ignores for exclusions...
[windows-jdk9] [INFO] Finished adding exclusions from SCM ignore files.
[windows-jdk9] [INFO] 61 implicit excludes (use -debug for more details).
[windows-jdk9] [INFO] Exclude: .checkstyle
[windows-jdk9] [INFO] Exclude: **/*.odg
[windows-jdk9] [INFO] Exclude: src/test/resources/**
[windows-jdk9] [INFO] Exclude: src/main/resources/default-server-root/**
[windows-jdk9] [INFO] Exclude: src/main/resources/ssh-keys/**
[windows-jdk9] [INFO] Exclude: src/test/ssh-keys/**
[windows-jdk9] [INFO] Exclude: .repository/**
[windows-jdk9] [INFO] Exclude: out/**
[windows-jdk9] [INFO] Exclude: .repository/**
[windows-jdk9] [INFO] Exclude: .maven/spy.log
[windows-jdk9] [INFO] Exclude: dependency-reduced-pom.xml
[windows-jdk9] [INFO] Exclude: .java-version
[windows-jdk9] [INFO] 12 resources included (use -debug for more details)
[windows-jdk9] [INFO] Rat check: Summary over all files. Unapproved: 0, unknown: 0, generated: 0, approved: 12 licenses.
[windows-jdk9] [INFO]
[windows-jdk9] [INFO] --- maven-remote-resources-plugin:1.5:process (process-resource-bundles) @ wagon-webdav-jackrabbit ---
[windows-jdk9] [INFO]
[windows-jdk9] [INFO] --- maven-resources-plugin:3.0.2:resources (default-resources) @ wagon-webdav-jackrabbit ---
[windows-jdk9] [INFO] Using 'UTF-8' encoding to copy filtered resources.
[windows-jdk9] [INFO] Copying 1 resource
[windows-jdk9] [INFO] Copying 3 resources
[windows-jdk9] [INFO]
[windows-jdk9] [INFO] --- maven-compiler-plugin:3.7.0:compile (default-compile) @ wagon-webdav-jackrabbit ---
[windows-jdk9] [INFO] Changes detected - recompiling the module!
[windows-jdk9] [INFO] Compiling 4 source files to F:\jenkins\jenkins-slave\workspace\n-box_maven-wagon_WAGON-528-IMNZXLSWVKGSMF6UG52A7YYKAK332OKWF6U6U6HZJQ3V6WNV7M2A\m\wagon-providers\wagon-webdav-jackrabbit\target\classes
[windows-jdk9] [INFO] /F:/jenkins/jenkins-slave/workspace/n-box_maven-wagon_WAGON-528-IMNZXLSWVKGSMF6UG52A7YYKAK332OKWF6U6U6HZJQ3V6WNV7M2A/m/wagon-providers/wagon-webdav-jackrabbit/src/main/java/org/apache/maven/wagon/providers/webdav/WebDavWagon.java: F:\jenkins\jenkins-slave\workspace\n-box_maven-wagon_WAGON-528-IMNZXLSWVKGSMF6UG52A7YYKAK332OKWF6U6U6HZJQ3V6WNV7M2A\m\wagon-providers\wagon-webdav-jackrabbit\src\main\java\org\apache\maven\wagon\providers\webdav\WebDavWagon.java uses or overrides a deprecated API.
[windows-jdk9] [INFO] /F:/jenkins/jenkins-slave/workspace/n-box_maven-wagon_WAGON-528-IMNZXLSWVKGSMF6UG52A7YYKAK332OKWF6U6U6HZJQ3V6WNV7M2A/m/wagon-providers/wagon-webdav-jackrabbit/src/main/java/org/apache/maven/wagon/providers/webdav/WebDavWagon.java: Recompile with -Xlint:deprecation for details.
[windows-jdk9] [INFO]
[windows-jdk9] [INFO] --- plexus-component-metadata:1.7.1:generate-metadata (generate) @ wagon-webdav-jackrabbit ---
[windows-jdk9] [INFO] Discovered 1 component descriptors(s)
[windows-jdk9] [INFO]
[windows-jdk9] [INFO] --- animal-sniffer-maven-plugin:1.15:check (check-java-1.7-compat) @ wagon-webdav-jackrabbit ---
[windows-jdk9] [INFO] Checking unresolved references to org.codehaus.mojo.signature:java17:1.0
[windows-jdk9] [INFO]
[windows-jdk9] [INFO] --- maven-resources-plugin:3.0.2:testResources (default-testResources) @ wagon-webdav-jackrabbit ---
[windows-jdk9] [INFO] Using 'UTF-8' encoding to copy filtered resources.
[windows-jdk9] [INFO] Copying 2 resources
[windows-jdk9] [INFO] Copying 3 resources
[windows-jdk9] [INFO]
[windows-jdk9] [INFO] --- maven-compiler-plugin:3.7.0:testCompile (default-testCompile) @ wagon-webdav-jackrabbit ---
[windows-jdk9] [INFO] Changes detected - recompiling the module!
[windows-jdk9] [INFO] Compiling 4 source files to F:\jenkins\jenkins-slave\workspace\n-box_maven-wagon_WAGON-528-IMNZXLSWVKGSMF6UG52A7YYKAK332OKWF6U6U6HZJQ3V6WNV7M2A\m\wagon-providers\wagon-webdav-jackrabbit\target\test-classes
[windows-jdk9] [INFO] /F:/jenkins/jenkins-slave/workspace/n-box_maven-wagon_WAGON-528-IMNZXLSWVKGSMF6UG52A7YYKAK332OKWF6U6U6HZJQ3V6WNV7M2A/m/wagon-providers/wagon-webdav-jackrabbit/src/test/java/org/apache/maven/wagon/providers/webdav/HttpClientWagonTest.java: F:\jenkins\jenkins-slave\workspace\n-box_maven-wagon_WAGON-528-IMNZXLSWVKGSMF6UG52A7YYKAK332OKWF6U6U6HZJQ3V6WNV7M2A\m\wagon-providers\wagon-webdav-jackrabbit\src\test\java\org\apache\maven\wagon\providers\webdav\HttpClientWagonTest.java uses or overrides a deprecated API.
[windows-jdk9] [INFO] /F:/jenkins/jenkins-slave/workspace/n-box_maven-wagon_WAGON-528-IMNZXLSWVKGSMF6UG52A7YYKAK332OKWF6U6U6HZJQ3V6WNV7M2A/m/wagon-providers/wagon-webdav-jackrabbit/src/test/java/org/apache/maven/wagon/providers/webdav/HttpClientWagonTest.java: Recompile with -Xlint:deprecation for details.
[windows-jdk9] [INFO]
[windows-jdk9] [INFO] --- maven-surefire-plugin:2.20:test (default-test) @ wagon-webdav-jackrabbit ---
[windows-jdk9] [INFO]
[windows-jdk9] [INFO] -------------------------------------------------------
[windows-jdk9] [INFO]  T E S T S
[windows-jdk9] [INFO] -------------------------------------------------------
[windows-jdk9] [INFO] Running org.apache.maven.wagon.providers.webdav.HttpClientWagonTest
[windows-jdk9] [INFO] Tests run: 6, Failures: 0, Errors: 0, Skipped: 0, Time elapsed: 0.694 s - in org.apache.maven.wagon.providers.webdav.HttpClientWagonTest
[windows-jdk9] [INFO] Running org.apache.maven.wagon.providers.webdav.PathNavigatorTest
[windows-jdk9] [INFO] Tests run: 1, Failures: 0, Errors: 0, Skipped: 0, Time elapsed: 0 s - in org.apache.maven.wagon.providers.webdav.PathNavigatorTest
[windows-jdk9] [INFO] Running org.apache.maven.wagon.providers.webdav.WebDavsWagonTest
[windows-jdk9] [INFO] Tests run: 69, Failures: 0, Errors: 0, Skipped: 0, Time elapsed: 31.479 s - in org.apache.maven.wagon.providers.webdav.WebDavsWagonTest
[windows-jdk9] [INFO] Running org.apache.maven.wagon.providers.webdav.WebDavWagonTest
[windows-jdk9] [INFO] Tests run: 69, Failures: 0, Errors: 0, Skipped: 0, Time elapsed: 26.137 s - in org.apache.maven.wagon.providers.webdav.WebDavWagonTest
[windows-jdk9] [INFO]
[windows-jdk9] [INFO] Results:
[windows-jdk9] [INFO]
[windows-jdk9] [INFO] Tests run: 145, Failures: 0, Errors: 0, Skipped: 0
[windows-jdk9] [INFO]
[windows-jdk9] [INFO]
[windows-jdk9] [INFO] --- maven-jar-plugin:3.0.2:jar (default-jar) @ wagon-webdav-jackrabbit ---
[windows-jdk9] [INFO] Building jar: F:\jenkins\jenkins-slave\workspace\n-box_maven-wagon_WAGON-528-IMNZXLSWVKGSMF6UG52A7YYKAK332OKWF6U6U6HZJQ3V6WNV7M2A\m\wagon-providers\wagon-webdav-jackrabbit\target\wagon-webdav-jackrabbit-3.1.1-SNAPSHOT.jar
[windows-jdk9] [INFO]
[windows-jdk9] [INFO] --- maven-site-plugin:3.7:attach-descriptor (attach-descriptor) @ wagon-webdav-jackrabbit ---
[windows-jdk9] [INFO] Skipping because packaging 'jar' is not pom.
[windows-jdk9] [INFO]
[windows-jdk9] [INFO] --- maven-checkstyle-plugin:3.0.0:check (checkstyle-check) @ wagon-webdav-jackrabbit ---
[windows-jdk9] [INFO] ------------------------------------------------------------------------
[windows-jdk9] [INFO] Reactor Summary:
[windows-jdk9] [INFO]
[windows-jdk9] [INFO] Apache Maven Wagon ................................. SUCCESS [ 16.898 s]
[windows-jdk9] [INFO] Apache Maven Wagon :: API .......................... SUCCESS [  9.340 s]
[windows-jdk9] [INFO] Apache Maven Wagon :: Provider Test ................ SUCCESS [  2.856 s]
[windows-jdk9] [INFO] Apache Maven Wagon :: Providers .................... SUCCESS [  0.975 s]
[windows-jdk9] [INFO] Apache Maven Wagon :: Providers :: File Provider ... SUCCESS [  3.117 s]
[windows-jdk9] [INFO] Apache Maven Wagon :: Providers :: FTP Provider .... SUCCESS [  6.131 s]
[windows-jdk9] [INFO] Apache Maven Wagon :: Providers :: HTTP Shared Library SUCCESS [  3.401 s]
[windows-jdk9] [INFO] Apache Maven Wagon :: Test Compatibility Kits ...... SUCCESS [  0.999 s]
[windows-jdk9] [INFO] Apache Maven Wagon :: HTTP Test Compatibility Kit .. SUCCESS [  1.912 s]
[windows-jdk9] [INFO] Apache Maven Wagon :: Providers :: HTTP Provider ... SUCCESS [04:35 min]
[windows-jdk9] [INFO] Apache Maven Wagon :: Providers :: Lightweight HTTP Provider SUCCESS [02:07 min]
[windows-jdk9] [INFO] Apache Maven Wagon :: Providers :: SCM Provider .... SUCCESS [ 16.697 s]
[windows-jdk9] [INFO] Apache Maven Wagon :: Providers :: SSH Common Library SUCCESS [  2.535 s]
[windows-jdk9] [INFO] Apache Maven Wagon :: Providers :: SSH Common Tests  SUCCESS [  1.922 s]
[windows-jdk9] [INFO] Apache Maven Wagon :: Providers :: SSH External Provider SUCCESS [  1.254 s]
[windows-jdk9] [INFO] Apache Maven Wagon :: Providers :: SSH Provider .... SUCCESS [  2.204 s]
[windows-jdk9] [INFO] Apache Maven Wagon :: Providers :: WebDAV Provider . SUCCESS [01:01 min]
[windows-jdk9] [INFO] ------------------------------------------------------------------------
[windows-jdk9] [INFO] BUILD SUCCESS
[windows-jdk9] [INFO] ------------------------------------------------------------------------
[windows-jdk9] [INFO] Total time: 08:56 min
[windows-jdk9] [INFO] Finished at: 2018-09-13T17:52:22Z
[windows-jdk9] [INFO] Final Memory: 47M/157M
[windows-jdk9] [INFO] ------------------------------------------------------------------------
[windows-jdk9] [WARNING] The requested profile "run-its" could not be activated because it does not exist.
[windows-jdk9] [INFO] [jenkins-event-spy] Generated F:\jenkins\jenkins-slave\workspace\n-box_maven-wagon_WAGON-528-IMNZXLSWVKGSMF6UG52A7YYKAK332OKWF6U6U6HZJQ3V6WNV7M2A@tmp\withMaven73bfcb8a\maven-spy-20180913-174324-9423340834493525977583.log
[Pipeline] [windows-jdk9] }
[Pipeline] [windows-jdk9] // dir
[Pipeline] [windows-jdk9] }
[windows-jdk9] [withMaven] junitPublisher - Archive test results for Maven artifact org.apache.maven.wagon:wagon-provider-api:3.1.1-SNAPSHOT generated by maven-surefire-plugin:test (default-test): m\wagon-provider-api\target\surefire-reports\*.xml
[windows-jdk9] Recording test results
[windows-jdk9] [withMaven] junitPublisher - Archive test results for Maven artifact org.apache.maven.wagon:wagon-provider-test:3.1.1-SNAPSHOT generated by maven-surefire-plugin:test (default-test): m\wagon-provider-test\target\surefire-reports\*.xml
[windows-jdk9] Recording test results
[windows-jdk9] None of the test reports contained any result
[windows-jdk9] [withMaven] junitPublisher - Archive test results for Maven artifact org.apache.maven.wagon:wagon-file:3.1.1-SNAPSHOT generated by maven-surefire-plugin:test (default-test): m\wagon-providers\wagon-file\target\surefire-reports\*.xml
[windows-jdk9] Recording test results
[windows-jdk9] [withMaven] junitPublisher - Archive test results for Maven artifact org.apache.maven.wagon:wagon-ftp:3.1.1-SNAPSHOT generated by maven-surefire-plugin:test (default-test): m\wagon-providers\wagon-ftp\target\surefire-reports\*.xml
[windows-jdk9] Recording test results
[windows-jdk9] [withMaven] junitPublisher - Archive test results for Maven artifact org.apache.maven.wagon:wagon-http-shared:3.1.1-SNAPSHOT generated by maven-surefire-plugin:test (default-test): m\wagon-providers\wagon-http-shared\target\surefire-reports\*.xml
[windows-jdk9] Recording test results
[windows-jdk9] [withMaven] junitPublisher - Archive test results for Maven artifact org.apache.maven.wagon:wagon-tck-http:3.1.1-SNAPSHOT generated by maven-surefire-plugin:test (default-test): m\wagon-tcks\wagon-tck-http\target\surefire-reports\*.xml
[windows-jdk9] Recording test results
[windows-jdk9] None of the test reports contained any result
[windows-jdk9] [withMaven] junitPublisher - Archive test results for Maven artifact org.apache.maven.wagon:wagon-http:3.1.1-SNAPSHOT generated by maven-surefire-plugin:test (default-test): m\wagon-providers\wagon-http\target\surefire-reports\*.xml
[windows-jdk9] Recording test results
[windows-jdk9] [withMaven] junitPublisher - Archive test results for Maven artifact org.apache.maven.wagon:wagon-http-lightweight:3.1.1-SNAPSHOT generated by maven-surefire-plugin:test (default-test): m\wagon-providers\wagon-http-lightweight\target\surefire-reports\*.xml
[windows-jdk9] Recording test results
[windows-jdk9] [withMaven] junitPublisher - Archive test results for Maven artifact org.apache.maven.wagon:wagon-scm:3.1.1-SNAPSHOT generated by maven-surefire-plugin:test (default-test): m\wagon-providers\wagon-scm\target\surefire-reports\*.xml
[windows-jdk9] Recording test results
[windows-jdk9] [withMaven] junitPublisher - Archive test results for Maven artifact org.apache.maven.wagon:wagon-ssh-common:3.1.1-SNAPSHOT generated by maven-surefire-plugin:test (default-test): m\wagon-providers\wagon-ssh-common\target\surefire-reports\*.xml
[windows-jdk9] Recording test results
[windows-jdk9] [withMaven] junitPublisher - Archive test results for Maven artifact org.apache.maven.wagon:wagon-ssh-common-test:3.1.1-SNAPSHOT generated by maven-surefire-plugin:test (default-test): m\wagon-providers\wagon-ssh-common-test\target\surefire-reports\*.xml
[windows-jdk9] Recording test results
[windows-jdk9] None of the test reports contained any result
[windows-jdk9] [withMaven] junitPublisher - Archive test results for Maven artifact org.apache.maven.wagon:wagon-ssh-external:3.1.1-SNAPSHOT generated by maven-surefire-plugin:test (default-test): m\wagon-providers\wagon-ssh-external\target\surefire-reports\*.xml
[windows-jdk9] Recording test results
[windows-jdk9] None of the test reports contained any result
[windows-jdk9] [withMaven] junitPublisher - Archive test results for Maven artifact org.apache.maven.wagon:wagon-ssh:3.1.1-SNAPSHOT generated by maven-surefire-plugin:test (default-test): m\wagon-providers\wagon-ssh\target\surefire-reports\*.xml
[windows-jdk9] Recording test results
[windows-jdk9] None of the test reports contained any result
[windows-jdk9] [withMaven] junitPublisher - Archive test results for Maven artifact org.apache.maven.wagon:wagon-webdav-jackrabbit:3.1.1-SNAPSHOT generated by maven-surefire-plugin:test (default-test): m\wagon-providers\wagon-webdav-jackrabbit\target\surefire-reports\*.xml
[windows-jdk9] Recording test results
[Pipeline] [windows-jdk9] // withMaven
[Pipeline] [windows-jdk9] cleanWs
[windows-jdk9] [WS-CLEANUP] Deleting project workspace...[WS-CLEANUP] done
[Pipeline] [windows-jdk9] }
[Pipeline] [windows-jdk9] // stage
[Pipeline] [windows-jdk9] }
[Pipeline] [windows-jdk9] // node
[Pipeline] [windows-jdk9] }
[Pipeline] // parallel
[Pipeline] stage
[Pipeline] { (Notifications)
[Pipeline] echo
Build result: FAILURE
[Pipeline] jiraIssueSelector
[Pipeline] emailext
Reply | Threaded
Open this post in threaded view
|

Build failed in Jenkins: Maven TLP » maven-wagon » WAGON-528 #5

Apache Jenkins Server-2
See https://builds.apache.org/job/maven-box/job/maven-wagon/job/WAGON-528/5/

Changes:

* Exclude H25
* Exclude H31 cause master is failing constantly.
* no need to test anymore with '3.0.x'
* Add Java 11 to defaults
* Try to shorten path for Windows by using tempDir
* Fix arguments
* Add option for temp workspace
* disable tmpWs
* enable tmpWs
* Use def
* Try to shorten wsDir

71 tests failed.
FAILED:  org.apache.maven.wagon.providers.ftp.FtpWagonTest.testPutDirectoryCreation

Error Message:
Failed to bind to address 0.0.0.0/0.0.0.0:10023, check configuration

Stack Trace:
org.apache.ftpserver.FtpServerConfigurationException: Failed to bind to address 0.0.0.0/0.0.0.0:10023, check configuration
        at org.apache.maven.wagon.providers.ftp.FtpWagonTest.setupWagonTestingFixtures(FtpWagonTest.java:106)
        at org.apache.maven.wagon.providers.ftp.FtpWagonTest.testPutDirectoryCreation(FtpWagonTest.java:195)
Caused by: java.net.BindException: Address already in use


FAILED:  org.apache.maven.wagon.providers.ftp.FtpWagonTest.testFailedGetIfNewerToStream

Error Message:
Failed to bind to address 0.0.0.0/0.0.0.0:10023, check configuration

Stack Trace:
org.apache.ftpserver.FtpServerConfigurationException: Failed to bind to address 0.0.0.0/0.0.0.0:10023, check configuration
        at org.apache.maven.wagon.providers.ftp.FtpWagonTest.setupWagonTestingFixtures(FtpWagonTest.java:106)
Caused by: java.net.BindException: Address already in use


FAILED:  org.apache.maven.wagon.providers.ftp.FtpWagonTest.testWagonGetIfNewerToStreamIsNewer

Error Message:
Could not connect to server.

Stack Trace:
org.apache.maven.wagon.authentication.AuthenticationException: Could not connect to server.
Caused by: java.net.ConnectException: Connection refused (Connection refused)


FAILED:  org.apache.maven.wagon.providers.ftp.FtpWagonTest.testWagonGetIfNewerToStreamIsOlder

Error Message:
Could not connect to server.

Stack Trace:
org.apache.maven.wagon.authentication.AuthenticationException: Could not connect to server.
Caused by: java.net.ConnectException: Connection refused (Connection refused)


FAILED:  org.apache.maven.wagon.providers.ftp.FtpWagonTest.testStreamingWagon

Error Message:
Could not connect to server.

Stack Trace:
org.apache.maven.wagon.authentication.AuthenticationException: Could not connect to server.
Caused by: java.net.ConnectException: Connection refused (Connection refused)


FAILED:  org.apache.maven.wagon.providers.ftp.FtpWagonTest.testWagonGetIfNewerToStreamIsSame

Error Message:
Could not connect to server.

Stack Trace:
org.apache.maven.wagon.authentication.AuthenticationException: Could not connect to server.
Caused by: java.net.ConnectException: Connection refused (Connection refused)


FAILED:  org.apache.maven.wagon.providers.ftp.FtpWagonTest.testWagonPutDirectoryDeepDestination

Error Message:
Could not connect to server.

Stack Trace:
org.apache.maven.wagon.authentication.AuthenticationException: Could not connect to server.
Caused by: java.net.ConnectException: Connection refused (Connection refused)


FAILED:  org.apache.maven.wagon.providers.ftp.FtpWagonTest.testWagonGetFileListWhenDirectoryDoesNotExist

Error Message:
Could not connect to server.

Stack Trace:
org.apache.maven.wagon.authentication.AuthenticationException: Could not connect to server.
Caused by: java.net.ConnectException: Connection refused (Connection refused)


FAILED:  org.apache.maven.wagon.providers.ftp.FtpWagonTest.testWagon

Error Message:
Could not connect to server.

Stack Trace:
org.apache.maven.wagon.authentication.AuthenticationException: Could not connect to server.
Caused by: java.net.ConnectException: Connection refused (Connection refused)


FAILED:  org.apache.maven.wagon.providers.ftp.FtpWagonTest.testWagonPutDirectoryForDot

Error Message:
Could not connect to server.

Stack Trace:
org.apache.maven.wagon.authentication.AuthenticationException: Could not connect to server.
Caused by: java.net.ConnectException: Connection refused (Connection refused)


FAILED:  org.apache.maven.wagon.providers.ftp.FtpWagonTest.testWagonGetIfNewerIsNewer

Error Message:
Could not connect to server.

Stack Trace:
org.apache.maven.wagon.authentication.AuthenticationException: Could not connect to server.
Caused by: java.net.ConnectException: Connection refused (Connection refused)


FAILED:  org.apache.maven.wagon.providers.ftp.FtpWagonTest.testWagonGetIfNewerIsOlder

Error Message:
Could not connect to server.

Stack Trace:
org.apache.maven.wagon.authentication.AuthenticationException: Could not connect to server.
Caused by: java.net.ConnectException: Connection refused (Connection refused)


FAILED:  org.apache.maven.wagon.providers.ftp.FtpWagonTest.testWagonGetFileList

Error Message:
Could not connect to server.

Stack Trace:
org.apache.maven.wagon.authentication.AuthenticationException: Could not connect to server.
Caused by: java.net.ConnectException: Connection refused (Connection refused)


FAILED:  org.apache.maven.wagon.providers.ftp.FtpWagonTest.testFailedGet

Error Message:
Could not connect to server.

Stack Trace:
org.apache.maven.wagon.authentication.AuthenticationException: Could not connect to server.
Caused by: java.net.ConnectException: Connection refused (Connection refused)


FAILED:  org.apache.maven.wagon.providers.ftp.FtpWagonTest.testWagonPutDirectoryWhenDirectoryAlreadyExists

Error Message:
Could not connect to server.

Stack Trace:
org.apache.maven.wagon.authentication.AuthenticationException: Could not connect to server.
Caused by: java.net.ConnectException: Connection refused (Connection refused)


FAILED:  org.apache.maven.wagon.providers.ftp.FtpWagonTest.testWagonResourceExists

Error Message:
Could not connect to server.

Stack Trace:
org.apache.maven.wagon.authentication.AuthenticationException: Could not connect to server.
Caused by: java.net.ConnectException: Connection refused (Connection refused)


FAILED:  org.apache.maven.wagon.providers.ftp.FtpWagonTest.testFailedGetIfNewer

Error Message:
Could not connect to server.

Stack Trace:
org.apache.maven.wagon.authentication.AuthenticationException: Could not connect to server.
Caused by: java.net.ConnectException: Connection refused (Connection refused)


FAILED:  org.apache.maven.wagon.providers.ftp.FtpWagonTest.testWagonResourceNotExists

Error Message:
Could not connect to server.

Stack Trace:
org.apache.maven.wagon.authentication.AuthenticationException: Could not connect to server.
Caused by: java.net.ConnectException: Connection refused (Connection refused)


FAILED:  org.apache.maven.wagon.providers.ftp.FtpWagonTest.testWagonPutDirectory

Error Message:
Could not connect to server.

Stack Trace:
org.apache.maven.wagon.authentication.AuthenticationException: Could not connect to server.
Caused by: java.net.ConnectException: Connection refused (Connection refused)


FAILED:  org.apache.maven.wagon.providers.ftp.FtpWagonTest.testWagonGetIfNewerIsSame

Error Message:
Could not connect to server.

Stack Trace:
org.apache.maven.wagon.authentication.AuthenticationException: Could not connect to server.
Caused by: java.net.ConnectException: Connection refused (Connection refused)


FAILED:  org.apache.maven.wagon.providers.ftp.FtpWagonTest.testDefaultUserName

Error Message:
Cannot login to remote system

Stack Trace:
org.apache.maven.wagon.ConnectionException: Cannot login to remote system
        at org.apache.maven.wagon.providers.ftp.FtpWagonTest.testDefaultUserName(FtpWagonTest.java:178)
Caused by: org.apache.commons.net.ftp.FTPConnectionClosedException: Connection closed without indication.
        at org.apache.maven.wagon.providers.ftp.FtpWagonTest.testDefaultUserName(FtpWagonTest.java:178)


FAILED:  org.apache.maven.wagon.providers.ftp.FtpWagonTest.testDefaultUserName

Error Message:
Cannot login to remote system

Stack Trace:
org.apache.maven.wagon.ConnectionException: Cannot login to remote system
        at org.apache.maven.wagon.providers.ftp.FtpWagonTest.testDefaultUserName(FtpWagonTest.java:178)
Caused by: org.apache.commons.net.ftp.FTPConnectionClosedException: Connection closed without indication.
        at org.apache.maven.wagon.providers.ftp.FtpWagonTest.testDefaultUserName(FtpWagonTest.java:178)


FAILED:  org.apache.maven.wagon.providers.ftp.FtpWagonTest.testWagonGetIfNewerIsSame

Error Message:
Failed to bind to address 0.0.0.0/0.0.0.0:10023, check configuration

Stack Trace:
org.apache.ftpserver.FtpServerConfigurationException: Failed to bind to address 0.0.0.0/0.0.0.0:10023, check configuration
        at org.apache.maven.wagon.providers.ftp.FtpWagonTest.setupWagonTestingFixtures(FtpWagonTest.java:106)
Caused by: java.net.BindException: Address already in use: bind


FAILED:  org.apache.maven.wagon.providers.http.HttpWagonTimeoutTest.testConnectionTimeout

Error Message:
Address already in use

Stack Trace:
java.net.BindException: Address already in use
        at org.apache.maven.wagon.providers.http.HttpWagonTimeoutTest.setUp(HttpWagonTimeoutTest.java:45)


FAILED:  org.apache.maven.wagon.providers.http.HttpWagonTimeoutTest.testGetFileList

Error Message:
Address already in use

Stack Trace:
java.net.BindException: Address already in use
        at org.apache.maven.wagon.providers.http.HttpWagonTimeoutTest.setUp(HttpWagonTimeoutTest.java:45)


FAILED:  org.apache.maven.wagon.providers.http.HttpWagonTimeoutTest.testPutTimeout

Error Message:
Address already in use: bind

Stack Trace:
java.net.BindException: Address already in use: bind
        at org.apache.maven.wagon.providers.http.HttpWagonTimeoutTest.setUp(HttpWagonTimeoutTest.java:45)


FAILED:  org.apache.maven.wagon.providers.http.HttpWagonTimeoutTest.testResourceExits

Error Message:
Address already in use: bind

Stack Trace:
java.net.BindException: Address already in use: bind
        at org.apache.maven.wagon.providers.http.HttpWagonTimeoutTest.setUp(HttpWagonTimeoutTest.java:45)


FAILED:  org.apache.maven.wagon.providers.http.HttpWagonTimeoutTest.testGetTimeout

Error Message:
Address already in use: bind

Stack Trace:
java.net.BindException: Address already in use: bind
        at org.apache.maven.wagon.providers.http.HttpWagonTimeoutTest.setUp(HttpWagonTimeoutTest.java:45)


FAILED:  org.apache.maven.wagon.providers.http.HttpWagonTimeoutTest.testConnectionTimeout

Error Message:
Address already in use: bind

Stack Trace:
java.net.BindException: Address already in use: bind
        at org.apache.maven.wagon.providers.http.HttpWagonTimeoutTest.setUp(HttpWagonTimeoutTest.java:45)


FAILED:  org.apache.maven.wagon.providers.http.HttpWagonTimeoutTest.testGetFileList

Error Message:
Address already in use: bind

Stack Trace:
java.net.BindException: Address already in use: bind
        at org.apache.maven.wagon.providers.http.HttpWagonTimeoutTest.setUp(HttpWagonTimeoutTest.java:45)


FAILED:  org.apache.maven.wagon.providers.scm.ScmSvnExeWagonTest.testWagonPutDirectory

Error Message:
Error checking out: command failed: svn: E180001: Unable to connect to a repository at URL 'file://2/m/wagon-providers/wagon-scm/target/test-classes/test-repo-svn-test'
svn: E180001: Unable to open an ra_local session to URL
svn: E180001: Unable to open repository 'file://2/m/wagon-providers/wagon-scm/target/test-classes/test-repo-svn-test'

Stack Trace:
org.apache.maven.wagon.TransferFailedException:
Error checking out: command failed: svn: E180001: Unable to connect to a repository at URL 'file://2/m/wagon-providers/wagon-scm/target/test-classes/test-repo-svn-test'
svn: E180001: Unable to open an ra_local session to URL
svn: E180001: Unable to open repository 'file://2/m/wagon-providers/wagon-scm/target/test-classes/test-repo-svn-test'
Caused by: org.apache.maven.scm.ScmException:
command failed: svn: E180001: Unable to connect to a repository at URL 'file://2/m/wagon-providers/wagon-scm/target/test-classes/test-repo-svn-test'
svn: E180001: Unable to open an ra_local session to URL
svn: E180001: Unable to open repository 'file://2/m/wagon-providers/wagon-scm/target/test-classes/test-repo-svn-test'


FAILED:  org.apache.maven.wagon.providers.scm.ScmSvnExeWagonTest.testWagonPutDirectoryDeepDestination

Error Message:
Error checking out: command failed: svn: E180001: Unable to connect to a repository at URL 'file://2/m/wagon-providers/wagon-scm/target/test-classes/test-repo-svn-test'
svn: E180001: Unable to open an ra_local session to URL
svn: E180001: Unable to open repository 'file://2/m/wagon-providers/wagon-scm/target/test-classes/test-repo-svn-test'

Stack Trace:
org.apache.maven.wagon.TransferFailedException:
Error checking out: command failed: svn: E180001: Unable to connect to a repository at URL 'file://2/m/wagon-providers/wagon-scm/target/test-classes/test-repo-svn-test'
svn: E180001: Unable to open an ra_local session to URL
svn: E180001: Unable to open repository 'file://2/m/wagon-providers/wagon-scm/target/test-classes/test-repo-svn-test'
Caused by: org.apache.maven.scm.ScmException:
command failed: svn: E180001: Unable to connect to a repository at URL 'file://2/m/wagon-providers/wagon-scm/target/test-classes/test-repo-svn-test'
svn: E180001: Unable to open an ra_local session to URL
svn: E180001: Unable to open repository 'file://2/m/wagon-providers/wagon-scm/target/test-classes/test-repo-svn-test'


FAILED:  org.apache.maven.wagon.providers.scm.ScmSvnExeWagonTest.testWagon

Error Message:

  Unexpected method call TransferListener.transferError(TransferEvent[GET|ERROR|Repository[scm:svn:file://2/m/wagon-providers/wagon-scm/target/test-classes/test-repo-svn-test]|null|test-resource[len = 18; mod = 1539193917327]]):
    TransferListener.transferCompleted(TransferEvent[PUT|COMPLETED|Repository[scm:svn:file://2/m/wagon-providers/wagon-scm/target/test-classes/test-repo-svn-test]|F:\jenkins\jenkins-slave\workspace\n-box_maven-wagon_WAGON-528-IMNZXLSWVKGSMF6UG52A7YYKAK332OKWF6U6U6HZJQ3V6WNV7M2A@2\m\wagon-providers\wagon-scm\target\test-output\test-resource|test-resource[len = 18; mod = 1539193917327]]): expected: 1, actual: 0

Stack Trace:
java.lang.AssertionError:

  Unexpected method call TransferListener.transferError(TransferEvent[GET|ERROR|Repository[scm:svn:file://2/m/wagon-providers/wagon-scm/target/test-classes/test-repo-svn-test]|null|test-resource[len = 18; mod = 1539193917327]]):
    TransferListener.transferCompleted(TransferEvent[PUT|COMPLETED|Repository[scm:svn:file://2/m/wagon-providers/wagon-scm/target/test-classes/test-repo-svn-test]|F:\jenkins\jenkins-slave\workspace\n-box_maven-wagon_WAGON-528-IMNZXLSWVKGSMF6UG52A7YYKAK332OKWF6U6U6HZJQ3V6WNV7M2A@2\m\wagon-providers\wagon-scm\target\test-output\test-resource|test-resource[len = 18; mod = 1539193917327]]): expected: 1, actual: 0


FAILED:  org.apache.maven.wagon.providers.scm.ScmSvnExeWagonTest.testWagonPutDirectoryForDot

Error Message:
Error checking out: command failed: svn: E180001: Unable to connect to a repository at URL 'file://2/m/wagon-providers/wagon-scm/target/test-classes/test-repo-svn-test'
svn: E180001: Unable to open an ra_local session to URL
svn: E180001: Unable to open repository 'file://2/m/wagon-providers/wagon-scm/target/test-classes/test-repo-svn-test'

Stack Trace:
org.apache.maven.wagon.TransferFailedException:
Error checking out: command failed: svn: E180001: Unable to connect to a repository at URL 'file://2/m/wagon-providers/wagon-scm/target/test-classes/test-repo-svn-test'
svn: E180001: Unable to open an ra_local session to URL
svn: E180001: Unable to open repository 'file://2/m/wagon-providers/wagon-scm/target/test-classes/test-repo-svn-test'
Caused by: org.apache.maven.scm.ScmException:
command failed: svn: E180001: Unable to connect to a repository at URL 'file://2/m/wagon-providers/wagon-scm/target/test-classes/test-repo-svn-test'
svn: E180001: Unable to open an ra_local session to URL
svn: E180001: Unable to open repository 'file://2/m/wagon-providers/wagon-scm/target/test-classes/test-repo-svn-test'


FAILED:  org.apache.maven.wagon.providers.scm.ScmSvnExeWagonTest.testWagonGetFileList

Error Message:

  Unexpected method call TransferListener.transferError(TransferEvent[GET|ERROR|Repository[scm:svn:file://2/m/wagon-providers/wagon-scm/target/test-classes/test-repo-svn-test]|null|file-list/test-resource.txt[len = 18; mod = 1539193917657]]):
    TransferListener.transferCompleted(TransferEvent[PUT|COMPLETED|Repository[scm:svn:file://2/m/wagon-providers/wagon-scm/target/test-classes/test-repo-svn-test]|F:\jenkins\jenkins-slave\workspace\n-box_maven-wagon_WAGON-528-IMNZXLSWVKGSMF6UG52A7YYKAK332OKWF6U6U6HZJQ3V6WNV7M2A@2\m\wagon-providers\wagon-scm\target\test-output\file-list\test-resource.txt|file-list/test-resource.txt[len = 18; mod = 1539193917657]]): expected: 1, actual: 0

Stack Trace:
java.lang.AssertionError:

  Unexpected method call TransferListener.transferError(TransferEvent[GET|ERROR|Repository[scm:svn:file://2/m/wagon-providers/wagon-scm/target/test-classes/test-repo-svn-test]|null|file-list/test-resource.txt[len = 18; mod = 1539193917657]]):
    TransferListener.transferCompleted(TransferEvent[PUT|COMPLETED|Repository[scm:svn:file://2/m/wagon-providers/wagon-scm/target/test-classes/test-repo-svn-test]|F:\jenkins\jenkins-slave\workspace\n-box_maven-wagon_WAGON-528-IMNZXLSWVKGSMF6UG52A7YYKAK332OKWF6U6U6HZJQ3V6WNV7M2A@2\m\wagon-providers\wagon-scm\target\test-output\file-list\test-resource.txt|file-list/test-resource.txt[len = 18; mod = 1539193917657]]): expected: 1, actual: 0


FAILED:  org.apache.maven.wagon.providers.scm.ScmSvnExeWagonTest.testFailedGet

Error Message:
Error getting file from SCM

Stack Trace:
org.apache.maven.wagon.TransferFailedException: Error getting file from SCM
Caused by: org.apache.maven.scm.ScmException:
command failed: svn: E180001: Unable to connect to a repository at URL 'file://2/m/wagon-providers/wagon-scm/target/test-classes/test-repo-svn-test'
svn: E180001: Unable to open an ra_local session to URL
svn: E180001: Unable to open repository 'file://2/m/wagon-providers/wagon-scm/target/test-classes/test-repo-svn-test'


FAILED:  org.apache.maven.wagon.providers.scm.ScmSvnExeWagonTest.testWagonPutDirectoryWhenDirectoryAlreadyExists

Error Message:
Error checking out: command failed: svn: E180001: Unable to connect to a repository at URL 'file://2/m/wagon-providers/wagon-scm/target/test-classes/test-repo-svn-test'
svn: E180001: Unable to open an ra_local session to URL
svn: E180001: Unable to open repository 'file://2/m/wagon-providers/wagon-scm/target/test-classes/test-repo-svn-test'

Stack Trace:
org.apache.maven.wagon.TransferFailedException:
Error checking out: command failed: svn: E180001: Unable to connect to a repository at URL 'file://2/m/wagon-providers/wagon-scm/target/test-classes/test-repo-svn-test'
svn: E180001: Unable to open an ra_local session to URL
svn: E180001: Unable to open repository 'file://2/m/wagon-providers/wagon-scm/target/test-classes/test-repo-svn-test'
Caused by: org.apache.maven.scm.ScmException:
command failed: svn: E180001: Unable to connect to a repository at URL 'file://2/m/wagon-providers/wagon-scm/target/test-classes/test-repo-svn-test'
svn: E180001: Unable to open an ra_local session to URL
svn: E180001: Unable to open repository 'file://2/m/wagon-providers/wagon-scm/target/test-classes/test-repo-svn-test'


FAILED:  org.apache.maven.wagon.providers.scm.ScmSvnExeWagonTest.testWagonResourceExists

Error Message:

  Unexpected method call TransferListener.transferError(TransferEvent[GET|ERROR|Repository[scm:svn:file://2/m/wagon-providers/wagon-scm/target/test-classes/test-repo-svn-test]|null|test-resource[len = 18; mod = 1539193918002]]):
    TransferListener.transferCompleted(TransferEvent[PUT|COMPLETED|Repository[scm:svn:file://2/m/wagon-providers/wagon-scm/target/test-classes/test-repo-svn-test]|F:\jenkins\jenkins-slave\workspace\n-box_maven-wagon_WAGON-528-IMNZXLSWVKGSMF6UG52A7YYKAK332OKWF6U6U6HZJQ3V6WNV7M2A@2\m\wagon-providers\wagon-scm\target\test-output\test-resource|test-resource[len = 18; mod = 1539193918002]]): expected: 1, actual: 0

Stack Trace:
java.lang.AssertionError:

  Unexpected method call TransferListener.transferError(TransferEvent[GET|ERROR|Repository[scm:svn:file://2/m/wagon-providers/wagon-scm/target/test-classes/test-repo-svn-test]|null|test-resource[len = 18; mod = 1539193918002]]):
    TransferListener.transferCompleted(TransferEvent[PUT|COMPLETED|Repository[scm:svn:file://2/m/wagon-providers/wagon-scm/target/test-classes/test-repo-svn-test]|F:\jenkins\jenkins-slave\workspace\n-box_maven-wagon_WAGON-528-IMNZXLSWVKGSMF6UG52A7YYKAK332OKWF6U6U6HZJQ3V6WNV7M2A@2\m\wagon-providers\wagon-scm\target\test-output\test-resource|test-resource[len = 18; mod = 1539193918002]]): expected: 1, actual: 0


FAILED:  org.apache.maven.wagon.providers.scm.ScmGitExeWagonTest.testFailedGet

Error Message:
Error getting file from SCM

Stack Trace:
org.apache.maven.wagon.TransferFailedException: Error getting file from SCM
Caused by: org.apache.maven.scm.ScmException:
command failed: Cloning into 'F:********@2\m\wagon-providers\wagon-scm\target\test-output\checkout-org.apache.maven.scm.provider.git.gitexe.GitExeScmProvider'...
fatal: '//2/m/wagon-providers/wagon-scm/target/test-classes/test-repo-git-test/' does not appear to be a git repository
fatal: Could not read from remote repository.

Please make sure you have the correct access rights
and the repository exists.


FAILED:  org.apache.maven.wagon.providers.scm.ScmGitExeWagonTest.testFailedGet

Error Message:
Error getting file from SCM

Stack Trace:
org.apache.maven.wagon.TransferFailedException: Error getting file from SCM
Caused by: org.apache.maven.scm.ScmException:
command failed: Cloning into 'F:\jenkins\jenkins-slave\workspace\n-box_maven-wagon_WAGON-528-IMNZXLSWVKGSMF6UG52A7YYKAK332OKWF6U6U6HZJQ3V6WNV7M2A\m\wagon-providers\wagon-scm\target\test-output\checkout-org.apache.maven.scm.provider.git.gitexe.GitExeScmProvider'...
fatal: '$GIT_DIR' too big
fatal: index-pack failed


FAILED:  org.apache.maven.wagon.providers.scm.ScmGitExeWagonTest.testFailedGet

Error Message:
Error getting file from SCM

Stack Trace:
org.apache.maven.wagon.TransferFailedException: Error getting file from SCM
Caused by: org.apache.maven.scm.ScmException:
command failed: Cloning into 'F:\jenkins\jenkins-slave\workspace\n-box_maven-wagon_WAGON-528-IMNZXLSWVKGSMF6UG52A7YYKAK332OKWF6U6U6HZJQ3V6WNV7M2A\m\wagon-providers\wagon-scm\target\test-output\checkout-org.apache.maven.scm.provider.git.gitexe.GitExeScmProvider'...
fatal: '$GIT_DIR' too big
fatal: index-pack failed


FAILED:  org.apache.maven.wagon.providers.scm.ScmGitExeWagonTest.testWagonPutDirectory

Error Message:
Error interacting with SCM: Unable to commit file. The git-commit command failed.
*** Please tell me who you are.

Run

  git config --global user.email "[hidden email]"
  git config --global user.name "Your Name"

to set your account's default identity.
Omit --global to set the identity only in this repository.

fatal:********@asf928.gq1.ygridcore.net>) not allowed


Stack Trace:
org.apache.maven.wagon.TransferFailedException:
Error interacting with SCM: Unable to commit file. The git-commit command failed.
*** Please tell me who you are.

Run

  git config --global user.email "[hidden email]"
  git config --global user.name "Your Name"

to set your account's default identity.
Omit --global to set the identity only in this repository.

fatal:********@asf928.gq1.ygridcore.net>) not allowed

Caused by: org.apache.maven.scm.ScmException:
Unable to commit file. The git-commit command failed.
*** Please tell me who you are.

Run

  git config --global user.email "[hidden email]"
  git config --global user.name "Your Name"

to set your account's default identity.
Omit --global to set the identity only in this repository.

fatal:********@asf928.gq1.ygridcore.net>) not allowed



FAILED:  org.apache.maven.wagon.providers.scm.ScmGitExeWagonTest.testWagonPutDirectoryDeepDestination

Error Message:
Error interacting with SCM: Unable to commit file. The git-commit command failed.
*** Please tell me who you are.

Run

  git config --global user.email "[hidden email]"
  git config --global user.name "Your Name"

to set your account's default identity.
Omit --global to set the identity only in this repository.

fatal:********@asf928.gq1.ygridcore.net>) not allowed


Stack Trace:
org.apache.maven.wagon.TransferFailedException:
Error interacting with SCM: Unable to commit file. The git-commit command failed.
*** Please tell me who you are.

Run

  git config --global user.email "[hidden email]"
  git config --global user.name "Your Name"

to set your account's default identity.
Omit --global to set the identity only in this repository.

fatal:********@asf928.gq1.ygridcore.net>) not allowed

Caused by: org.apache.maven.scm.ScmException:
Unable to commit file. The git-commit command failed.
*** Please tell me who you are.

Run

  git config --global user.email "[hidden email]"
  git config --global user.name "Your Name"

to set your account's default identity.
Omit --global to set the identity only in this repository.

fatal:********@asf928.gq1.ygridcore.net>) not allowed



FAILED:  org.apache.maven.wagon.providers.scm.ScmGitExeWagonTest.testWagon

Error Message:

  Unexpected method call TransferListener.transferError(TransferEvent[PUT|ERROR|Repository[scm:git:file:///home/jenkins/jenkins-slave/workspace/n-box_maven-wagon_WAGON-528-IMNZXLSWVKGSMF6UG52A7YYKAK332OKWF6U6U6HZJQ3V6WNV7M2A/m/wagon-providers/wagon-scm/target/test-classes/test-repo-git-test/]|null|test-resource[len = 18; mod = 1539193391000]]):
    TransferListener.transferCompleted(TransferEvent[PUT|COMPLETED|Repository[scm:git:file:///home/jenkins/jenkins-slave/workspace/n-box_maven-wagon_WAGON-528-IMNZXLSWVKGSMF6UG52A7YYKAK332OKWF6U6U6HZJQ3V6WNV7M2A/m/wagon-providers/wagon-scm/target/test-classes/test-repo-git-test/]|/home/jenkins/jenkins-slave/workspace/n-box_maven-wagon_WAGON-528-IMNZXLSWVKGSMF6UG52A7YYKAK332OKWF6U6U6HZJQ3V6WNV7M2A/m/wagon-providers/wagon-scm/target/test-output/test-resource|test-resource[len = 18; mod = 1539193391000]]): expected: 1, actual: 0

Stack Trace:
java.lang.AssertionError:

  Unexpected method call TransferListener.transferError(TransferEvent[PUT|ERROR|Repository[scm:git:file:///home/jenkins/jenkins-slave/workspace/n-box_maven-wagon_WAGON-528-IMNZXLSWVKGSMF6UG52A7YYKAK332OKWF6U6U6HZJQ3V6WNV7M2A/m/wagon-providers/wagon-scm/target/test-classes/test-repo-git-test/]|null|test-resource[len = 18; mod = 1539193391000]]):
    TransferListener.transferCompleted(TransferEvent[PUT|COMPLETED|Repository[scm:git:file:///home/jenkins/jenkins-slave/workspace/n-box_maven-wagon_WAGON-528-IMNZXLSWVKGSMF6UG52A7YYKAK332OKWF6U6U6HZJQ3V6WNV7M2A/m/wagon-providers/wagon-scm/target/test-classes/test-repo-git-test/]|/home/jenkins/jenkins-slave/workspace/n-box_maven-wagon_WAGON-528-IMNZXLSWVKGSMF6UG52A7YYKAK332OKWF6U6U6HZJQ3V6WNV7M2A/m/wagon-providers/wagon-scm/target/test-output/test-resource|test-resource[len = 18; mod = 1539193391000]]): expected: 1, actual: 0


FAILED:  org.apache.maven.wagon.providers.scm.ScmGitExeWagonTest.testWagonPutDirectoryForDot

Error Message:
Error interacting with SCM: Unable to commit file. The git-commit command failed.
*** Please tell me who you are.

Run

  git config --global user.email "[hidden email]"
  git config --global user.name "Your Name"

to set your account's default identity.
Omit --global to set the identity only in this repository.

fatal:********@asf928.gq1.ygridcore.net>) not allowed


Stack Trace:
org.apache.maven.wagon.TransferFailedException:
Error interacting with SCM: Unable to commit file. The git-commit command failed.
*** Please tell me who you are.

Run

  git config --global user.email "[hidden email]"
  git config --global user.name "Your Name"

to set your account's default identity.
Omit --global to set the identity only in this repository.

fatal:********@asf928.gq1.ygridcore.net>) not allowed

Caused by: org.apache.maven.scm.ScmException:
Unable to commit file. The git-commit command failed.
*** Please tell me who you are.

Run

  git config --global user.email "[hidden email]"
  git config --global user.name "Your Name"

to set your account's default identity.
Omit --global to set the identity only in this repository.

fatal:********@asf928.gq1.ygridcore.net>) not allowed



FAILED:  org.apache.maven.wagon.providers.scm.ScmGitExeWagonTest.testWagonPutDirectoryWhenDirectoryAlreadyExists

Error Message:
Error interacting with SCM: Unable to commit file. The git-commit command failed.
*** Please tell me who you are.

Run

  git config --global user.email "[hidden email]"
  git config --global user.name "Your Name"

to set your account's default identity.
Omit --global to set the identity only in this repository.

fatal:********@asf928.gq1.ygridcore.net>) not allowed


Stack Trace:
org.apache.maven.wagon.TransferFailedException:
Error interacting with SCM: Unable to commit file. The git-commit command failed.
*** Please tell me who you are.

Run

  git config --global user.email "[hidden email]"
  git config --global user.name "Your Name"

to set your account's default identity.
Omit --global to set the identity only in this repository.

fatal:********@asf928.gq1.ygridcore.net>) not allowed

Caused by: org.apache.maven.scm.ScmException:
Unable to commit file. The git-commit command failed.
*** Please tell me who you are.

Run

  git config --global user.email "[hidden email]"
  git config --global user.name "Your Name"

to set your account's default identity.
Omit --global to set the identity only in this repository.

fatal:********@asf928.gq1.ygridcore.net>) not allowed



FAILED:  org.apache.maven.wagon.providers.scm.ScmGitExeWagonTest.testWagonPutDirectory

Error Message:
Error interacting with SCM: Unable to commit file. The git-commit command failed.
*** Please tell me who you are.

Run

  git config --global user.email "[hidden email]"
  git config --global user.name "Your Name"

to set your account's default identity.
Omit --global to set the identity only in this repository.

fatal:********@asf929.gq1.ygridcore.net>) not allowed


Stack Trace:
org.apache.maven.wagon.TransferFailedException:
Error interacting with SCM: Unable to commit file. The git-commit command failed.
*** Please tell me who you are.

Run

  git config --global user.email "[hidden email]"
  git config --global user.name "Your Name"

to set your account's default identity.
Omit --global to set the identity only in this repository.

fatal:********@asf929.gq1.ygridcore.net>) not allowed

Caused by: org.apache.maven.scm.ScmException:
Unable to commit file. The git-commit command failed.
*** Please tell me who you are.

Run

  git config --global user.email "[hidden email]"
  git config --global user.name "Your Name"

to set your account's default identity.
Omit --global to set the identity only in this repository.

fatal:********@asf929.gq1.ygridcore.net>) not allowed



FAILED:  org.apache.maven.wagon.providers.scm.ScmGitExeWagonTest.testWagonPutDirectoryDeepDestination

Error Message:
Error interacting with SCM: Unable to commit file. The git-commit command failed.
*** Please tell me who you are.

Run

  git config --global user.email "[hidden email]"
  git config --global user.name "Your Name"

to set your account's default identity.
Omit --global to set the identity only in this repository.

fatal:********@asf929.gq1.ygridcore.net>) not allowed


Stack Trace:
org.apache.maven.wagon.TransferFailedException:
Error interacting with SCM: Unable to commit file. The git-commit command failed.
*** Please tell me who you are.

Run

  git config --global user.email "[hidden email]"
  git config --global user.name "Your Name"

to set your account's default identity.
Omit --global to set the identity only in this repository.

fatal:********@asf929.gq1.ygridcore.net>) not allowed

Caused by: org.apache.maven.scm.ScmException:
Unable to commit file. The git-commit command failed.
*** Please tell me who you are.

Run

  git config --global user.email "[hidden email]"
  git config --global user.name "Your Name"

to set your account's default identity.
Omit --global to set the identity only in this repository.

fatal:********@asf929.gq1.ygridcore.net>) not allowed



FAILED:  org.apache.maven.wagon.providers.scm.ScmGitExeWagonTest.testWagon

Error Message:

  Unexpected method call TransferListener.transferError(TransferEvent[PUT|ERROR|Repository[scm:git:file:///home/jenkins/jenkins-slave/workspace/n-box_maven-wagon_WAGON-528-IMNZXLSWVKGSMF6UG52A7YYKAK332OKWF6U6U6HZJQ3V6WNV7M2A/m/wagon-providers/wagon-scm/target/test-classes/test-repo-git-test/]|null|test-resource[len = 18; mod = 1539193408000]]):
    TransferListener.transferCompleted(TransferEvent[PUT|COMPLETED|Repository[scm:git:file:///home/jenkins/jenkins-slave/workspace/n-box_maven-wagon_WAGON-528-IMNZXLSWVKGSMF6UG52A7YYKAK332OKWF6U6U6HZJQ3V6WNV7M2A/m/wagon-providers/wagon-scm/target/test-classes/test-repo-git-test/]|/home/jenkins/jenkins-slave/workspace/n-box_maven-wagon_WAGON-528-IMNZXLSWVKGSMF6UG52A7YYKAK332OKWF6U6U6HZJQ3V6WNV7M2A/m/wagon-providers/wagon-scm/target/test-output/test-resource|test-resource[len = 18; mod = 1539193408000]]): expected: 1, actual: 0

Stack Trace:
java.lang.AssertionError:

  Unexpected method call TransferListener.transferError(TransferEvent[PUT|ERROR|Repository[scm:git:file:///home/jenkins/jenkins-slave/workspace/n-box_maven-wagon_WAGON-528-IMNZXLSWVKGSMF6UG52A7YYKAK332OKWF6U6U6HZJQ3V6WNV7M2A/m/wagon-providers/wagon-scm/target/test-classes/test-repo-git-test/]|null|test-resource[len = 18; mod = 1539193408000]]):
    TransferListener.transferCompleted(TransferEvent[PUT|COMPLETED|Repository[scm:git:file:///home/jenkins/jenkins-slave/workspace/n-box_maven-wagon_WAGON-528-IMNZXLSWVKGSMF6UG52A7YYKAK332OKWF6U6U6HZJQ3V6WNV7M2A/m/wagon-providers/wagon-scm/target/test-classes/test-repo-git-test/]|/home/jenkins/jenkins-slave/workspace/n-box_maven-wagon_WAGON-528-IMNZXLSWVKGSMF6UG52A7YYKAK332OKWF6U6U6HZJQ3V6WNV7M2A/m/wagon-providers/wagon-scm/target/test-output/test-resource|test-resource[len = 18; mod = 1539193408000]]): expected: 1, actual: 0


FAILED:  org.apache.maven.wagon.providers.scm.ScmGitExeWagonTest.testWagonPutDirectoryForDot

Error Message:
Error interacting with SCM: Unable to commit file. The git-commit command failed.
*** Please tell me who you are.

Run

  git config --global user.email "[hidden email]"
  git config --global user.name "Your Name"

to set your account's default identity.
Omit --global to set the identity only in this repository.

fatal:********@asf929.gq1.ygridcore.net>) not allowed


Stack Trace:
org.apache.maven.wagon.TransferFailedException:
Error interacting with SCM: Unable to commit file. The git-commit command failed.
*** Please tell me who you are.

Run

  git config --global user.email "[hidden email]"
  git config --global user.name "Your Name"

to set your account's default identity.
Omit --global to set the identity only in this repository.

fatal:********@asf929.gq1.ygridcore.net>) not allowed

Caused by: org.apache.maven.scm.ScmException:
Unable to commit file. The git-commit command failed.
*** Please tell me who you are.

Run

  git config --global user.email "[hidden email]"
  git config --global user.name "Your Name"

to set your account's default identity.
Omit --global to set the identity only in this repository.

fatal:********@asf929.gq1.ygridcore.net>) not allowed



FAILED:  org.apache.maven.wagon.providers.scm.ScmGitExeWagonTest.testWagonPutDirectoryWhenDirectoryAlreadyExists

Error Message:
Error interacting with SCM: Unable to commit file. The git-commit command failed.
*** Please tell me who you are.

Run

  git config --global user.email "[hidden email]"
  git config --global user.name "Your Name"

to set your account's default identity.
Omit --global to set the identity only in this repository.

fatal:********@asf929.gq1.ygridcore.net>) not allowed


Stack Trace:
org.apache.maven.wagon.TransferFailedException:
Error interacting with SCM: Unable to commit file. The git-commit command failed.
*** Please tell me who you are.

Run

  git config --global user.email "[hidden email]"
  git config --global user.name "Your Name"

to set your account's default identity.
Omit --global to set the identity only in this repository.

fatal:********@asf929.gq1.ygridcore.net>) not allowed

Caused by: org.apache.maven.scm.ScmException:
Unable to commit file. The git-commit command failed.
*** Please tell me who you are.

Run

  git config --global user.email "[hidden email]"
  git config --global user.name "Your Name"

to set your account's default identity.
Omit --global to set the identity only in this repository.

fatal:********@asf929.gq1.ygridcore.net>) not allowed



FAILED:  org.apache.maven.wagon.providers.scm.ScmGitExeWagonTest.testWagonPutDirectory

Error Message:
Error interacting with SCM: Unable to commit file. The git-commit command failed.
*** Please tell me who you are.

Run

  git config --global user.email "[hidden email]"
  git config --global user.name "Your Name"

to set your account's default identity.
Omit --global to set the identity only in this repository.

fatal:********@asf935.gq1.ygridcore.net>) not allowed


Stack Trace:
org.apache.maven.wagon.TransferFailedException:
Error interacting with SCM: Unable to commit file. The git-commit command failed.
*** Please tell me who you are.

Run

  git config --global user.email "[hidden email]"
  git config --global user.name "Your Name"

to set your account's default identity.
Omit --global to set the identity only in this repository.

fatal:********@asf935.gq1.ygridcore.net>) not allowed

Caused by: org.apache.maven.scm.ScmException:
Unable to commit file. The git-commit command failed.
*** Please tell me who you are.

Run

  git config --global user.email "[hidden email]"
  git config --global user.name "Your Name"

to set your account's default identity.
Omit --global to set the identity only in this repository.

fatal:********@asf935.gq1.ygridcore.net>) not allowed



FAILED:  org.apache.maven.wagon.providers.scm.ScmGitExeWagonTest.testWagonPutDirectoryDeepDestination

Error Message:
Error interacting with SCM: Unable to commit file. The git-commit command failed.
*** Please tell me who you are.

Run

  git config --global user.email "[hidden email]"
  git config --global user.name "Your Name"

to set your account's default identity.
Omit --global to set the identity only in this repository.

fatal:********@asf935.gq1.ygridcore.net>) not allowed


Stack Trace:
org.apache.maven.wagon.TransferFailedException:
Error interacting with SCM: Unable to commit file. The git-commit command failed.
*** Please tell me who you are.

Run

  git config --global user.email "[hidden email]"
  git config --global user.name "Your Name"

to set your account's default identity.
Omit --global to set the identity only in this repository.

fatal:********@asf935.gq1.ygridcore.net>) not allowed

Caused by: org.apache.maven.scm.ScmException:
Unable to commit file. The git-commit command failed.
*** Please tell me who you are.

Run

  git config --global user.email "[hidden email]"
  git config --global user.name "Your Name"

to set your account's default identity.
Omit --global to set the identity only in this repository.

fatal:********@asf935.gq1.ygridcore.net>) not allowed



FAILED:  org.apache.maven.wagon.providers.scm.ScmGitExeWagonTest.testWagon

Error Message:

  Unexpected method call TransferListener.transferError(TransferEvent[PUT|ERROR|Repository[scm:git:file:///home/jenkins/jenkins-slave/workspace/n-box_maven-wagon_WAGON-528-IMNZXLSWVKGSMF6UG52A7YYKAK332OKWF6U6U6HZJQ3V6WNV7M2A/m/wagon-providers/wagon-scm/target/test-classes/test-repo-git-test/]|null|test-resource[len = 18; mod = 1539193426396]]):
    TransferListener.transferCompleted(TransferEvent[PUT|COMPLETED|Repository[scm:git:file:///home/jenkins/jenkins-slave/workspace/n-box_maven-wagon_WAGON-528-IMNZXLSWVKGSMF6UG52A7YYKAK332OKWF6U6U6HZJQ3V6WNV7M2A/m/wagon-providers/wagon-scm/target/test-classes/test-repo-git-test/]|/home/jenkins/jenkins-slave/workspace/n-box_maven-wagon_WAGON-528-IMNZXLSWVKGSMF6UG52A7YYKAK332OKWF6U6U6HZJQ3V6WNV7M2A/m/wagon-providers/wagon-scm/target/test-output/test-resource|test-resource[len = 18; mod = 1539193426396]]): expected: 1, actual: 0

Stack Trace:
java.lang.AssertionError:

  Unexpected method call TransferListener.transferError(TransferEvent[PUT|ERROR|Repository[scm:git:file:///home/jenkins/jenkins-slave/workspace/n-box_maven-wagon_WAGON-528-IMNZXLSWVKGSMF6UG52A7YYKAK332OKWF6U6U6HZJQ3V6WNV7M2A/m/wagon-providers/wagon-scm/target/test-classes/test-repo-git-test/]|null|test-resource[len = 18; mod = 1539193426396]]):
    TransferListener.transferCompleted(TransferEvent[PUT|COMPLETED|Repository[scm:git:file:///home/jenkins/jenkins-slave/workspace/n-box_maven-wagon_WAGON-528-IMNZXLSWVKGSMF6UG52A7YYKAK332OKWF6U6U6HZJQ3V6WNV7M2A/m/wagon-providers/wagon-scm/target/test-classes/test-repo-git-test/]|/home/jenkins/jenkins-slave/workspace/n-box_maven-wagon_WAGON-528-IMNZXLSWVKGSMF6UG52A7YYKAK332OKWF6U6U6HZJQ3V6WNV7M2A/m/wagon-providers/wagon-scm/target/test-output/test-resource|test-resource[len = 18; mod = 1539193426396]]): expected: 1, actual: 0


FAILED:  org.apache.maven.wagon.providers.scm.ScmGitExeWagonTest.testWagonPutDirectoryForDot

Error Message:
Error interacting with SCM: Unable to commit file. The git-commit command failed.
*** Please tell me who you are.

Run

  git config --global user.email "[hidden email]"
  git config --global user.name "Your Name"

to set your account's default identity.
Omit --global to set the identity only in this repository.

fatal:********@asf935.gq1.ygridcore.net>) not allowed


Stack Trace:
org.apache.maven.wagon.TransferFailedException:
Error interacting with SCM: Unable to commit file. The git-commit command failed.
*** Please tell me who you are.

Run

  git config --global user.email "[hidden email]"
  git config --global user.name "Your Name"

to set your account's default identity.
Omit --global to set the identity only in this repository.

fatal:********@asf935.gq1.ygridcore.net>) not allowed

Caused by: org.apache.maven.scm.ScmException:
Unable to commit file. The git-commit command failed.
*** Please tell me who you are.

Run

  git config --global user.email "[hidden email]"
  git config --global user.name "Your Name"

to set your account's default identity.
Omit --global to set the identity only in this repository.

fatal:********@asf935.gq1.ygridcore.net>) not allowed



FAILED:  org.apache.maven.wagon.providers.scm.ScmGitExeWagonTest.testWagonPutDirectoryWhenDirectoryAlreadyExists

Error Message:
Error interacting with SCM: Unable to commit file. The git-commit command failed.
*** Please tell me who you are.

Run

  git config --global user.email "[hidden email]"
  git config --global user.name "Your Name"

to set your account's default identity.
Omit --global to set the identity only in this repository.

fatal:********@asf935.gq1.ygridcore.net>) not allowed


Stack Trace:
org.apache.maven.wagon.TransferFailedException:
Error interacting with SCM: Unable to commit file. The git-commit command failed.
*** Please tell me who you are.

Run

  git config --global user.email "[hidden email]"
  git config --global user.name "Your Name"

to set your account's default identity.
Omit --global to set the identity only in this repository.

fatal:********@asf935.gq1.ygridcore.net>) not allowed

Caused by: org.apache.maven.scm.ScmException:
Unable to commit file. The git-commit command failed.
*** Please tell me who you are.

Run

  git config --global user.email "[hidden email]"
  git config --global user.name "Your Name"

to set your account's default identity.
Omit --global to set the identity only in this repository.

fatal:********@asf935.gq1.ygridcore.net>) not allowed



FAILED:  org.apache.maven.wagon.providers.scm.ScmGitExeWagonTest.testWagonPutDirectory

Error Message:
Error checking out: command failed: Cloning into 'F:********@2\m\wagon-providers\wagon-scm\target\test-output\checkout-org.apache.maven.scm.provider.git.gitexe.GitExeScmProvider'...
fatal: '//2/m/wagon-providers/wagon-scm/target/test-classes/test-repo-git-test/' does not appear to be a git repository
fatal: Could not read from remote repository.

Please make sure you have the correct access rights
and the repository exists.

Stack Trace:
org.apache.maven.wagon.TransferFailedException:
Error checking out: command failed: Cloning into 'F:********@2\m\wagon-providers\wagon-scm\target\test-output\checkout-org.apache.maven.scm.provider.git.gitexe.GitExeScmProvider'...
fatal: '//2/m/wagon-providers/wagon-scm/target/test-classes/test-repo-git-test/' does not appear to be a git repository
fatal: Could not read from remote repository.

Please make sure you have the correct access rights
and the repository exists.
Caused by: org.apache.maven.scm.ScmException:
command failed: Cloning into 'F:********@2\m\wagon-providers\wagon-scm\target\test-output\checkout-org.apache.maven.scm.provider.git.gitexe.GitExeScmProvider'...
fatal: '//2/m/wagon-providers/wagon-scm/target/test-classes/test-repo-git-test/' does not appear to be a git repository
fatal: Could not read from remote repository.

Please make sure you have the correct access rights
and the repository exists.


FAILED:  org.apache.maven.wagon.providers.scm.ScmGitExeWagonTest.testWagonPutDirectoryDeepDestination

Error Message:
Error checking out: command failed: Cloning into 'F:********@2\m\wagon-providers\wagon-scm\target\test-output\checkout-org.apache.maven.scm.provider.git.gitexe.GitExeScmProvider'...
fatal: '//2/m/wagon-providers/wagon-scm/target/test-classes/test-repo-git-test/' does not appear to be a git repository
fatal: Could not read from remote repository.

Please make sure you have the correct access rights
and the repository exists.

Stack Trace:
org.apache.maven.wagon.TransferFailedException:
Error checking out: command failed: Cloning into 'F:********@2\m\wagon-providers\wagon-scm\target\test-output\checkout-org.apache.maven.scm.provider.git.gitexe.GitExeScmProvider'...
fatal: '//2/m/wagon-providers/wagon-scm/target/test-classes/test-repo-git-test/' does not appear to be a git repository
fatal: Could not read from remote repository.

Please make sure you have the correct access rights
and the repository exists.
Caused by: org.apache.maven.scm.ScmException:
command failed: Cloning into 'F:********@2\m\wagon-providers\wagon-scm\target\test-output\checkout-org.apache.maven.scm.provider.git.gitexe.GitExeScmProvider'...
fatal: '//2/m/wagon-providers/wagon-scm/target/test-classes/test-repo-git-test/' does not appear to be a git repository
fatal: Could not read from remote repository.

Please make sure you have the correct access rights
and the repository exists.


FAILED:  org.apache.maven.wagon.providers.scm.ScmGitExeWagonTest.testWagon

Error Message:

  Unexpected method call TransferListener.transferError(TransferEvent[GET|ERROR|Repository[scm:git:file://2/m/wagon-providers/wagon-scm/target/test-classes/test-repo-git-test/]|null|test-resource[len = 18; mod = 1539193916149]]):
    TransferListener.transferCompleted(TransferEvent[PUT|COMPLETED|Repository[scm:git:file://2/m/wagon-providers/wagon-scm/target/test-classes/test-repo-git-test/]|F:\jenkins\jenkins-slave\workspace\n-box_maven-wagon_WAGON-528-IMNZXLSWVKGSMF6UG52A7YYKAK332OKWF6U6U6HZJQ3V6WNV7M2A@2\m\wagon-providers\wagon-scm\target\test-output\test-resource|test-resource[len = 18; mod = 1539193916149]]): expected: 1, actual: 0

Stack Trace:
java.lang.AssertionError:

  Unexpected method call TransferListener.transferError(TransferEvent[GET|ERROR|Repository[scm:git:file://2/m/wagon-providers/wagon-scm/target/test-classes/test-repo-git-test/]|null|test-resource[len = 18; mod = 1539193916149]]):
    TransferListener.transferCompleted(TransferEvent[PUT|COMPLETED|Repository[scm:git:file://2/m/wagon-providers/wagon-scm/target/test-classes/test-repo-git-test/]|F:\jenkins\jenkins-slave\workspace\n-box_maven-wagon_WAGON-528-IMNZXLSWVKGSMF6UG52A7YYKAK332OKWF6U6U6HZJQ3V6WNV7M2A@2\m\wagon-providers\wagon-scm\target\test-output\test-resource|test-resource[len = 18; mod = 1539193916149]]): expected: 1, actual: 0


FAILED:  org.apache.maven.wagon.providers.scm.ScmGitExeWagonTest.testWagonPutDirectoryForDot

Error Message:
Error checking out: command failed: Cloning into 'F:********@2\m\wagon-providers\wagon-scm\target\test-output\checkout-org.apache.maven.scm.provider.git.gitexe.GitExeScmProvider'...
fatal: '//2/m/wagon-providers/wagon-scm/target/test-classes/test-repo-git-test/' does not appear to be a git repository
fatal: Could not read from remote repository.

Please make sure you have the correct access rights
and the repository exists.

Stack Trace:
org.apache.maven.wagon.TransferFailedException:
Error checking out: command failed: Cloning into 'F:********@2\m\wagon-providers\wagon-scm\target\test-output\checkout-org.apache.maven.scm.provider.git.gitexe.GitExeScmProvider'...
fatal: '//2/m/wagon-providers/wagon-scm/target/test-classes/test-repo-git-test/' does not appear to be a git repository
fatal: Could not read from remote repository.

Please make sure you have the correct access rights
and the repository exists.
Caused by: org.apache.maven.scm.ScmException:
command failed: Cloning into 'F:********@2\m\wagon-providers\wagon-scm\target\test-output\checkout-org.apache.maven.scm.provider.git.gitexe.GitExeScmProvider'...
fatal: '//2/m/wagon-providers/wagon-scm/target/test-classes/test-repo-git-test/' does not appear to be a git repository
fatal: Could not read from remote repository.

Please make sure you have the correct access rights
and the repository exists.


FAILED:  org.apache.maven.wagon.providers.scm.ScmGitExeWagonTest.testWagonPutDirectoryWhenDirectoryAlreadyExists

Error Message:
Error checking out: command failed: Cloning into 'F:********@2\m\wagon-providers\wagon-scm\target\test-output\checkout-org.apache.maven.scm.provider.git.gitexe.GitExeScmProvider'...
fatal: '//2/m/wagon-providers/wagon-scm/target/test-classes/test-repo-git-test/' does not appear to be a git repository
fatal: Could not read from remote repository.

Please make sure you have the correct access rights
and the repository exists.

Stack Trace:
org.apache.maven.wagon.TransferFailedException:
Error checking out: command failed: Cloning into 'F:********@2\m\wagon-providers\wagon-scm\target\test-output\checkout-org.apache.maven.scm.provider.git.gitexe.GitExeScmProvider'...
fatal: '//2/m/wagon-providers/wagon-scm/target/test-classes/test-repo-git-test/' does not appear to be a git repository
fatal: Could not read from remote repository.

Please make sure you have the correct access rights
and the repository exists.
Caused by: org.apache.maven.scm.ScmException:
command failed: Cloning into 'F:********@2\m\wagon-providers\wagon-scm\target\test-output\checkout-org.apache.maven.scm.provider.git.gitexe.GitExeScmProvider'...
fatal: '//2/m/wagon-providers/wagon-scm/target/test-classes/test-repo-git-test/' does not appear to be a git repository
fatal: Could not read from remote repository.

Please make sure you have the correct access rights
and the repository exists.


FAILED:  org.apache.maven.wagon.providers.scm.ScmGitExeWagonTest.testWagonPutDirectory

Error Message:
Error checking out: command failed: Cloning into 'F:\jenkins\jenkins-slave\workspace\n-box_maven-wagon_WAGON-528-IMNZXLSWVKGSMF6UG52A7YYKAK332OKWF6U6U6HZJQ3V6WNV7M2A\m\wagon-providers\wagon-scm\target\test-output\checkout-org.apache.maven.scm.provider.git.gitexe.GitExeScmProvider'...
fatal: '$GIT_DIR' too big
fatal: index-pack failed

Stack Trace:
org.apache.maven.wagon.TransferFailedException:
Error checking out: command failed: Cloning into 'F:\jenkins\jenkins-slave\workspace\n-box_maven-wagon_WAGON-528-IMNZXLSWVKGSMF6UG52A7YYKAK332OKWF6U6U6HZJQ3V6WNV7M2A\m\wagon-providers\wagon-scm\target\test-output\checkout-org.apache.maven.scm.provider.git.gitexe.GitExeScmProvider'...
fatal: '$GIT_DIR' too big
fatal: index-pack failed
Caused by: org.apache.maven.scm.ScmException:
command failed: Cloning into 'F:\jenkins\jenkins-slave\workspace\n-box_maven-wagon_WAGON-528-IMNZXLSWVKGSMF6UG52A7YYKAK332OKWF6U6U6HZJQ3V6WNV7M2A\m\wagon-providers\wagon-scm\target\test-output\checkout-org.apache.maven.scm.provider.git.gitexe.GitExeScmProvider'...
fatal: '$GIT_DIR' too big
fatal: index-pack failed


FAILED:  org.apache.maven.wagon.providers.scm.ScmGitExeWagonTest.testWagonPutDirectoryDeepDestination

Error Message:
Error checking out: command failed: Cloning into 'F:\jenkins\jenkins-slave\workspace\n-box_maven-wagon_WAGON-528-IMNZXLSWVKGSMF6UG52A7YYKAK332OKWF6U6U6HZJQ3V6WNV7M2A\m\wagon-providers\wagon-scm\target\test-output\checkout-org.apache.maven.scm.provider.git.gitexe.GitExeScmProvider'...
fatal: '$GIT_DIR' too big
fatal: index-pack failed

Stack Trace:
org.apache.maven.wagon.TransferFailedException:
Error checking out: command failed: Cloning into 'F:\jenkins\jenkins-slave\workspace\n-box_maven-wagon_WAGON-528-IMNZXLSWVKGSMF6UG52A7YYKAK332OKWF6U6U6HZJQ3V6WNV7M2A\m\wagon-providers\wagon-scm\target\test-output\checkout-org.apache.maven.scm.provider.git.gitexe.GitExeScmProvider'...
fatal: '$GIT_DIR' too big
fatal: index-pack failed
Caused by: org.apache.maven.scm.ScmException:
command failed: Cloning into 'F:\jenkins\jenkins-slave\workspace\n-box_maven-wagon_WAGON-528-IMNZXLSWVKGSMF6UG52A7YYKAK332OKWF6U6U6HZJQ3V6WNV7M2A\m\wagon-providers\wagon-scm\target\test-output\checkout-org.apache.maven.scm.provider.git.gitexe.GitExeScmProvider'...
fatal: '$GIT_DIR' too big
fatal: index-pack failed


FAILED:  org.apache.maven.wagon.providers.scm.ScmGitExeWagonTest.testWagon

Error Message:

  Unexpected method call TransferListener.transferError(TransferEvent[GET|ERROR|Repository[scm:git:file:///F:/jenkins/jenkins-slave/workspace/n-box_maven-wagon_WAGON-528-IMNZXLSWVKGSMF6UG52A7YYKAK332OKWF6U6U6HZJQ3V6WNV7M2A/m/wagon-providers/wagon-scm/target/test-classes/test-repo-git-test/]|null|test-resource[len = 18; mod = 1539193913251]]):
    TransferListener.transferCompleted(TransferEvent[PUT|COMPLETED|Repository[scm:git:file:///F:/jenkins/jenkins-slave/workspace/n-box_maven-wagon_WAGON-528-IMNZXLSWVKGSMF6UG52A7YYKAK332OKWF6U6U6HZJQ3V6WNV7M2A/m/wagon-providers/wagon-scm/target/test-classes/test-repo-git-test/]|F:\jenkins\jenkins-slave\workspace\n-box_maven-wagon_WAGON-528-IMNZXLSWVKGSMF6UG52A7YYKAK332OKWF6U6U6HZJQ3V6WNV7M2A\m\wagon-providers\wagon-scm\target\test-output\test-resource|test-resource[len = 18; mod = 1539193913251]]): expected: 1, actual: 0

Stack Trace:
java.lang.AssertionError:

  Unexpected method call TransferListener.transferError(TransferEvent[GET|ERROR|Repository[scm:git:file:///F:/jenkins/jenkins-slave/workspace/n-box_maven-wagon_WAGON-528-IMNZXLSWVKGSMF6UG52A7YYKAK332OKWF6U6U6HZJQ3V6WNV7M2A/m/wagon-providers/wagon-scm/target/test-classes/test-repo-git-test/]|null|test-resource[len = 18; mod = 1539193913251]]):
    TransferListener.transferCompleted(TransferEvent[PUT|COMPLETED|Repository[scm:git:file:///F:/jenkins/jenkins-slave/workspace/n-box_maven-wagon_WAGON-528-IMNZXLSWVKGSMF6UG52A7YYKAK332OKWF6U6U6HZJQ3V6WNV7M2A/m/wagon-providers/wagon-scm/target/test-classes/test-repo-git-test/]|F:\jenkins\jenkins-slave\workspace\n-box_maven-wagon_WAGON-528-IMNZXLSWVKGSMF6UG52A7YYKAK332OKWF6U6U6HZJQ3V6WNV7M2A\m\wagon-providers\wagon-scm\target\test-output\test-resource|test-resource[len = 18; mod = 1539193913251]]): expected: 1, actual: 0


FAILED:  org.apache.maven.wagon.providers.scm.ScmGitExeWagonTest.testWagonPutDirectoryForDot

Error Message:
Error checking out: command failed: Cloning into 'F:\jenkins\jenkins-slave\workspace\n-box_maven-wagon_WAGON-528-IMNZXLSWVKGSMF6UG52A7YYKAK332OKWF6U6U6HZJQ3V6WNV7M2A\m\wagon-providers\wagon-scm\target\test-output\checkout-org.apache.maven.scm.provider.git.gitexe.GitExeScmProvider'...
fatal: '$GIT_DIR' too big
fatal: index-pack failed

Stack Trace:
org.apache.maven.wagon.TransferFailedException:
Error checking out: command failed: Cloning into 'F:\jenkins\jenkins-slave\workspace\n-box_maven-wagon_WAGON-528-IMNZXLSWVKGSMF6UG52A7YYKAK332OKWF6U6U6HZJQ3V6WNV7M2A\m\wagon-providers\wagon-scm\target\test-output\checkout-org.apache.maven.scm.provider.git.gitexe.GitExeScmProvider'...
fatal: '$GIT_DIR' too big
fatal: index-pack failed
Caused by: org.apache.maven.scm.ScmException:
command failed: Cloning into 'F:\jenkins\jenkins-slave\workspace\n-box_maven-wagon_WAGON-528-IMNZXLSWVKGSMF6UG52A7YYKAK332OKWF6U6U6HZJQ3V6WNV7M2A\m\wagon-providers\wagon-scm\target\test-output\checkout-org.apache.maven.scm.provider.git.gitexe.GitExeScmProvider'...
fatal: '$GIT_DIR' too big
fatal: index-pack failed


FAILED:  org.apache.maven.wagon.providers.scm.ScmGitExeWagonTest.testWagonPutDirectoryWhenDirectoryAlreadyExists

Error Message:
Error checking out: command failed: Cloning into 'F:\jenkins\jenkins-slave\workspace\n-box_maven-wagon_WAGON-528-IMNZXLSWVKGSMF6UG52A7YYKAK332OKWF6U6U6HZJQ3V6WNV7M2A\m\wagon-providers\wagon-scm\target\test-output\checkout-org.apache.maven.scm.provider.git.gitexe.GitExeScmProvider'...
fatal: '$GIT_DIR' too big
fatal: index-pack failed

Stack Trace:
org.apache.maven.wagon.TransferFailedException:
Error checking out: command failed: Cloning into 'F:\jenkins\jenkins-slave\workspace\n-box_maven-wagon_WAGON-528-IMNZXLSWVKGSMF6UG52A7YYKAK332OKWF6U6U6HZJQ3V6WNV7M2A\m\wagon-providers\wagon-scm\target\test-output\checkout-org.apache.maven.scm.provider.git.gitexe.GitExeScmProvider'...
fatal: '$GIT_DIR' too big
fatal: index-pack failed
Caused by: org.apache.maven.scm.ScmException:
command failed: Cloning into 'F:\jenkins\jenkins-slave\workspace\n-box_maven-wagon_WAGON-528-IMNZXLSWVKGSMF6UG52A7YYKAK332OKWF6U6U6HZJQ3V6WNV7M2A\m\wagon-providers\wagon-scm\target\test-output\checkout-org.apache.maven.scm.provider.git.gitexe.GitExeScmProvider'...
fatal: '$GIT_DIR' too big
fatal: index-pack failed


FAILED:  org.apache.maven.wagon.providers.scm.ScmGitExeWagonTest.testWagonPutDirectory

Error Message:
Error checking out: command failed: Cloning into 'F:\jenkins\jenkins-slave\workspace\n-box_maven-wagon_WAGON-528-IMNZXLSWVKGSMF6UG52A7YYKAK332OKWF6U6U6HZJQ3V6WNV7M2A\m\wagon-providers\wagon-scm\target\test-output\checkout-org.apache.maven.scm.provider.git.gitexe.GitExeScmProvider'...
fatal: '$GIT_DIR' too big
fatal: index-pack failed

Stack Trace:
org.apache.maven.wagon.TransferFailedException:
Error checking out: command failed: Cloning into 'F:\jenkins\jenkins-slave\workspace\n-box_maven-wagon_WAGON-528-IMNZXLSWVKGSMF6UG52A7YYKAK332OKWF6U6U6HZJQ3V6WNV7M2A\m\wagon-providers\wagon-scm\target\test-output\checkout-org.apache.maven.scm.provider.git.gitexe.GitExeScmProvider'...
fatal: '$GIT_DIR' too big
fatal: index-pack failed
Caused by: org.apache.maven.scm.ScmException:
command failed: Cloning into 'F:\jenkins\jenkins-slave\workspace\n-box_maven-wagon_WAGON-528-IMNZXLSWVKGSMF6UG52A7YYKAK332OKWF6U6U6HZJQ3V6WNV7M2A\m\wagon-providers\wagon-scm\target\test-output\checkout-org.apache.maven.scm.provider.git.gitexe.GitExeScmProvider'...
fatal: '$GIT_DIR' too big
fatal: index-pack failed


FAILED:  org.apache.maven.wagon.providers.scm.ScmGitExeWagonTest.testWagonPutDirectoryDeepDestination

Error Message:
Error checking out: command failed: Cloning into 'F:\jenkins\jenkins-slave\workspace\n-box_maven-wagon_WAGON-528-IMNZXLSWVKGSMF6UG52A7YYKAK332OKWF6U6U6HZJQ3V6WNV7M2A\m\wagon-providers\wagon-scm\target\test-output\checkout-org.apache.maven.scm.provider.git.gitexe.GitExeScmProvider'...
fatal: '$GIT_DIR' too big
fatal: index-pack failed

Stack Trace:
org.apache.maven.wagon.TransferFailedException:
Error checking out: command failed: Cloning into 'F:\jenkins\jenkins-slave\workspace\n-box_maven-wagon_WAGON-528-IMNZXLSWVKGSMF6UG52A7YYKAK332OKWF6U6U6HZJQ3V6WNV7M2A\m\wagon-providers\wagon-scm\target\test-output\checkout-org.apache.maven.scm.provider.git.gitexe.GitExeScmProvider'...
fatal: '$GIT_DIR' too big
fatal: index-pack failed
Caused by: org.apache.maven.scm.ScmException:
command failed: Cloning into 'F:\jenkins\jenkins-slave\workspace\n-box_maven-wagon_WAGON-528-IMNZXLSWVKGSMF6UG52A7YYKAK332OKWF6U6U6HZJQ3V6WNV7M2A\m\wagon-providers\wagon-scm\target\test-output\checkout-org.apache.maven.scm.provider.git.gitexe.GitExeScmProvider'...
fatal: '$GIT_DIR' too big
fatal: index-pack failed


FAILED:  org.apache.maven.wagon.providers.scm.ScmGitExeWagonTest.testWagon

Error Message:

  Unexpected method call TransferListener.transferError(TransferEvent[GET|ERROR|Repository[scm:git:file:///F:/jenkins/jenkins-slave/workspace/n-box_maven-wagon_WAGON-528-IMNZXLSWVKGSMF6UG52A7YYKAK332OKWF6U6U6HZJQ3V6WNV7M2A/m/wagon-providers/wagon-scm/target/test-classes/test-repo-git-test/]|null|test-resource[len = 18; mod = 1539193927776]]):
    TransferListener.transferCompleted(TransferEvent[PUT|COMPLETED|Repository[scm:git:file:///F:/jenkins/jenkins-slave/workspace/n-box_maven-wagon_WAGON-528-IMNZXLSWVKGSMF6UG52A7YYKAK332OKWF6U6U6HZJQ3V6WNV7M2A/m/wagon-providers/wagon-scm/target/test-classes/test-repo-git-test/]|F:\jenkins\jenkins-slave\workspace\n-box_maven-wagon_WAGON-528-IMNZXLSWVKGSMF6UG52A7YYKAK332OKWF6U6U6HZJQ3V6WNV7M2A\m\wagon-providers\wagon-scm\target\test-output\test-resource|test-resource[len = 18; mod = 1539193927776]]): expected: 1, actual: 0

Stack Trace:
java.lang.AssertionError:

  Unexpected method call TransferListener.transferError(TransferEvent[GET|ERROR|Repository[scm:git:file:///F:/jenkins/jenkins-slave/workspace/n-box_maven-wagon_WAGON-528-IMNZXLSWVKGSMF6UG52A7YYKAK332OKWF6U6U6HZJQ3V6WNV7M2A/m/wagon-providers/wagon-scm/target/test-classes/test-repo-git-test/]|null|test-resource[len = 18; mod = 1539193927776]]):
    TransferListener.transferCompleted(TransferEvent[PUT|COMPLETED|Repository[scm:git:file:///F:/jenkins/jenkins-slave/workspace/n-box_maven-wagon_WAGON-528-IMNZXLSWVKGSMF6UG52A7YYKAK332OKWF6U6U6HZJQ3V6WNV7M2A/m/wagon-providers/wagon-scm/target/test-classes/test-repo-git-test/]|F:\jenkins\jenkins-slave\workspace\n-box_maven-wagon_WAGON-528-IMNZXLSWVKGSMF6UG52A7YYKAK332OKWF6U6U6HZJQ3V6WNV7M2A\m\wagon-providers\wagon-scm\target\test-output\test-resource|test-resource[len = 18; mod = 1539193927776]]): expected: 1, actual: 0


FAILED:  org.apache.maven.wagon.providers.scm.ScmGitExeWagonTest.testWagonPutDirectoryForDot

Error Message:
Error checking out: command failed: Cloning into 'F:\jenkins\jenkins-slave\workspace\n-box_maven-wagon_WAGON-528-IMNZXLSWVKGSMF6UG52A7YYKAK332OKWF6U6U6HZJQ3V6WNV7M2A\m\wagon-providers\wagon-scm\target\test-output\checkout-org.apache.maven.scm.provider.git.gitexe.GitExeScmProvider'...
fatal: '$GIT_DIR' too big
fatal: index-pack failed

Stack Trace:
org.apache.maven.wagon.TransferFailedException:
Error checking out: command failed: Cloning into 'F:\jenkins\jenkins-slave\workspace\n-box_maven-wagon_WAGON-528-IMNZXLSWVKGSMF6UG52A7YYKAK332OKWF6U6U6HZJQ3V6WNV7M2A\m\wagon-providers\wagon-scm\target\test-output\checkout-org.apache.maven.scm.provider.git.gitexe.GitExeScmProvider'...
fatal: '$GIT_DIR' too big
fatal: index-pack failed
Caused by: org.apache.maven.scm.ScmException:
command failed: Cloning into 'F:\jenkins\jenkins-slave\workspace\n-box_maven-wagon_WAGON-528-IMNZXLSWVKGSMF6UG52A7YYKAK332OKWF6U6U6HZJQ3V6WNV7M2A\m\wagon-providers\wagon-scm\target\test-output\checkout-org.apache.maven.scm.provider.git.gitexe.GitExeScmProvider'...
fatal: '$GIT_DIR' too big
fatal: index-pack failed


FAILED:  org.apache.maven.wagon.providers.scm.ScmGitExeWagonTest.testWagonPutDirectoryWhenDirectoryAlreadyExists

Error Message:
Error checking out: command failed: Cloning into 'F:\jenkins\jenkins-slave\workspace\n-box_maven-wagon_WAGON-528-IMNZXLSWVKGSMF6UG52A7YYKAK332OKWF6U6U6HZJQ3V6WNV7M2A\m\wagon-providers\wagon-scm\target\test-output\checkout-org.apache.maven.scm.provider.git.gitexe.GitExeScmProvider'...
fatal: '$GIT_DIR' too big
fatal: index-pack failed

Stack Trace:
org.apache.maven.wagon.TransferFailedException:
Error checking out: command failed: Cloning into 'F:\jenkins\jenkins-slave\workspace\n-box_maven-wagon_WAGON-528-IMNZXLSWVKGSMF6UG52A7YYKAK332OKWF6U6U6HZJQ3V6WNV7M2A\m\wagon-providers\wagon-scm\target\test-output\checkout-org.apache.maven.scm.provider.git.gitexe.GitExeScmProvider'...
fatal: '$GIT_DIR' too big
fatal: index-pack failed
Caused by: org.apache.maven.scm.ScmException:
command failed: Cloning into 'F:\jenkins\jenkins-slave\workspace\n-box_maven-wagon_WAGON-528-IMNZXLSWVKGSMF6UG52A7YYKAK332OKWF6U6U6HZJQ3V6WNV7M2A\m\wagon-providers\wagon-scm\target\test-output\checkout-org.apache.maven.scm.provider.git.gitexe.GitExeScmProvider'...
fatal: '$GIT_DIR' too big
fatal: index-pack failed




Build log:
[...truncated 3.40 MB...]
[windows-jdk8] [INFO] Apache Maven Wagon :: Providers :: File Provider ... SUCCESS [  2.779 s]
[windows-jdk8] [INFO] Apache Maven Wagon :: Providers :: FTP Provider .... SUCCESS [  5.656 s]
[windows-jdk8] [INFO] Apache Maven Wagon :: Providers :: HTTP Shared Library SUCCESS [  3.364 s]
[windows-jdk8] [INFO] Apache Maven Wagon :: Test Compatibility Kits ...... SUCCESS [  0.961 s]
[windows-jdk8] [INFO] Apache Maven Wagon :: HTTP Test Compatibility Kit .. SUCCESS [  1.845 s]
[windows-jdk8] [INFO] Apache Maven Wagon :: Providers :: HTTP Provider ... SUCCESS [04:31 min]
[windows-jdk8] [INFO] Apache Maven Wagon :: Providers :: Lightweight HTTP Provider SUCCESS [02:08 min]
[windows-jdk8] [INFO] Apache Maven Wagon :: Providers :: SCM Provider .... SUCCESS [  9.068 s]
[windows-jdk8] [INFO] Apache Maven Wagon :: Providers :: SSH Common Library SUCCESS [  2.432 s]
[windows-jdk8] [INFO] Apache Maven Wagon :: Providers :: SSH Common Tests  SUCCESS [  1.873 s]
[windows-jdk8] [INFO] Apache Maven Wagon :: Providers :: SSH External Provider SUCCESS [  1.261 s]
[windows-jdk8] [INFO] Apache Maven Wagon :: Providers :: SSH Provider .... SUCCESS [  2.445 s]
[windows-jdk8] [INFO] Apache Maven Wagon :: Providers :: WebDAV Provider . SUCCESS [ 59.742 s]
[windows-jdk8] [INFO] ------------------------------------------------------------------------
[windows-jdk8] [INFO] BUILD SUCCESS
[windows-jdk8] [INFO] ------------------------------------------------------------------------
[windows-jdk8] [INFO] Total time: 08:43 min
[windows-jdk8] [INFO] Finished at: 2018-10-10T17:53:07Z
[windows-jdk8] [INFO] Final Memory: 98M/1076M
[windows-jdk8] [INFO] ------------------------------------------------------------------------
[windows-jdk8] [WARNING] The requested profile "run-its" could not be activated because it does not exist.
[windows-jdk8] [INFO] [jenkins-event-spy] Generated F:\jenkins\jenkins-slave\workspace\n-box_maven-wagon_WAGON-528-IMNZXLSWVKGSMF6UG52A7YYKAK332OKWF6U6U6HZJQ3V6WNV7M2A@2@tmp\withMaven5574db53\maven-spy-20181010-174422-7272810420452021075629.log
[windows-jdk8] Picked up JAVA_TOOL_OPTIONS: -Dmaven.ext.class.path="f:\jenkins\jenkins-slave\workspace\n-box_maven-wagon_WAGON-528-IMNZXLSWVKGSMF6UG52A7YYKAK332OKWF6U6U6HZJQ3V6WNV7M2A@2@tmp\withMaven5574db53\pipeline-maven-spy.jar" -Dorg.jenkinsci.plugins.pipeline.maven.reportsFolder="f:\jenkins\jenkins-slave\workspace\n-box_maven-wagon_WAGON-528-IMNZXLSWVKGSMF6UG52A7YYKAK332OKWF6U6U6HZJQ3V6WNV7M2A@2@tmp\withMaven5574db53"
[Pipeline] [windows-jdk8] }
[Pipeline] [windows-jdk8] // dir
[Pipeline] [windows-jdk8] }
[windows-jdk8] [withMaven] junitPublisher - Archive test results for Maven artifact org.apache.maven.wagon:wagon-provider-api:3.1.1-SNAPSHOT generated by maven-surefire-plugin:test (default-test): m\wagon-provider-api\target\surefire-reports\*.xml
[windows-jdk8] Recording test results
[windows-jdk8] [withMaven] junitPublisher - Archive test results for Maven artifact org.apache.maven.wagon:wagon-provider-test:3.1.1-SNAPSHOT generated by maven-surefire-plugin:test (default-test): m\wagon-provider-test\target\surefire-reports\*.xml
[windows-jdk8] Recording test results
[windows-jdk8] None of the test reports contained any result
[windows-jdk8] [withMaven] junitPublisher - Archive test results for Maven artifact org.apache.maven.wagon:wagon-file:3.1.1-SNAPSHOT generated by maven-surefire-plugin:test (default-test): m\wagon-providers\wagon-file\target\surefire-reports\*.xml
[windows-jdk8] Recording test results
[windows-jdk8] [withMaven] junitPublisher - Archive test results for Maven artifact org.apache.maven.wagon:wagon-ftp:3.1.1-SNAPSHOT generated by maven-surefire-plugin:test (default-test): m\wagon-providers\wagon-ftp\target\surefire-reports\*.xml
[windows-jdk8] Recording test results
[windows-jdk8] [withMaven] junitPublisher - Archive test results for Maven artifact org.apache.maven.wagon:wagon-http-shared:3.1.1-SNAPSHOT generated by maven-surefire-plugin:test (default-test): m\wagon-providers\wagon-http-shared\target\surefire-reports\*.xml
[windows-jdk8] Recording test results
[windows-jdk8] [withMaven] junitPublisher - Archive test results for Maven artifact org.apache.maven.wagon:wagon-tck-http:3.1.1-SNAPSHOT generated by maven-surefire-plugin:test (default-test): m\wagon-tcks\wagon-tck-http\target\surefire-reports\*.xml
[windows-jdk8] Recording test results
[windows-jdk8] None of the test reports contained any result
[windows-jdk8] [withMaven] junitPublisher - Archive test results for Maven artifact org.apache.maven.wagon:wagon-http:3.1.1-SNAPSHOT generated by maven-surefire-plugin:test (default-test): m\wagon-providers\wagon-http\target\surefire-reports\*.xml
[windows-jdk8] Recording test results
[windows-jdk8] [withMaven] junitPublisher - Archive test results for Maven artifact org.apache.maven.wagon:wagon-http-lightweight:3.1.1-SNAPSHOT generated by maven-surefire-plugin:test (default-test): m\wagon-providers\wagon-http-lightweight\target\surefire-reports\*.xml
[windows-jdk8] Recording test results
[windows-jdk8] [withMaven] junitPublisher - Archive test results for Maven artifact org.apache.maven.wagon:wagon-scm:3.1.1-SNAPSHOT generated by maven-surefire-plugin:test (default-test): m\wagon-providers\wagon-scm\target\surefire-reports\*.xml
[windows-jdk8] Recording test results
[windows-jdk8] [withMaven] junitPublisher - Archive test results for Maven artifact org.apache.maven.wagon:wagon-ssh-common:3.1.1-SNAPSHOT generated by maven-surefire-plugin:test (default-test): m\wagon-providers\wagon-ssh-common\target\surefire-reports\*.xml
[windows-jdk8] Recording test results
[windows-jdk8] [withMaven] junitPublisher - Archive test results for Maven artifact org.apache.maven.wagon:wagon-ssh-common-test:3.1.1-SNAPSHOT generated by maven-surefire-plugin:test (default-test): m\wagon-providers\wagon-ssh-common-test\target\surefire-reports\*.xml
[windows-jdk8] Recording test results
[windows-jdk8] None of the test reports contained any result
[windows-jdk8] [withMaven] junitPublisher - Archive test results for Maven artifact org.apache.maven.wagon:wagon-ssh-external:3.1.1-SNAPSHOT generated by maven-surefire-plugin:test (default-test): m\wagon-providers\wagon-ssh-external\target\surefire-reports\*.xml
[windows-jdk8] Recording test results
[windows-jdk8] None of the test reports contained any result
[windows-jdk8] [withMaven] junitPublisher - Archive test results for Maven artifact org.apache.maven.wagon:wagon-ssh:3.1.1-SNAPSHOT generated by maven-surefire-plugin:test (default-test): m\wagon-providers\wagon-ssh\target\surefire-reports\*.xml
[windows-jdk8] Recording test results
[windows-jdk8] None of the test reports contained any result
[windows-jdk8] [withMaven] junitPublisher - Archive test results for Maven artifact org.apache.maven.wagon:wagon-webdav-jackrabbit:3.1.1-SNAPSHOT generated by maven-surefire-plugin:test (default-test): m\wagon-providers\wagon-webdav-jackrabbit\target\surefire-reports\*.xml
[windows-jdk8] Recording test results
[Pipeline] [windows-jdk8] // withMaven
[Pipeline] [windows-jdk8] cleanWs
[windows-jdk8] [WS-CLEANUP] Deleting project workspace...[WS-CLEANUP] done
[Pipeline] [windows-jdk8] }
[Pipeline] [windows-jdk8] // stage
[Pipeline] [windows-jdk8] }
[Pipeline] [windows-jdk8] // node
[Pipeline] [windows-jdk8] }
[windows-jdk7] [INFO] Tests run: 69, Failures: 0, Errors: 0, Skipped: 0, Time elapsed: 26.146 s - in org.apache.maven.wagon.providers.webdav.WebDavWagonTest
[windows-jdk7] [INFO]
[windows-jdk7] [INFO] Results:
[windows-jdk7] [INFO]
[windows-jdk7] [INFO] Tests run: 145, Failures: 0, Errors: 0, Skipped: 0
[windows-jdk7] [INFO]
[windows-jdk7] [INFO]
[windows-jdk7] [INFO] --- maven-jar-plugin:3.0.2:jar (default-jar) @ wagon-webdav-jackrabbit ---
[windows-jdk7] [INFO] Building jar: F:\jenkins\jenkins-slave\workspace\n-box_maven-wagon_WAGON-528-IMNZXLSWVKGSMF6UG52A7YYKAK332OKWF6U6U6HZJQ3V6WNV7M2A\m\wagon-providers\wagon-webdav-jackrabbit\target\wagon-webdav-jackrabbit-3.1.1-SNAPSHOT.jar
[windows-jdk7] [INFO]
[windows-jdk7] [INFO] --- maven-site-plugin:3.7:attach-descriptor (attach-descriptor) @ wagon-webdav-jackrabbit ---
[windows-jdk7] [INFO] Skipping because packaging 'jar' is not pom.
[windows-jdk7] [INFO]
[windows-jdk7] [INFO] --- maven-checkstyle-plugin:3.0.0:check (checkstyle-check) @ wagon-webdav-jackrabbit ---
[windows-jdk7] [INFO] ------------------------------------------------------------------------
[windows-jdk7] [INFO] Reactor Summary:
[windows-jdk7] [INFO]
[windows-jdk7] [INFO] Apache Maven Wagon ................................. SUCCESS [ 17.756 s]
[windows-jdk7] [INFO] Apache Maven Wagon :: API .......................... SUCCESS [  8.524 s]
[windows-jdk7] [INFO] Apache Maven Wagon :: Provider Test ................ SUCCESS [  3.635 s]
[windows-jdk7] [INFO] Apache Maven Wagon :: Providers .................... SUCCESS [  1.658 s]
[windows-jdk7] [INFO] Apache Maven Wagon :: Providers :: File Provider ... SUCCESS [  3.820 s]
[windows-jdk7] [INFO] Apache Maven Wagon :: Providers :: FTP Provider .... SUCCESS [  6.765 s]
[windows-jdk7] [INFO] Apache Maven Wagon :: Providers :: HTTP Shared Library SUCCESS [  3.828 s]
[windows-jdk7] [INFO] Apache Maven Wagon :: Test Compatibility Kits ...... SUCCESS [  1.199 s]
[windows-jdk7] [INFO] Apache Maven Wagon :: HTTP Test Compatibility Kit .. SUCCESS [  1.954 s]
[windows-jdk7] [INFO] Apache Maven Wagon :: Providers :: HTTP Provider ... SUCCESS [04:26 min]
[windows-jdk7] [INFO] Apache Maven Wagon :: Providers :: Lightweight HTTP Provider SUCCESS [02:11 min]
[windows-jdk7] [INFO] Apache Maven Wagon :: Providers :: SCM Provider .... SUCCESS [ 16.677 s]
[windows-jdk7] [INFO] Apache Maven Wagon :: Providers :: SSH Common Library SUCCESS [  2.969 s]
[windows-jdk7] [INFO] Apache Maven Wagon :: Providers :: SSH Common Tests  SUCCESS [  2.325 s]
[windows-jdk7] [INFO] Apache Maven Wagon :: Providers :: SSH External Provider SUCCESS [  1.614 s]
[windows-jdk7] [INFO] Apache Maven Wagon :: Providers :: SSH Provider .... SUCCESS [  2.465 s]
[windows-jdk7] [INFO] Apache Maven Wagon :: Providers :: WebDAV Provider . SUCCESS [01:01 min]
[windows-jdk7] [INFO] ------------------------------------------------------------------------
[windows-jdk7] [INFO] BUILD SUCCESS
[windows-jdk7] [INFO] ------------------------------------------------------------------------
[windows-jdk7] [INFO] Total time: 08:56 min
[windows-jdk7] [INFO] Finished at: 2018-10-10T17:53:16Z
[windows-jdk7] [INFO] Final Memory: 69M/923M
[windows-jdk7] [INFO] ------------------------------------------------------------------------
[windows-jdk7] [WARNING] The requested profile "run-its" could not be activated because it does not exist.
[windows-jdk7] [INFO] [jenkins-event-spy] Generated F:\jenkins\jenkins-slave\workspace\n-box_maven-wagon_WAGON-528-IMNZXLSWVKGSMF6UG52A7YYKAK332OKWF6U6U6HZJQ3V6WNV7M2A@tmp\withMavenaeb10714\maven-spy-20181010-174419-2362779267435214891980.log
[windows-jdk7] Picked up JAVA_TOOL_OPTIONS: -Dmaven.ext.class.path="f:\jenkins\jenkins-slave\workspace\n-box_maven-wagon_WAGON-528-IMNZXLSWVKGSMF6UG52A7YYKAK332OKWF6U6U6HZJQ3V6WNV7M2A@tmp\withMavenaeb10714\pipeline-maven-spy.jar" -Dorg.jenkinsci.plugins.pipeline.maven.reportsFolder="f:\jenkins\jenkins-slave\workspace\n-box_maven-wagon_WAGON-528-IMNZXLSWVKGSMF6UG52A7YYKAK332OKWF6U6U6HZJQ3V6WNV7M2A@tmp\withMavenaeb10714"
[Pipeline] [windows-jdk7] }
[Pipeline] [windows-jdk7] // dir
[Pipeline] [windows-jdk7] }
[windows-jdk7] [withMaven] junitPublisher - Archive test results for Maven artifact org.apache.maven.wagon:wagon-provider-api:3.1.1-SNAPSHOT generated by maven-surefire-plugin:test (default-test): m\wagon-provider-api\target\surefire-reports\*.xml
[windows-jdk7] Recording test results
[windows-jdk7] [withMaven] junitPublisher - Archive test results for Maven artifact org.apache.maven.wagon:wagon-provider-test:3.1.1-SNAPSHOT generated by maven-surefire-plugin:test (default-test): m\wagon-provider-test\target\surefire-reports\*.xml
[windows-jdk7] Recording test results
[windows-jdk7] None of the test reports contained any result
[windows-jdk7] [withMaven] junitPublisher - Archive test results for Maven artifact org.apache.maven.wagon:wagon-file:3.1.1-SNAPSHOT generated by maven-surefire-plugin:test (default-test): m\wagon-providers\wagon-file\target\surefire-reports\*.xml
[windows-jdk7] Recording test results
[windows-jdk7] [withMaven] junitPublisher - Archive test results for Maven artifact org.apache.maven.wagon:wagon-ftp:3.1.1-SNAPSHOT generated by maven-surefire-plugin:test (default-test): m\wagon-providers\wagon-ftp\target\surefire-reports\*.xml
[windows-jdk7] Recording test results
[windows-jdk7] [withMaven] junitPublisher - Archive test results for Maven artifact org.apache.maven.wagon:wagon-http-shared:3.1.1-SNAPSHOT generated by maven-surefire-plugin:test (default-test): m\wagon-providers\wagon-http-shared\target\surefire-reports\*.xml
[windows-jdk7] Recording test results
[windows-jdk7] [withMaven] junitPublisher - Archive test results for Maven artifact org.apache.maven.wagon:wagon-tck-http:3.1.1-SNAPSHOT generated by maven-surefire-plugin:test (default-test): m\wagon-tcks\wagon-tck-http\target\surefire-reports\*.xml
[windows-jdk7] Recording test results
[windows-jdk7] None of the test reports contained any result
[windows-jdk7] [withMaven] junitPublisher - Archive test results for Maven artifact org.apache.maven.wagon:wagon-http:3.1.1-SNAPSHOT generated by maven-surefire-plugin:test (default-test): m\wagon-providers\wagon-http\target\surefire-reports\*.xml
[windows-jdk7] Recording test results
[windows-jdk7] [withMaven] junitPublisher - Archive test results for Maven artifact org.apache.maven.wagon:wagon-http-lightweight:3.1.1-SNAPSHOT generated by maven-surefire-plugin:test (default-test): m\wagon-providers\wagon-http-lightweight\target\surefire-reports\*.xml
[windows-jdk7] Recording test results
[windows-jdk7] [withMaven] junitPublisher - Archive test results for Maven artifact org.apache.maven.wagon:wagon-scm:3.1.1-SNAPSHOT generated by maven-surefire-plugin:test (default-test): m\wagon-providers\wagon-scm\target\surefire-reports\*.xml
[windows-jdk7] Recording test results
[windows-jdk7] [withMaven] junitPublisher - Archive test results for Maven artifact org.apache.maven.wagon:wagon-ssh-common:3.1.1-SNAPSHOT generated by maven-surefire-plugin:test (default-test): m\wagon-providers\wagon-ssh-common\target\surefire-reports\*.xml
[windows-jdk7] Recording test results
[windows-jdk7] [withMaven] junitPublisher - Archive test results for Maven artifact org.apache.maven.wagon:wagon-ssh-common-test:3.1.1-SNAPSHOT generated by maven-surefire-plugin:test (default-test): m\wagon-providers\wagon-ssh-common-test\target\surefire-reports\*.xml
[windows-jdk7] Recording test results
[windows-jdk7] None of the test reports contained any result
[windows-jdk7] [withMaven] junitPublisher - Archive test results for Maven artifact org.apache.maven.wagon:wagon-ssh-external:3.1.1-SNAPSHOT generated by maven-surefire-plugin:test (default-test): m\wagon-providers\wagon-ssh-external\target\surefire-reports\*.xml
[windows-jdk7] Recording test results
[windows-jdk7] None of the test reports contained any result
[windows-jdk7] [withMaven] junitPublisher - Archive test results for Maven artifact org.apache.maven.wagon:wagon-ssh:3.1.1-SNAPSHOT generated by maven-surefire-plugin:test (default-test): m\wagon-providers\wagon-ssh\target\surefire-reports\*.xml
[windows-jdk7] Recording test results
[windows-jdk7] None of the test reports contained any result
[windows-jdk7] [withMaven] junitPublisher - Archive test results for Maven artifact org.apache.maven.wagon:wagon-webdav-jackrabbit:3.1.1-SNAPSHOT generated by maven-surefire-plugin:test (default-test): m\wagon-providers\wagon-webdav-jackrabbit\target\surefire-reports\*.xml
[windows-jdk7] Recording test results
[Pipeline] [windows-jdk7] // withMaven
[Pipeline] [windows-jdk7] cleanWs
[windows-jdk7] [WS-CLEANUP] Deleting project workspace...[WS-CLEANUP] done
[Pipeline] [windows-jdk7] }
[Pipeline] [windows-jdk7] // stage
[Pipeline] [windows-jdk7] }
[Pipeline] [windows-jdk7] // node
[Pipeline] [windows-jdk7] }
[windows-jdk9] [INFO] Tests run: 69, Failures: 0, Errors: 0, Skipped: 0, Time elapsed: 26.332 s - in org.apache.maven.wagon.providers.webdav.WebDavWagonTest
[windows-jdk9] [INFO]
[windows-jdk9] [INFO] Results:
[windows-jdk9] [INFO]
[windows-jdk9] [INFO] Tests run: 145, Failures: 0, Errors: 0, Skipped: 0
[windows-jdk9] [INFO]
[windows-jdk9] [INFO]
[windows-jdk9] [INFO] --- maven-jar-plugin:3.0.2:jar (default-jar) @ wagon-webdav-jackrabbit ---
[windows-jdk9] [INFO] Building jar: F:\jenkins\jenkins-slave\workspace\n-box_maven-wagon_WAGON-528-IMNZXLSWVKGSMF6UG52A7YYKAK332OKWF6U6U6HZJQ3V6WNV7M2A\m\wagon-providers\wagon-webdav-jackrabbit\target\wagon-webdav-jackrabbit-3.1.1-SNAPSHOT.jar
[windows-jdk9] [INFO]
[windows-jdk9] [INFO] --- maven-site-plugin:3.7:attach-descriptor (attach-descriptor) @ wagon-webdav-jackrabbit ---
[windows-jdk9] [INFO] Skipping because packaging 'jar' is not pom.
[windows-jdk9] [INFO]
[windows-jdk9] [INFO] --- maven-checkstyle-plugin:3.0.0:check (checkstyle-check) @ wagon-webdav-jackrabbit ---
[windows-jdk9] [INFO] ------------------------------------------------------------------------
[windows-jdk9] [INFO] Reactor Summary:
[windows-jdk9] [INFO]
[windows-jdk9] [INFO] Apache Maven Wagon ................................. SUCCESS [ 16.015 s]
[windows-jdk9] [INFO] Apache Maven Wagon :: API .......................... SUCCESS [  7.374 s]
[windows-jdk9] [INFO] Apache Maven Wagon :: Provider Test ................ SUCCESS [  3.179 s]
[windows-jdk9] [INFO] Apache Maven Wagon :: Providers .................... SUCCESS [  1.145 s]
[windows-jdk9] [INFO] Apache Maven Wagon :: Providers :: File Provider ... SUCCESS [  3.311 s]
[windows-jdk9] [INFO] Apache Maven Wagon :: Providers :: FTP Provider .... SUCCESS [  6.022 s]
[windows-jdk9] [INFO] Apache Maven Wagon :: Providers :: HTTP Shared Library SUCCESS [  3.392 s]
[windows-jdk9] [INFO] Apache Maven Wagon :: Test Compatibility Kits ...... SUCCESS [  0.909 s]
[windows-jdk9] [INFO] Apache Maven Wagon :: HTTP Test Compatibility Kit .. SUCCESS [  1.661 s]
[windows-jdk9] [INFO] Apache Maven Wagon :: Providers :: HTTP Provider ... SUCCESS [04:40 min]
[windows-jdk9] [INFO] Apache Maven Wagon :: Providers :: Lightweight HTTP Provider SUCCESS [02:12 min]
[windows-jdk9] [INFO] Apache Maven Wagon :: Providers :: SCM Provider .... SUCCESS [ 18.514 s]
[windows-jdk9] [INFO] Apache Maven Wagon :: Providers :: SSH Common Library SUCCESS [  2.718 s]
[windows-jdk9] [INFO] Apache Maven Wagon :: Providers :: SSH Common Tests  SUCCESS [  2.266 s]
[windows-jdk9] [INFO] Apache Maven Wagon :: Providers :: SSH External Provider SUCCESS [  1.295 s]
[windows-jdk9] [INFO] Apache Maven Wagon :: Providers :: SSH Provider .... SUCCESS [  2.494 s]
[windows-jdk9] [INFO] Apache Maven Wagon :: Providers :: WebDAV Provider . SUCCESS [01:01 min]
[windows-jdk9] [INFO] ------------------------------------------------------------------------
[windows-jdk9] [INFO] BUILD SUCCESS
[windows-jdk9] [INFO] ------------------------------------------------------------------------
[windows-jdk9] [INFO] Total time: 09:07 min
[windows-jdk9] [INFO] Finished at: 2018-10-10T17:53:31Z
[windows-jdk9] [INFO] Final Memory: 45M/151M
[windows-jdk9] [INFO] ------------------------------------------------------------------------
[windows-jdk9] [WARNING] The requested profile "run-its" could not be activated because it does not exist.
[windows-jdk9] [INFO] [jenkins-event-spy] Generated F:\jenkins\jenkins-slave\workspace\n-box_maven-wagon_WAGON-528-IMNZXLSWVKGSMF6UG52A7YYKAK332OKWF6U6U6HZJQ3V6WNV7M2A@tmp\withMaven00b851db\maven-spy-20181010-174424-45516115763210607084621.log
[Pipeline] [windows-jdk9] }
[Pipeline] [windows-jdk9] // dir
[Pipeline] [windows-jdk9] }
[windows-jdk9] [withMaven] junitPublisher - Archive test results for Maven artifact org.apache.maven.wagon:wagon-provider-api:3.1.1-SNAPSHOT generated by maven-surefire-plugin:test (default-test): m\wagon-provider-api\target\surefire-reports\*.xml
[windows-jdk9] Recording test results
[windows-jdk9] [withMaven] junitPublisher - Archive test results for Maven artifact org.apache.maven.wagon:wagon-provider-test:3.1.1-SNAPSHOT generated by maven-surefire-plugin:test (default-test): m\wagon-provider-test\target\surefire-reports\*.xml
[windows-jdk9] Recording test results
[windows-jdk9] None of the test reports contained any result
[windows-jdk9] [withMaven] junitPublisher - Archive test results for Maven artifact org.apache.maven.wagon:wagon-file:3.1.1-SNAPSHOT generated by maven-surefire-plugin:test (default-test): m\wagon-providers\wagon-file\target\surefire-reports\*.xml
[windows-jdk9] Recording test results
[windows-jdk9] [withMaven] junitPublisher - Archive test results for Maven artifact org.apache.maven.wagon:wagon-ftp:3.1.1-SNAPSHOT generated by maven-surefire-plugin:test (default-test): m\wagon-providers\wagon-ftp\target\surefire-reports\*.xml
[windows-jdk9] Recording test results
[windows-jdk9] [withMaven] junitPublisher - Archive test results for Maven artifact org.apache.maven.wagon:wagon-http-shared:3.1.1-SNAPSHOT generated by maven-surefire-plugin:test (default-test): m\wagon-providers\wagon-http-shared\target\surefire-reports\*.xml
[windows-jdk9] Recording test results
[windows-jdk9] [withMaven] junitPublisher - Archive test results for Maven artifact org.apache.maven.wagon:wagon-tck-http:3.1.1-SNAPSHOT generated by maven-surefire-plugin:test (default-test): m\wagon-tcks\wagon-tck-http\target\surefire-reports\*.xml
[windows-jdk9] Recording test results
[windows-jdk9] None of the test reports contained any result
[windows-jdk9] [withMaven] junitPublisher - Archive test results for Maven artifact org.apache.maven.wagon:wagon-http:3.1.1-SNAPSHOT generated by maven-surefire-plugin:test (default-test): m\wagon-providers\wagon-http\target\surefire-reports\*.xml
[windows-jdk9] Recording test results
[windows-jdk9] [withMaven] junitPublisher - Archive test results for Maven artifact org.apache.maven.wagon:wagon-http-lightweight:3.1.1-SNAPSHOT generated by maven-surefire-plugin:test (default-test): m\wagon-providers\wagon-http-lightweight\target\surefire-reports\*.xml
[windows-jdk9] Recording test results
[windows-jdk9] [withMaven] junitPublisher - Archive test results for Maven artifact org.apache.maven.wagon:wagon-scm:3.1.1-SNAPSHOT generated by maven-surefire-plugin:test (default-test): m\wagon-providers\wagon-scm\target\surefire-reports\*.xml
[windows-jdk9] Recording test results
[windows-jdk9] [withMaven] junitPublisher - Archive test results for Maven artifact org.apache.maven.wagon:wagon-ssh-common:3.1.1-SNAPSHOT generated by maven-surefire-plugin:test (default-test): m\wagon-providers\wagon-ssh-common\target\surefire-reports\*.xml
[windows-jdk9] Recording test results
[windows-jdk9] [withMaven] junitPublisher - Archive test results for Maven artifact org.apache.maven.wagon:wagon-ssh-common-test:3.1.1-SNAPSHOT generated by maven-surefire-plugin:test (default-test): m\wagon-providers\wagon-ssh-common-test\target\surefire-reports\*.xml
[windows-jdk9] Recording test results
[windows-jdk9] None of the test reports contained any result
[windows-jdk9] [withMaven] junitPublisher - Archive test results for Maven artifact org.apache.maven.wagon:wagon-ssh-external:3.1.1-SNAPSHOT generated by maven-surefire-plugin:test (default-test): m\wagon-providers\wagon-ssh-external\target\surefire-reports\*.xml
[windows-jdk9] Recording test results
[windows-jdk9] None of the test reports contained any result
[windows-jdk9] [withMaven] junitPublisher - Archive test results for Maven artifact org.apache.maven.wagon:wagon-ssh:3.1.1-SNAPSHOT generated by maven-surefire-plugin:test (default-test): m\wagon-providers\wagon-ssh\target\surefire-reports\*.xml
[windows-jdk9] Recording test results
[windows-jdk9] None of the test reports contained any result
[windows-jdk9] [withMaven] junitPublisher - Archive test results for Maven artifact org.apache.maven.wagon:wagon-webdav-jackrabbit:3.1.1-SNAPSHOT generated by maven-surefire-plugin:test (default-test): m\wagon-providers\wagon-webdav-jackrabbit\target\surefire-reports\*.xml
[windows-jdk9] Recording test results
[Pipeline] [windows-jdk9] // withMaven
[Pipeline] [windows-jdk9] cleanWs
[windows-jdk9] [WS-CLEANUP] Deleting project workspace...[WS-CLEANUP] done
[Pipeline] [windows-jdk9] }
[Pipeline] [windows-jdk9] // stage
[Pipeline] [windows-jdk9] }
[Pipeline] [windows-jdk9] // node
[Pipeline] [windows-jdk9] }
[Pipeline] // parallel
[Pipeline] stage
[Pipeline] { (Notifications)
[Pipeline] echo
Build result: FAILURE
[Pipeline] jiraIssueSelector
[Pipeline] emailext