Build failed in Jenkins: Maven TLP » maven-wagon » WAGON-527 #3

classic Classic list List threaded Threaded
3 messages Options
Reply | Threaded
Open this post in threaded view
|

Build failed in Jenkins: Maven TLP » maven-wagon » WAGON-527 #3

Apache Jenkins Server-2
See https://builds.apache.org/job/maven-box/job/maven-wagon/job/WAGON-527/3/

No changes.

60 tests failed.
FAILED:  org.apache.maven.wagon.providers.ftp.FtpWagonTest.testDefaultUserName

Error Message:
Cannot login to remote system

Stack Trace:
org.apache.maven.wagon.ConnectionException: Cannot login to remote system
        at org.apache.maven.wagon.providers.ftp.FtpWagonTest.testDefaultUserName(FtpWagonTest.java:178)
Caused by: org.apache.commons.net.ftp.FTPConnectionClosedException: Connection closed without indication.
        at org.apache.maven.wagon.providers.ftp.FtpWagonTest.testDefaultUserName(FtpWagonTest.java:178)


FAILED:  org.apache.maven.wagon.providers.ftp.FtpWagonTest.testWagonGetIfNewerToStreamIsSame

Error Message:
Failed to bind to address 0.0.0.0/0.0.0.0:10023, check configuration

Stack Trace:
org.apache.ftpserver.FtpServerConfigurationException: Failed to bind to address 0.0.0.0/0.0.0.0:10023, check configuration
        at org.apache.maven.wagon.providers.ftp.FtpWagonTest.setupWagonTestingFixtures(FtpWagonTest.java:106)
Caused by: java.net.BindException: Address already in use: bind


FAILED:  org.apache.maven.wagon.providers.ftp.FtpWagonTest.testWagonPutDirectoryDeepDestination

Error Message:
IOException caught while attempting to upload F:\jenkins\jenkins-slave\workspace\n-box_maven-wagon_WAGON-527-KWYDRBGRPK7Q2YVCYHYJDNDOSEOHGQPJHV5AHJB4GNG66RKBHCBA@2\m\wagon-providers\wagon-ftp\target\test-output\deep0\deep1\deep2\c\test-resource-4.txt

Stack Trace:
org.apache.maven.wagon.TransferFailedException: IOException caught while attempting to upload F:\jenkins\jenkins-slave\workspace\n-box_maven-wagon_WAGON-527-KWYDRBGRPK7Q2YVCYHYJDNDOSEOHGQPJHV5AHJB4GNG66RKBHCBA@2\m\wagon-providers\wagon-ftp\target\test-output\deep0\deep1\deep2\c\test-resource-4.txt
Caused by: java.net.SocketException: Software caused connection abort: recv failed


FAILED:  org.apache.maven.wagon.providers.ftp.FtpWagonTest.testWagonGetFileListWhenDirectoryDoesNotExist

Error Message:
Could not connect to server.

Stack Trace:
org.apache.maven.wagon.authentication.AuthenticationException: Could not connect to server.
Caused by: java.net.ConnectException: Connection refused: connect


FAILED:  org.apache.maven.wagon.providers.ftp.FtpWagonTest.testWagon

Error Message:
Could not connect to server.

Stack Trace:
org.apache.maven.wagon.authentication.AuthenticationException: Could not connect to server.
Caused by: java.net.ConnectException: Connection refused: connect


FAILED:  org.apache.maven.wagon.providers.ftp.FtpWagonTest.testWagonPutDirectoryForDot

Error Message:
Could not connect to server.

Stack Trace:
org.apache.maven.wagon.authentication.AuthenticationException: Could not connect to server.
Caused by: java.net.ConnectException: Connection refused: connect


FAILED:  org.apache.maven.wagon.providers.ftp.FtpWagonTest.testWagonGetIfNewerIsNewer

Error Message:
Could not connect to server.

Stack Trace:
org.apache.maven.wagon.authentication.AuthenticationException: Could not connect to server.
Caused by: java.net.ConnectException: Connection refused: connect


FAILED:  org.apache.maven.wagon.providers.ftp.FtpWagonTest.testWagonGetIfNewerIsOlder

Error Message:
Could not connect to server.

Stack Trace:
org.apache.maven.wagon.authentication.AuthenticationException: Could not connect to server.
Caused by: java.net.ConnectException: Connection refused: connect


FAILED:  org.apache.maven.wagon.providers.ftp.FtpWagonTest.testWagonGetFileList

Error Message:
Could not connect to server.

Stack Trace:
org.apache.maven.wagon.authentication.AuthenticationException: Could not connect to server.
Caused by: java.net.ConnectException: Connection refused: connect


FAILED:  org.apache.maven.wagon.providers.ftp.FtpWagonTest.testFailedGet

Error Message:
Could not connect to server.

Stack Trace:
org.apache.maven.wagon.authentication.AuthenticationException: Could not connect to server.
Caused by: java.net.ConnectException: Connection refused: connect


FAILED:  org.apache.maven.wagon.providers.ftp.FtpWagonTest.testWagonPutDirectoryWhenDirectoryAlreadyExists

Error Message:
Could not connect to server.

Stack Trace:
org.apache.maven.wagon.authentication.AuthenticationException: Could not connect to server.
Caused by: java.net.ConnectException: Connection refused: connect


FAILED:  org.apache.maven.wagon.providers.ftp.FtpWagonTest.testWagonResourceExists

Error Message:
Could not connect to server.

Stack Trace:
org.apache.maven.wagon.authentication.AuthenticationException: Could not connect to server.
Caused by: java.net.ConnectException: Connection refused: connect


FAILED:  org.apache.maven.wagon.providers.ftp.FtpWagonTest.testFailedGetIfNewer

Error Message:
Could not connect to server.

Stack Trace:
org.apache.maven.wagon.authentication.AuthenticationException: Could not connect to server.
Caused by: java.net.ConnectException: Connection refused: connect


FAILED:  org.apache.maven.wagon.providers.ftp.FtpWagonTest.testWagonResourceNotExists

Error Message:
Could not connect to server.

Stack Trace:
org.apache.maven.wagon.authentication.AuthenticationException: Could not connect to server.
Caused by: java.net.ConnectException: Connection refused: connect


FAILED:  org.apache.maven.wagon.providers.ftp.FtpWagonTest.testWagonPutDirectory

Error Message:
Could not connect to server.

Stack Trace:
org.apache.maven.wagon.authentication.AuthenticationException: Could not connect to server.
Caused by: java.net.ConnectException: Connection refused: connect


FAILED:  org.apache.maven.wagon.providers.ftp.FtpWagonTest.testWagonGetIfNewerIsSame

Error Message:
Could not connect to server.

Stack Trace:
org.apache.maven.wagon.authentication.AuthenticationException: Could not connect to server.
Caused by: java.net.ConnectException: Connection refused: connect


FAILED:  org.apache.maven.wagon.providers.ftp.FtpWagonTest.testDefaultUserName

Error Message:
Cannot login to remote system

Stack Trace:
org.apache.maven.wagon.ConnectionException: Cannot login to remote system
        at org.apache.maven.wagon.providers.ftp.FtpWagonTest.testDefaultUserName(FtpWagonTest.java:178)
Caused by: org.apache.commons.net.ftp.FTPConnectionClosedException: Connection closed without indication.
        at org.apache.maven.wagon.providers.ftp.FtpWagonTest.testDefaultUserName(FtpWagonTest.java:178)


FAILED:  org.apache.maven.wagon.providers.http.LightweightHttpWagonTest.testSecuredPutFromStream

Error Message:
expected:<401> but was:<201>

Stack Trace:
junit.framework.AssertionFailedError: expected:<401> but was:<201>


FAILED:  org.apache.maven.wagon.providers.scm.ScmSvnExeWagonTest.testWagonPutDirectory

Error Message:
Error checking out: command failed: svn: E180001: Unable to connect to a repository at URL 'file://2/m/wagon-providers/wagon-scm/target/test-classes/test-repo-svn-test'
svn: E180001: Unable to open an ra_local session to URL
svn: E180001: Unable to open repository 'file://2/m/wagon-providers/wagon-scm/target/test-classes/test-repo-svn-test'

Stack Trace:
org.apache.maven.wagon.TransferFailedException:
Error checking out: command failed: svn: E180001: Unable to connect to a repository at URL 'file://2/m/wagon-providers/wagon-scm/target/test-classes/test-repo-svn-test'
svn: E180001: Unable to open an ra_local session to URL
svn: E180001: Unable to open repository 'file://2/m/wagon-providers/wagon-scm/target/test-classes/test-repo-svn-test'
Caused by: org.apache.maven.scm.ScmException:
command failed: svn: E180001: Unable to connect to a repository at URL 'file://2/m/wagon-providers/wagon-scm/target/test-classes/test-repo-svn-test'
svn: E180001: Unable to open an ra_local session to URL
svn: E180001: Unable to open repository 'file://2/m/wagon-providers/wagon-scm/target/test-classes/test-repo-svn-test'


FAILED:  org.apache.maven.wagon.providers.scm.ScmSvnExeWagonTest.testWagonPutDirectoryDeepDestination

Error Message:
Error checking out: command failed: svn: E180001: Unable to connect to a repository at URL 'file://2/m/wagon-providers/wagon-scm/target/test-classes/test-repo-svn-test'
svn: E180001: Unable to open an ra_local session to URL
svn: E180001: Unable to open repository 'file://2/m/wagon-providers/wagon-scm/target/test-classes/test-repo-svn-test'

Stack Trace:
org.apache.maven.wagon.TransferFailedException:
Error checking out: command failed: svn: E180001: Unable to connect to a repository at URL 'file://2/m/wagon-providers/wagon-scm/target/test-classes/test-repo-svn-test'
svn: E180001: Unable to open an ra_local session to URL
svn: E180001: Unable to open repository 'file://2/m/wagon-providers/wagon-scm/target/test-classes/test-repo-svn-test'
Caused by: org.apache.maven.scm.ScmException:
command failed: svn: E180001: Unable to connect to a repository at URL 'file://2/m/wagon-providers/wagon-scm/target/test-classes/test-repo-svn-test'
svn: E180001: Unable to open an ra_local session to URL
svn: E180001: Unable to open repository 'file://2/m/wagon-providers/wagon-scm/target/test-classes/test-repo-svn-test'


FAILED:  org.apache.maven.wagon.providers.scm.ScmSvnExeWagonTest.testWagon

Error Message:

  Unexpected method call TransferListener.transferError(TransferEvent[GET|ERROR|Repository[scm:svn:file://2/m/wagon-providers/wagon-scm/target/test-classes/test-repo-svn-test]|null|test-resource[len = 18; mod = 1536774152622]]):
    TransferListener.transferCompleted(TransferEvent[PUT|COMPLETED|Repository[scm:svn:file://2/m/wagon-providers/wagon-scm/target/test-classes/test-repo-svn-test]|F:\jenkins\jenkins-slave\workspace\n-box_maven-wagon_WAGON-527-KWYDRBGRPK7Q2YVCYHYJDNDOSEOHGQPJHV5AHJB4GNG66RKBHCBA@2\m\wagon-providers\wagon-scm\target\test-output\test-resource|test-resource[len = 18; mod = 1536774152622]]): expected: 1, actual: 0

Stack Trace:
java.lang.AssertionError:

  Unexpected method call TransferListener.transferError(TransferEvent[GET|ERROR|Repository[scm:svn:file://2/m/wagon-providers/wagon-scm/target/test-classes/test-repo-svn-test]|null|test-resource[len = 18; mod = 1536774152622]]):
    TransferListener.transferCompleted(TransferEvent[PUT|COMPLETED|Repository[scm:svn:file://2/m/wagon-providers/wagon-scm/target/test-classes/test-repo-svn-test]|F:\jenkins\jenkins-slave\workspace\n-box_maven-wagon_WAGON-527-KWYDRBGRPK7Q2YVCYHYJDNDOSEOHGQPJHV5AHJB4GNG66RKBHCBA@2\m\wagon-providers\wagon-scm\target\test-output\test-resource|test-resource[len = 18; mod = 1536774152622]]): expected: 1, actual: 0


FAILED:  org.apache.maven.wagon.providers.scm.ScmSvnExeWagonTest.testWagonPutDirectoryForDot

Error Message:
Error checking out: command failed: svn: E180001: Unable to connect to a repository at URL 'file://2/m/wagon-providers/wagon-scm/target/test-classes/test-repo-svn-test'
svn: E180001: Unable to open an ra_local session to URL
svn: E180001: Unable to open repository 'file://2/m/wagon-providers/wagon-scm/target/test-classes/test-repo-svn-test'

Stack Trace:
org.apache.maven.wagon.TransferFailedException:
Error checking out: command failed: svn: E180001: Unable to connect to a repository at URL 'file://2/m/wagon-providers/wagon-scm/target/test-classes/test-repo-svn-test'
svn: E180001: Unable to open an ra_local session to URL
svn: E180001: Unable to open repository 'file://2/m/wagon-providers/wagon-scm/target/test-classes/test-repo-svn-test'
Caused by: org.apache.maven.scm.ScmException:
command failed: svn: E180001: Unable to connect to a repository at URL 'file://2/m/wagon-providers/wagon-scm/target/test-classes/test-repo-svn-test'
svn: E180001: Unable to open an ra_local session to URL
svn: E180001: Unable to open repository 'file://2/m/wagon-providers/wagon-scm/target/test-classes/test-repo-svn-test'


FAILED:  org.apache.maven.wagon.providers.scm.ScmSvnExeWagonTest.testWagonGetFileList

Error Message:

  Unexpected method call TransferListener.transferError(TransferEvent[GET|ERROR|Repository[scm:svn:file://2/m/wagon-providers/wagon-scm/target/test-classes/test-repo-svn-test]|null|file-list/test-resource.txt[len = 18; mod = 1536774153032]]):
    TransferListener.transferCompleted(TransferEvent[PUT|COMPLETED|Repository[scm:svn:file://2/m/wagon-providers/wagon-scm/target/test-classes/test-repo-svn-test]|F:\jenkins\jenkins-slave\workspace\n-box_maven-wagon_WAGON-527-KWYDRBGRPK7Q2YVCYHYJDNDOSEOHGQPJHV5AHJB4GNG66RKBHCBA@2\m\wagon-providers\wagon-scm\target\test-output\file-list\test-resource.txt|file-list/test-resource.txt[len = 18; mod = 1536774153032]]): expected: 1, actual: 0

Stack Trace:
java.lang.AssertionError:

  Unexpected method call TransferListener.transferError(TransferEvent[GET|ERROR|Repository[scm:svn:file://2/m/wagon-providers/wagon-scm/target/test-classes/test-repo-svn-test]|null|file-list/test-resource.txt[len = 18; mod = 1536774153032]]):
    TransferListener.transferCompleted(TransferEvent[PUT|COMPLETED|Repository[scm:svn:file://2/m/wagon-providers/wagon-scm/target/test-classes/test-repo-svn-test]|F:\jenkins\jenkins-slave\workspace\n-box_maven-wagon_WAGON-527-KWYDRBGRPK7Q2YVCYHYJDNDOSEOHGQPJHV5AHJB4GNG66RKBHCBA@2\m\wagon-providers\wagon-scm\target\test-output\file-list\test-resource.txt|file-list/test-resource.txt[len = 18; mod = 1536774153032]]): expected: 1, actual: 0


FAILED:  org.apache.maven.wagon.providers.scm.ScmSvnExeWagonTest.testFailedGet

Error Message:
Error getting file from SCM

Stack Trace:
org.apache.maven.wagon.TransferFailedException: Error getting file from SCM
Caused by: org.apache.maven.scm.ScmException:
command failed: svn: E180001: Unable to connect to a repository at URL 'file://2/m/wagon-providers/wagon-scm/target/test-classes/test-repo-svn-test'
svn: E180001: Unable to open an ra_local session to URL
svn: E180001: Unable to open repository 'file://2/m/wagon-providers/wagon-scm/target/test-classes/test-repo-svn-test'


FAILED:  org.apache.maven.wagon.providers.scm.ScmSvnExeWagonTest.testWagonPutDirectoryWhenDirectoryAlreadyExists

Error Message:
Error checking out: command failed: svn: E180001: Unable to connect to a repository at URL 'file://2/m/wagon-providers/wagon-scm/target/test-classes/test-repo-svn-test'
svn: E180001: Unable to open an ra_local session to URL
svn: E180001: Unable to open repository 'file://2/m/wagon-providers/wagon-scm/target/test-classes/test-repo-svn-test'

Stack Trace:
org.apache.maven.wagon.TransferFailedException:
Error checking out: command failed: svn: E180001: Unable to connect to a repository at URL 'file://2/m/wagon-providers/wagon-scm/target/test-classes/test-repo-svn-test'
svn: E180001: Unable to open an ra_local session to URL
svn: E180001: Unable to open repository 'file://2/m/wagon-providers/wagon-scm/target/test-classes/test-repo-svn-test'
Caused by: org.apache.maven.scm.ScmException:
command failed: svn: E180001: Unable to connect to a repository at URL 'file://2/m/wagon-providers/wagon-scm/target/test-classes/test-repo-svn-test'
svn: E180001: Unable to open an ra_local session to URL
svn: E180001: Unable to open repository 'file://2/m/wagon-providers/wagon-scm/target/test-classes/test-repo-svn-test'


FAILED:  org.apache.maven.wagon.providers.scm.ScmSvnExeWagonTest.testWagonResourceExists

Error Message:

  Unexpected method call TransferListener.transferError(TransferEvent[GET|ERROR|Repository[scm:svn:file://2/m/wagon-providers/wagon-scm/target/test-classes/test-repo-svn-test]|null|test-resource[len = 18; mod = 1536774153517]]):
    TransferListener.transferCompleted(TransferEvent[PUT|COMPLETED|Repository[scm:svn:file://2/m/wagon-providers/wagon-scm/target/test-classes/test-repo-svn-test]|F:\jenkins\jenkins-slave\workspace\n-box_maven-wagon_WAGON-527-KWYDRBGRPK7Q2YVCYHYJDNDOSEOHGQPJHV5AHJB4GNG66RKBHCBA@2\m\wagon-providers\wagon-scm\target\test-output\test-resource|test-resource[len = 18; mod = 1536774153517]]): expected: 1, actual: 0

Stack Trace:
java.lang.AssertionError:

  Unexpected method call TransferListener.transferError(TransferEvent[GET|ERROR|Repository[scm:svn:file://2/m/wagon-providers/wagon-scm/target/test-classes/test-repo-svn-test]|null|test-resource[len = 18; mod = 1536774153517]]):
    TransferListener.transferCompleted(TransferEvent[PUT|COMPLETED|Repository[scm:svn:file://2/m/wagon-providers/wagon-scm/target/test-classes/test-repo-svn-test]|F:\jenkins\jenkins-slave\workspace\n-box_maven-wagon_WAGON-527-KWYDRBGRPK7Q2YVCYHYJDNDOSEOHGQPJHV5AHJB4GNG66RKBHCBA@2\m\wagon-providers\wagon-scm\target\test-output\test-resource|test-resource[len = 18; mod = 1536774153517]]): expected: 1, actual: 0


FAILED:  org.apache.maven.wagon.providers.webdav.WebDavsWagonTest.testWagonGetFileListWhenDirectoryDoesNotExist

Error Message:
File F:\jenkins\jenkins-slave\workspace\n-box_maven-wagon_WAGON-527-KWYDRBGRPK7Q2YVCYHYJDNDOSEOHGQPJHV5AHJB4GNG66RKBHCBA\m\wagon-providers\wagon-webdav-jackrabbit\target\test-output\http-repository\newfolder\folder2\deep0\deep1\deep2\a\b\test-resource-3.txt unable to be deleted.

Stack Trace:
java.io.IOException: File F:\jenkins\jenkins-slave\workspace\n-box_maven-wagon_WAGON-527-KWYDRBGRPK7Q2YVCYHYJDNDOSEOHGQPJHV5AHJB4GNG66RKBHCBA\m\wagon-providers\wagon-webdav-jackrabbit\target\test-output\http-repository\newfolder\folder2\deep0\deep1\deep2\a\b\test-resource-3.txt unable to be deleted.


FAILED:  org.apache.maven.wagon.providers.scm.ScmGitExeWagonTest.testFailedGet

Error Message:
Error getting file from SCM

Stack Trace:
org.apache.maven.wagon.TransferFailedException: Error getting file from SCM
Caused by: org.apache.maven.scm.ScmException:
command failed: 'git' is not recognized as an internal or external command,
operable program or batch file.


FAILED:  org.apache.maven.wagon.providers.scm.ScmGitExeWagonTest.testFailedGet

Error Message:
Error getting file from SCM

Stack Trace:
org.apache.maven.wagon.TransferFailedException: Error getting file from SCM
Caused by: org.apache.maven.scm.ScmException:
command failed: 'git' is not recognized as an internal or external command,
operable program or batch file.


FAILED:  org.apache.maven.wagon.providers.scm.ScmGitExeWagonTest.testFailedGet

Error Message:
Error getting file from SCM

Stack Trace:
org.apache.maven.wagon.TransferFailedException: Error getting file from SCM
Caused by: org.apache.maven.scm.ScmException:
command failed: 'git' is not recognized as an internal or external command,
operable program or batch file.


FAILED:  org.apache.maven.wagon.providers.scm.ScmGitExeWagonTest.testWagonPutDirectory

Error Message:
Error interacting with SCM: Unable to commit file. The git-commit command failed.
*** Please tell me who you are.

Run

  git config --global user.email "[hidden email]"
  git config --global user.name "Your Name"

to set your account's default identity.
Omit --global to set the identity only in this repository.

fatal:********@asf935.gq1.ygridcore.net>) not allowed


Stack Trace:
org.apache.maven.wagon.TransferFailedException:
Error interacting with SCM: Unable to commit file. The git-commit command failed.
*** Please tell me who you are.

Run

  git config --global user.email "[hidden email]"
  git config --global user.name "Your Name"

to set your account's default identity.
Omit --global to set the identity only in this repository.

fatal:********@asf935.gq1.ygridcore.net>) not allowed

Caused by: org.apache.maven.scm.ScmException:
Unable to commit file. The git-commit command failed.
*** Please tell me who you are.

Run

  git config --global user.email "[hidden email]"
  git config --global user.name "Your Name"

to set your account's default identity.
Omit --global to set the identity only in this repository.

fatal:********@asf935.gq1.ygridcore.net>) not allowed



FAILED:  org.apache.maven.wagon.providers.scm.ScmGitExeWagonTest.testWagonPutDirectoryDeepDestination

Error Message:
Error interacting with SCM: Unable to commit file. The git-commit command failed.
*** Please tell me who you are.

Run

  git config --global user.email "[hidden email]"
  git config --global user.name "Your Name"

to set your account's default identity.
Omit --global to set the identity only in this repository.

fatal:********@asf935.gq1.ygridcore.net>) not allowed


Stack Trace:
org.apache.maven.wagon.TransferFailedException:
Error interacting with SCM: Unable to commit file. The git-commit command failed.
*** Please tell me who you are.

Run

  git config --global user.email "[hidden email]"
  git config --global user.name "Your Name"

to set your account's default identity.
Omit --global to set the identity only in this repository.

fatal:********@asf935.gq1.ygridcore.net>) not allowed

Caused by: org.apache.maven.scm.ScmException:
Unable to commit file. The git-commit command failed.
*** Please tell me who you are.

Run

  git config --global user.email "[hidden email]"
  git config --global user.name "Your Name"

to set your account's default identity.
Omit --global to set the identity only in this repository.

fatal:********@asf935.gq1.ygridcore.net>) not allowed



FAILED:  org.apache.maven.wagon.providers.scm.ScmGitExeWagonTest.testWagon

Error Message:

  Unexpected method call TransferListener.transferError(TransferEvent[PUT|ERROR|Repository[scm:git:file:///home/jenkins/jenkins-slave/workspace/n-box_maven-wagon_WAGON-527-KWYDRBGRPK7Q2YVCYHYJDNDOSEOHGQPJHV5AHJB4GNG66RKBHCBA/m/wagon-providers/wagon-scm/target/test-classes/test-repo-git-test/]|null|test-resource[len = 18; mod = 1536774158000]]):
    TransferListener.transferCompleted(TransferEvent[PUT|COMPLETED|Repository[scm:git:file:///home/jenkins/jenkins-slave/workspace/n-box_maven-wagon_WAGON-527-KWYDRBGRPK7Q2YVCYHYJDNDOSEOHGQPJHV5AHJB4GNG66RKBHCBA/m/wagon-providers/wagon-scm/target/test-classes/test-repo-git-test/]|/home/jenkins/jenkins-slave/workspace/n-box_maven-wagon_WAGON-527-KWYDRBGRPK7Q2YVCYHYJDNDOSEOHGQPJHV5AHJB4GNG66RKBHCBA/m/wagon-providers/wagon-scm/target/test-output/test-resource|test-resource[len = 18; mod = 1536774158000]]): expected: 1, actual: 0

Stack Trace:
java.lang.AssertionError:

  Unexpected method call TransferListener.transferError(TransferEvent[PUT|ERROR|Repository[scm:git:file:///home/jenkins/jenkins-slave/workspace/n-box_maven-wagon_WAGON-527-KWYDRBGRPK7Q2YVCYHYJDNDOSEOHGQPJHV5AHJB4GNG66RKBHCBA/m/wagon-providers/wagon-scm/target/test-classes/test-repo-git-test/]|null|test-resource[len = 18; mod = 1536774158000]]):
    TransferListener.transferCompleted(TransferEvent[PUT|COMPLETED|Repository[scm:git:file:///home/jenkins/jenkins-slave/workspace/n-box_maven-wagon_WAGON-527-KWYDRBGRPK7Q2YVCYHYJDNDOSEOHGQPJHV5AHJB4GNG66RKBHCBA/m/wagon-providers/wagon-scm/target/test-classes/test-repo-git-test/]|/home/jenkins/jenkins-slave/workspace/n-box_maven-wagon_WAGON-527-KWYDRBGRPK7Q2YVCYHYJDNDOSEOHGQPJHV5AHJB4GNG66RKBHCBA/m/wagon-providers/wagon-scm/target/test-output/test-resource|test-resource[len = 18; mod = 1536774158000]]): expected: 1, actual: 0


FAILED:  org.apache.maven.wagon.providers.scm.ScmGitExeWagonTest.testWagonPutDirectoryForDot

Error Message:
Error interacting with SCM: Unable to commit file. The git-commit command failed.
*** Please tell me who you are.

Run

  git config --global user.email "[hidden email]"
  git config --global user.name "Your Name"

to set your account's default identity.
Omit --global to set the identity only in this repository.

fatal:********@asf935.gq1.ygridcore.net>) not allowed


Stack Trace:
org.apache.maven.wagon.TransferFailedException:
Error interacting with SCM: Unable to commit file. The git-commit command failed.
*** Please tell me who you are.

Run

  git config --global user.email "[hidden email]"
  git config --global user.name "Your Name"

to set your account's default identity.
Omit --global to set the identity only in this repository.

fatal:********@asf935.gq1.ygridcore.net>) not allowed

Caused by: org.apache.maven.scm.ScmException:
Unable to commit file. The git-commit command failed.
*** Please tell me who you are.

Run

  git config --global user.email "[hidden email]"
  git config --global user.name "Your Name"

to set your account's default identity.
Omit --global to set the identity only in this repository.

fatal:********@asf935.gq1.ygridcore.net>) not allowed



FAILED:  org.apache.maven.wagon.providers.scm.ScmGitExeWagonTest.testWagonPutDirectoryWhenDirectoryAlreadyExists

Error Message:
Error interacting with SCM: Unable to commit file. The git-commit command failed.
*** Please tell me who you are.

Run

  git config --global user.email "[hidden email]"
  git config --global user.name "Your Name"

to set your account's default identity.
Omit --global to set the identity only in this repository.

fatal:********@asf935.gq1.ygridcore.net>) not allowed


Stack Trace:
org.apache.maven.wagon.TransferFailedException:
Error interacting with SCM: Unable to commit file. The git-commit command failed.
*** Please tell me who you are.

Run

  git config --global user.email "[hidden email]"
  git config --global user.name "Your Name"

to set your account's default identity.
Omit --global to set the identity only in this repository.

fatal:********@asf935.gq1.ygridcore.net>) not allowed

Caused by: org.apache.maven.scm.ScmException:
Unable to commit file. The git-commit command failed.
*** Please tell me who you are.

Run

  git config --global user.email "[hidden email]"
  git config --global user.name "Your Name"

to set your account's default identity.
Omit --global to set the identity only in this repository.

fatal:********@asf935.gq1.ygridcore.net>) not allowed



FAILED:  org.apache.maven.wagon.providers.scm.ScmGitExeWagonTest.testWagonPutDirectory

Error Message:
Error checking out: command failed: 'git' is not recognized as an internal or external command,
operable program or batch file.

Stack Trace:
org.apache.maven.wagon.TransferFailedException:
Error checking out: command failed: 'git' is not recognized as an internal or external command,
operable program or batch file.
Caused by: org.apache.maven.scm.ScmException:
command failed: 'git' is not recognized as an internal or external command,
operable program or batch file.


FAILED:  org.apache.maven.wagon.providers.scm.ScmGitExeWagonTest.testWagonPutDirectoryDeepDestination

Error Message:
Error checking out: command failed: 'git' is not recognized as an internal or external command,
operable program or batch file.

Stack Trace:
org.apache.maven.wagon.TransferFailedException:
Error checking out: command failed: 'git' is not recognized as an internal or external command,
operable program or batch file.
Caused by: org.apache.maven.scm.ScmException:
command failed: 'git' is not recognized as an internal or external command,
operable program or batch file.


FAILED:  org.apache.maven.wagon.providers.scm.ScmGitExeWagonTest.testWagon

Error Message:

  Unexpected method call TransferListener.transferError(TransferEvent[GET|ERROR|Repository[scm:git:file://2/m/wagon-providers/wagon-scm/target/test-classes/test-repo-git-test/]|null|test-resource[len = 18; mod = 1536774149257]]):
    TransferListener.transferCompleted(TransferEvent[PUT|COMPLETED|Repository[scm:git:file://2/m/wagon-providers/wagon-scm/target/test-classes/test-repo-git-test/]|F:\jenkins\jenkins-slave\workspace\n-box_maven-wagon_WAGON-527-KWYDRBGRPK7Q2YVCYHYJDNDOSEOHGQPJHV5AHJB4GNG66RKBHCBA@2\m\wagon-providers\wagon-scm\target\test-output\test-resource|test-resource[len = 18; mod = 1536774149257]]): expected: 1, actual: 0

Stack Trace:
java.lang.AssertionError:

  Unexpected method call TransferListener.transferError(TransferEvent[GET|ERROR|Repository[scm:git:file://2/m/wagon-providers/wagon-scm/target/test-classes/test-repo-git-test/]|null|test-resource[len = 18; mod = 1536774149257]]):
    TransferListener.transferCompleted(TransferEvent[PUT|COMPLETED|Repository[scm:git:file://2/m/wagon-providers/wagon-scm/target/test-classes/test-repo-git-test/]|F:\jenkins\jenkins-slave\workspace\n-box_maven-wagon_WAGON-527-KWYDRBGRPK7Q2YVCYHYJDNDOSEOHGQPJHV5AHJB4GNG66RKBHCBA@2\m\wagon-providers\wagon-scm\target\test-output\test-resource|test-resource[len = 18; mod = 1536774149257]]): expected: 1, actual: 0


FAILED:  org.apache.maven.wagon.providers.scm.ScmGitExeWagonTest.testWagonPutDirectoryForDot

Error Message:
Error checking out: command failed: 'git' is not recognized as an internal or external command,
operable program or batch file.

Stack Trace:
org.apache.maven.wagon.TransferFailedException:
Error checking out: command failed: 'git' is not recognized as an internal or external command,
operable program or batch file.
Caused by: org.apache.maven.scm.ScmException:
command failed: 'git' is not recognized as an internal or external command,
operable program or batch file.


FAILED:  org.apache.maven.wagon.providers.scm.ScmGitExeWagonTest.testWagonPutDirectoryWhenDirectoryAlreadyExists

Error Message:
Error checking out: command failed: 'git' is not recognized as an internal or external command,
operable program or batch file.

Stack Trace:
org.apache.maven.wagon.TransferFailedException:
Error checking out: command failed: 'git' is not recognized as an internal or external command,
operable program or batch file.
Caused by: org.apache.maven.scm.ScmException:
command failed: 'git' is not recognized as an internal or external command,
operable program or batch file.


FAILED:  org.apache.maven.wagon.providers.scm.ScmGitExeWagonTest.testWagonPutDirectory

Error Message:
Error checking out: command failed: 'git' is not recognized as an internal or external command,
operable program or batch file.

Stack Trace:
org.apache.maven.wagon.TransferFailedException:
Error checking out: command failed: 'git' is not recognized as an internal or external command,
operable program or batch file.
Caused by: org.apache.maven.scm.ScmException:
command failed: 'git' is not recognized as an internal or external command,
operable program or batch file.


FAILED:  org.apache.maven.wagon.providers.scm.ScmGitExeWagonTest.testWagonPutDirectoryDeepDestination

Error Message:
Error checking out: command failed: 'git' is not recognized as an internal or external command,
operable program or batch file.

Stack Trace:
org.apache.maven.wagon.TransferFailedException:
Error checking out: command failed: 'git' is not recognized as an internal or external command,
operable program or batch file.
Caused by: org.apache.maven.scm.ScmException:
command failed: 'git' is not recognized as an internal or external command,
operable program or batch file.


FAILED:  org.apache.maven.wagon.providers.scm.ScmGitExeWagonTest.testWagon

Error Message:

  Unexpected method call TransferListener.transferError(TransferEvent[GET|ERROR|Repository[scm:git:file:///F:/jenkins/jenkins-slave/workspace/n-box_maven-wagon_WAGON-527-KWYDRBGRPK7Q2YVCYHYJDNDOSEOHGQPJHV5AHJB4GNG66RKBHCBA/m/wagon-providers/wagon-scm/target/test-classes/test-repo-git-test/]|null|test-resource[len = 18; mod = 1536774141357]]):
    TransferListener.transferCompleted(TransferEvent[PUT|COMPLETED|Repository[scm:git:file:///F:/jenkins/jenkins-slave/workspace/n-box_maven-wagon_WAGON-527-KWYDRBGRPK7Q2YVCYHYJDNDOSEOHGQPJHV5AHJB4GNG66RKBHCBA/m/wagon-providers/wagon-scm/target/test-classes/test-repo-git-test/]|F:\jenkins\jenkins-slave\workspace\n-box_maven-wagon_WAGON-527-KWYDRBGRPK7Q2YVCYHYJDNDOSEOHGQPJHV5AHJB4GNG66RKBHCBA\m\wagon-providers\wagon-scm\target\test-output\test-resource|test-resource[len = 18; mod = 1536774141357]]): expected: 1, actual: 0

Stack Trace:
java.lang.AssertionError:

  Unexpected method call TransferListener.transferError(TransferEvent[GET|ERROR|Repository[scm:git:file:///F:/jenkins/jenkins-slave/workspace/n-box_maven-wagon_WAGON-527-KWYDRBGRPK7Q2YVCYHYJDNDOSEOHGQPJHV5AHJB4GNG66RKBHCBA/m/wagon-providers/wagon-scm/target/test-classes/test-repo-git-test/]|null|test-resource[len = 18; mod = 1536774141357]]):
    TransferListener.transferCompleted(TransferEvent[PUT|COMPLETED|Repository[scm:git:file:///F:/jenkins/jenkins-slave/workspace/n-box_maven-wagon_WAGON-527-KWYDRBGRPK7Q2YVCYHYJDNDOSEOHGQPJHV5AHJB4GNG66RKBHCBA/m/wagon-providers/wagon-scm/target/test-classes/test-repo-git-test/]|F:\jenkins\jenkins-slave\workspace\n-box_maven-wagon_WAGON-527-KWYDRBGRPK7Q2YVCYHYJDNDOSEOHGQPJHV5AHJB4GNG66RKBHCBA\m\wagon-providers\wagon-scm\target\test-output\test-resource|test-resource[len = 18; mod = 1536774141357]]): expected: 1, actual: 0


FAILED:  org.apache.maven.wagon.providers.scm.ScmGitExeWagonTest.testWagonPutDirectoryForDot

Error Message:
Error checking out: command failed: 'git' is not recognized as an internal or external command,
operable program or batch file.

Stack Trace:
org.apache.maven.wagon.TransferFailedException:
Error checking out: command failed: 'git' is not recognized as an internal or external command,
operable program or batch file.
Caused by: org.apache.maven.scm.ScmException:
command failed: 'git' is not recognized as an internal or external command,
operable program or batch file.


FAILED:  org.apache.maven.wagon.providers.scm.ScmGitExeWagonTest.testWagonPutDirectoryWhenDirectoryAlreadyExists

Error Message:
Error checking out: command failed: 'git' is not recognized as an internal or external command,
operable program or batch file.

Stack Trace:
org.apache.maven.wagon.TransferFailedException:
Error checking out: command failed: 'git' is not recognized as an internal or external command,
operable program or batch file.
Caused by: org.apache.maven.scm.ScmException:
command failed: 'git' is not recognized as an internal or external command,
operable program or batch file.


FAILED:  org.apache.maven.wagon.providers.scm.ScmGitExeWagonTest.testWagonPutDirectory

Error Message:
Error interacting with SCM: Unable to commit file. The git-commit command failed.
*** Please tell me who you are.

Run

  git config --global user.email "[hidden email]"
  git config --global user.name "Your Name"

to set your account's default identity.
Omit --global to set the identity only in this repository.

fatal:********@asf932.gq1.ygridcore.net>) not allowed


Stack Trace:
org.apache.maven.wagon.TransferFailedException:
Error interacting with SCM: Unable to commit file. The git-commit command failed.
*** Please tell me who you are.

Run

  git config --global user.email "[hidden email]"
  git config --global user.name "Your Name"

to set your account's default identity.
Omit --global to set the identity only in this repository.

fatal:********@asf932.gq1.ygridcore.net>) not allowed

Caused by: org.apache.maven.scm.ScmException:
Unable to commit file. The git-commit command failed.
*** Please tell me who you are.

Run

  git config --global user.email "[hidden email]"
  git config --global user.name "Your Name"

to set your account's default identity.
Omit --global to set the identity only in this repository.

fatal:********@asf932.gq1.ygridcore.net>) not allowed



FAILED:  org.apache.maven.wagon.providers.scm.ScmGitExeWagonTest.testWagonPutDirectoryDeepDestination

Error Message:
Error interacting with SCM: Unable to commit file. The git-commit command failed.
*** Please tell me who you are.

Run

  git config --global user.email "[hidden email]"
  git config --global user.name "Your Name"

to set your account's default identity.
Omit --global to set the identity only in this repository.

fatal:********@asf932.gq1.ygridcore.net>) not allowed


Stack Trace:
org.apache.maven.wagon.TransferFailedException:
Error interacting with SCM: Unable to commit file. The git-commit command failed.
*** Please tell me who you are.

Run

  git config --global user.email "[hidden email]"
  git config --global user.name "Your Name"

to set your account's default identity.
Omit --global to set the identity only in this repository.

fatal:********@asf932.gq1.ygridcore.net>) not allowed

Caused by: org.apache.maven.scm.ScmException:
Unable to commit file. The git-commit command failed.
*** Please tell me who you are.

Run

  git config --global user.email "[hidden email]"
  git config --global user.name "Your Name"

to set your account's default identity.
Omit --global to set the identity only in this repository.

fatal:********@asf932.gq1.ygridcore.net>) not allowed



FAILED:  org.apache.maven.wagon.providers.scm.ScmGitExeWagonTest.testWagon

Error Message:

  Unexpected method call TransferListener.transferError(TransferEvent[PUT|ERROR|Repository[scm:git:file:///home/jenkins/jenkins-slave/workspace/n-box_maven-wagon_WAGON-527-KWYDRBGRPK7Q2YVCYHYJDNDOSEOHGQPJHV5AHJB4GNG66RKBHCBA/m/wagon-providers/wagon-scm/target/test-classes/test-repo-git-test/]|null|test-resource[len = 18; mod = 1536774207000]]):
    TransferListener.transferCompleted(TransferEvent[PUT|COMPLETED|Repository[scm:git:file:///home/jenkins/jenkins-slave/workspace/n-box_maven-wagon_WAGON-527-KWYDRBGRPK7Q2YVCYHYJDNDOSEOHGQPJHV5AHJB4GNG66RKBHCBA/m/wagon-providers/wagon-scm/target/test-classes/test-repo-git-test/]|/home/jenkins/jenkins-slave/workspace/n-box_maven-wagon_WAGON-527-KWYDRBGRPK7Q2YVCYHYJDNDOSEOHGQPJHV5AHJB4GNG66RKBHCBA/m/wagon-providers/wagon-scm/target/test-output/test-resource|test-resource[len = 18; mod = 1536774207000]]): expected: 1, actual: 0

Stack Trace:
java.lang.AssertionError:

  Unexpected method call TransferListener.transferError(TransferEvent[PUT|ERROR|Repository[scm:git:file:///home/jenkins/jenkins-slave/workspace/n-box_maven-wagon_WAGON-527-KWYDRBGRPK7Q2YVCYHYJDNDOSEOHGQPJHV5AHJB4GNG66RKBHCBA/m/wagon-providers/wagon-scm/target/test-classes/test-repo-git-test/]|null|test-resource[len = 18; mod = 1536774207000]]):
    TransferListener.transferCompleted(TransferEvent[PUT|COMPLETED|Repository[scm:git:file:///home/jenkins/jenkins-slave/workspace/n-box_maven-wagon_WAGON-527-KWYDRBGRPK7Q2YVCYHYJDNDOSEOHGQPJHV5AHJB4GNG66RKBHCBA/m/wagon-providers/wagon-scm/target/test-classes/test-repo-git-test/]|/home/jenkins/jenkins-slave/workspace/n-box_maven-wagon_WAGON-527-KWYDRBGRPK7Q2YVCYHYJDNDOSEOHGQPJHV5AHJB4GNG66RKBHCBA/m/wagon-providers/wagon-scm/target/test-output/test-resource|test-resource[len = 18; mod = 1536774207000]]): expected: 1, actual: 0


FAILED:  org.apache.maven.wagon.providers.scm.ScmGitExeWagonTest.testWagonPutDirectoryForDot

Error Message:
Error interacting with SCM: Unable to commit file. The git-commit command failed.
*** Please tell me who you are.

Run

  git config --global user.email "[hidden email]"
  git config --global user.name "Your Name"

to set your account's default identity.
Omit --global to set the identity only in this repository.

fatal:********@asf932.gq1.ygridcore.net>) not allowed


Stack Trace:
org.apache.maven.wagon.TransferFailedException:
Error interacting with SCM: Unable to commit file. The git-commit command failed.
*** Please tell me who you are.

Run

  git config --global user.email "[hidden email]"
  git config --global user.name "Your Name"

to set your account's default identity.
Omit --global to set the identity only in this repository.

fatal:********@asf932.gq1.ygridcore.net>) not allowed

Caused by: org.apache.maven.scm.ScmException:
Unable to commit file. The git-commit command failed.
*** Please tell me who you are.

Run

  git config --global user.email "[hidden email]"
  git config --global user.name "Your Name"

to set your account's default identity.
Omit --global to set the identity only in this repository.

fatal:********@asf932.gq1.ygridcore.net>) not allowed



FAILED:  org.apache.maven.wagon.providers.scm.ScmGitExeWagonTest.testWagonPutDirectoryWhenDirectoryAlreadyExists

Error Message:
Error interacting with SCM: Unable to commit file. The git-commit command failed.
*** Please tell me who you are.

Run

  git config --global user.email "[hidden email]"
  git config --global user.name "Your Name"

to set your account's default identity.
Omit --global to set the identity only in this repository.

fatal:********@asf932.gq1.ygridcore.net>) not allowed


Stack Trace:
org.apache.maven.wagon.TransferFailedException:
Error interacting with SCM: Unable to commit file. The git-commit command failed.
*** Please tell me who you are.

Run

  git config --global user.email "[hidden email]"
  git config --global user.name "Your Name"

to set your account's default identity.
Omit --global to set the identity only in this repository.

fatal:********@asf932.gq1.ygridcore.net>) not allowed

Caused by: org.apache.maven.scm.ScmException:
Unable to commit file. The git-commit command failed.
*** Please tell me who you are.

Run

  git config --global user.email "[hidden email]"
  git config --global user.name "Your Name"

to set your account's default identity.
Omit --global to set the identity only in this repository.

fatal:********@asf932.gq1.ygridcore.net>) not allowed



FAILED:  org.apache.maven.wagon.providers.scm.ScmGitExeWagonTest.testWagonPutDirectory

Error Message:
Error interacting with SCM: Unable to commit file. The git-commit command failed.
*** Please tell me who you are.

Run

  git config --global user.email "[hidden email]"
  git config --global user.name "Your Name"

to set your account's default identity.
Omit --global to set the identity only in this repository.

fatal:********@base.apache.org>) not allowed


Stack Trace:
org.apache.maven.wagon.TransferFailedException:
Error interacting with SCM: Unable to commit file. The git-commit command failed.
*** Please tell me who you are.

Run

  git config --global user.email "[hidden email]"
  git config --global user.name "Your Name"

to set your account's default identity.
Omit --global to set the identity only in this repository.

fatal:********@base.apache.org>) not allowed

Caused by: org.apache.maven.scm.ScmException:
Unable to commit file. The git-commit command failed.
*** Please tell me who you are.

Run

  git config --global user.email "[hidden email]"
  git config --global user.name "Your Name"

to set your account's default identity.
Omit --global to set the identity only in this repository.

fatal:********@base.apache.org>) not allowed



FAILED:  org.apache.maven.wagon.providers.scm.ScmGitExeWagonTest.testWagonPutDirectoryDeepDestination

Error Message:
Error interacting with SCM: Unable to commit file. The git-commit command failed.
*** Please tell me who you are.

Run

  git config --global user.email "[hidden email]"
  git config --global user.name "Your Name"

to set your account's default identity.
Omit --global to set the identity only in this repository.

fatal:********@base.apache.org>) not allowed


Stack Trace:
org.apache.maven.wagon.TransferFailedException:
Error interacting with SCM: Unable to commit file. The git-commit command failed.
*** Please tell me who you are.

Run

  git config --global user.email "[hidden email]"
  git config --global user.name "Your Name"

to set your account's default identity.
Omit --global to set the identity only in this repository.

fatal:********@base.apache.org>) not allowed

Caused by: org.apache.maven.scm.ScmException:
Unable to commit file. The git-commit command failed.
*** Please tell me who you are.

Run

  git config --global user.email "[hidden email]"
  git config --global user.name "Your Name"

to set your account's default identity.
Omit --global to set the identity only in this repository.

fatal:********@base.apache.org>) not allowed



FAILED:  org.apache.maven.wagon.providers.scm.ScmGitExeWagonTest.testWagon

Error Message:

  Unexpected method call TransferListener.transferError(TransferEvent[PUT|ERROR|Repository[scm:git:file:///home/jenkins/jenkins-slave/workspace/n-box_maven-wagon_WAGON-527-KWYDRBGRPK7Q2YVCYHYJDNDOSEOHGQPJHV5AHJB4GNG66RKBHCBA/m/wagon-providers/wagon-scm/target/test-classes/test-repo-git-test/]|null|test-resource[len = 18; mod = 1536774584000]]):
    TransferListener.transferCompleted(TransferEvent[PUT|COMPLETED|Repository[scm:git:file:///home/jenkins/jenkins-slave/workspace/n-box_maven-wagon_WAGON-527-KWYDRBGRPK7Q2YVCYHYJDNDOSEOHGQPJHV5AHJB4GNG66RKBHCBA/m/wagon-providers/wagon-scm/target/test-classes/test-repo-git-test/]|/home/jenkins/jenkins-slave/workspace/n-box_maven-wagon_WAGON-527-KWYDRBGRPK7Q2YVCYHYJDNDOSEOHGQPJHV5AHJB4GNG66RKBHCBA/m/wagon-providers/wagon-scm/target/test-output/test-resource|test-resource[len = 18; mod = 1536774584000]]): expected: 1, actual: 0

Stack Trace:
java.lang.AssertionError:

  Unexpected method call TransferListener.transferError(TransferEvent[PUT|ERROR|Repository[scm:git:file:///home/jenkins/jenkins-slave/workspace/n-box_maven-wagon_WAGON-527-KWYDRBGRPK7Q2YVCYHYJDNDOSEOHGQPJHV5AHJB4GNG66RKBHCBA/m/wagon-providers/wagon-scm/target/test-classes/test-repo-git-test/]|null|test-resource[len = 18; mod = 1536774584000]]):
    TransferListener.transferCompleted(TransferEvent[PUT|COMPLETED|Repository[scm:git:file:///home/jenkins/jenkins-slave/workspace/n-box_maven-wagon_WAGON-527-KWYDRBGRPK7Q2YVCYHYJDNDOSEOHGQPJHV5AHJB4GNG66RKBHCBA/m/wagon-providers/wagon-scm/target/test-classes/test-repo-git-test/]|/home/jenkins/jenkins-slave/workspace/n-box_maven-wagon_WAGON-527-KWYDRBGRPK7Q2YVCYHYJDNDOSEOHGQPJHV5AHJB4GNG66RKBHCBA/m/wagon-providers/wagon-scm/target/test-output/test-resource|test-resource[len = 18; mod = 1536774584000]]): expected: 1, actual: 0


FAILED:  org.apache.maven.wagon.providers.scm.ScmGitExeWagonTest.testWagonPutDirectoryForDot

Error Message:
Error interacting with SCM: Unable to commit file. The git-commit command failed.
*** Please tell me who you are.

Run

  git config --global user.email "[hidden email]"
  git config --global user.name "Your Name"

to set your account's default identity.
Omit --global to set the identity only in this repository.

fatal:********@base.apache.org>) not allowed


Stack Trace:
org.apache.maven.wagon.TransferFailedException:
Error interacting with SCM: Unable to commit file. The git-commit command failed.
*** Please tell me who you are.

Run

  git config --global user.email "[hidden email]"
  git config --global user.name "Your Name"

to set your account's default identity.
Omit --global to set the identity only in this repository.

fatal:********@base.apache.org>) not allowed

Caused by: org.apache.maven.scm.ScmException:
Unable to commit file. The git-commit command failed.
*** Please tell me who you are.

Run

  git config --global user.email "[hidden email]"
  git config --global user.name "Your Name"

to set your account's default identity.
Omit --global to set the identity only in this repository.

fatal:********@base.apache.org>) not allowed



FAILED:  org.apache.maven.wagon.providers.scm.ScmGitExeWagonTest.testWagonPutDirectoryWhenDirectoryAlreadyExists

Error Message:
Error interacting with SCM: Unable to commit file. The git-commit command failed.
*** Please tell me who you are.

Run

  git config --global user.email "[hidden email]"
  git config --global user.name "Your Name"

to set your account's default identity.
Omit --global to set the identity only in this repository.

fatal:********@base.apache.org>) not allowed


Stack Trace:
org.apache.maven.wagon.TransferFailedException:
Error interacting with SCM: Unable to commit file. The git-commit command failed.
*** Please tell me who you are.

Run

  git config --global user.email "[hidden email]"
  git config --global user.name "Your Name"

to set your account's default identity.
Omit --global to set the identity only in this repository.

fatal:********@base.apache.org>) not allowed

Caused by: org.apache.maven.scm.ScmException:
Unable to commit file. The git-commit command failed.
*** Please tell me who you are.

Run

  git config --global user.email "[hidden email]"
  git config --global user.name "Your Name"

to set your account's default identity.
Omit --global to set the identity only in this repository.

fatal:********@base.apache.org>) not allowed



FAILED:  org.apache.maven.wagon.providers.scm.ScmGitExeWagonTest.testWagonPutDirectory

Error Message:
Error checking out: command failed: 'git' is not recognized as an internal or external command,
operable program or batch file.

Stack Trace:
org.apache.maven.wagon.TransferFailedException:
Error checking out: command failed: 'git' is not recognized as an internal or external command,
operable program or batch file.
Caused by: org.apache.maven.scm.ScmException:
command failed: 'git' is not recognized as an internal or external command,
operable program or batch file.


FAILED:  org.apache.maven.wagon.providers.scm.ScmGitExeWagonTest.testWagonPutDirectoryDeepDestination

Error Message:
Error checking out: command failed: 'git' is not recognized as an internal or external command,
operable program or batch file.

Stack Trace:
org.apache.maven.wagon.TransferFailedException:
Error checking out: command failed: 'git' is not recognized as an internal or external command,
operable program or batch file.
Caused by: org.apache.maven.scm.ScmException:
command failed: 'git' is not recognized as an internal or external command,
operable program or batch file.


FAILED:  org.apache.maven.wagon.providers.scm.ScmGitExeWagonTest.testWagon

Error Message:

  Unexpected method call TransferListener.transferError(TransferEvent[GET|ERROR|Repository[scm:git:file:///F:/jenkins/jenkins-slave/workspace/n-box_maven-wagon_WAGON-527-KWYDRBGRPK7Q2YVCYHYJDNDOSEOHGQPJHV5AHJB4GNG66RKBHCBA/m/wagon-providers/wagon-scm/target/test-classes/test-repo-git-test/]|null|test-resource[len = 18; mod = 1536774822036]]):
    TransferListener.transferCompleted(TransferEvent[PUT|COMPLETED|Repository[scm:git:file:///F:/jenkins/jenkins-slave/workspace/n-box_maven-wagon_WAGON-527-KWYDRBGRPK7Q2YVCYHYJDNDOSEOHGQPJHV5AHJB4GNG66RKBHCBA/m/wagon-providers/wagon-scm/target/test-classes/test-repo-git-test/]|F:\jenkins\jenkins-slave\workspace\n-box_maven-wagon_WAGON-527-KWYDRBGRPK7Q2YVCYHYJDNDOSEOHGQPJHV5AHJB4GNG66RKBHCBA\m\wagon-providers\wagon-scm\target\test-output\test-resource|test-resource[len = 18; mod = 1536774822036]]): expected: 1, actual: 0

Stack Trace:
java.lang.AssertionError:

  Unexpected method call TransferListener.transferError(TransferEvent[GET|ERROR|Repository[scm:git:file:///F:/jenkins/jenkins-slave/workspace/n-box_maven-wagon_WAGON-527-KWYDRBGRPK7Q2YVCYHYJDNDOSEOHGQPJHV5AHJB4GNG66RKBHCBA/m/wagon-providers/wagon-scm/target/test-classes/test-repo-git-test/]|null|test-resource[len = 18; mod = 1536774822036]]):
    TransferListener.transferCompleted(TransferEvent[PUT|COMPLETED|Repository[scm:git:file:///F:/jenkins/jenkins-slave/workspace/n-box_maven-wagon_WAGON-527-KWYDRBGRPK7Q2YVCYHYJDNDOSEOHGQPJHV5AHJB4GNG66RKBHCBA/m/wagon-providers/wagon-scm/target/test-classes/test-repo-git-test/]|F:\jenkins\jenkins-slave\workspace\n-box_maven-wagon_WAGON-527-KWYDRBGRPK7Q2YVCYHYJDNDOSEOHGQPJHV5AHJB4GNG66RKBHCBA\m\wagon-providers\wagon-scm\target\test-output\test-resource|test-resource[len = 18; mod = 1536774822036]]): expected: 1, actual: 0


FAILED:  org.apache.maven.wagon.providers.scm.ScmGitExeWagonTest.testWagonPutDirectoryForDot

Error Message:
Error checking out: command failed: 'git' is not recognized as an internal or external command,
operable program or batch file.

Stack Trace:
org.apache.maven.wagon.TransferFailedException:
Error checking out: command failed: 'git' is not recognized as an internal or external command,
operable program or batch file.
Caused by: org.apache.maven.scm.ScmException:
command failed: 'git' is not recognized as an internal or external command,
operable program or batch file.


FAILED:  org.apache.maven.wagon.providers.scm.ScmGitExeWagonTest.testWagonPutDirectoryWhenDirectoryAlreadyExists

Error Message:
Error checking out: command failed: 'git' is not recognized as an internal or external command,
operable program or batch file.

Stack Trace:
org.apache.maven.wagon.TransferFailedException:
Error checking out: command failed: 'git' is not recognized as an internal or external command,
operable program or batch file.
Caused by: org.apache.maven.scm.ScmException:
command failed: 'git' is not recognized as an internal or external command,
operable program or batch file.




Build log:
[...truncated 3.39 MB...]
[linux-jdk10] [INFO] Exclude: .checkstyle
[linux-jdk10] [INFO] Exclude: **/*.odg
[linux-jdk10] [INFO] Exclude: src/test/resources/**
[linux-jdk10] [INFO] Exclude: src/main/resources/default-server-root/**
[linux-jdk10] [INFO] Exclude: src/main/resources/ssh-keys/**
[linux-jdk10] [INFO] Exclude: src/test/ssh-keys/**
[linux-jdk10] [INFO] Exclude: .repository/**
[linux-jdk10] [INFO] Exclude: out/**
[linux-jdk10] [INFO] Exclude: .repository/**
[linux-jdk10] [INFO] Exclude: .maven/spy.log
[linux-jdk10] [INFO] Exclude: dependency-reduced-pom.xml
[linux-jdk10] [INFO] Exclude: .java-version
[linux-jdk10] [INFO] 12 resources included (use -debug for more details)
[linux-jdk10] [INFO] Rat check: Summary over all files. Unapproved: 0, unknown: 0, generated: 0, approved: 12 licenses.
[linux-jdk10] [INFO]
[linux-jdk10] [INFO] --- maven-remote-resources-plugin:1.5:process (process-resource-bundles) @ wagon-webdav-jackrabbit ---
[linux-jdk10] [INFO]
[linux-jdk10] [INFO] --- maven-resources-plugin:3.0.2:resources (default-resources) @ wagon-webdav-jackrabbit ---
[linux-jdk10] [INFO] Using 'UTF-8' encoding to copy filtered resources.
[linux-jdk10] [INFO] Copying 1 resource
[linux-jdk10] [INFO] Copying 3 resources
[linux-jdk10] [INFO]
[linux-jdk10] [INFO] --- maven-compiler-plugin:3.7.0:compile (default-compile) @ wagon-webdav-jackrabbit ---
[linux-jdk10] [INFO] Changes detected - recompiling the module!
[linux-jdk10] [INFO] Compiling 4 source files to /home/jenkins/jenkins-slave/workspace/n-box_maven-wagon_WAGON-527-KWYDRBGRPK7Q2YVCYHYJDNDOSEOHGQPJHV5AHJB4GNG66RKBHCBA/m/wagon-providers/wagon-webdav-jackrabbit/target/classes
[linux-jdk10] [INFO] /home/jenkins/jenkins-slave/workspace/n-box_maven-wagon_WAGON-527-KWYDRBGRPK7Q2YVCYHYJDNDOSEOHGQPJHV5AHJB4GNG66RKBHCBA/m/wagon-providers/wagon-webdav-jackrabbit/src/main/java/org/apache/maven/wagon/providers/webdav/WebDavWagon.java: /home/jenkins/jenkins-slave/workspace/n-box_maven-wagon_WAGON-527-KWYDRBGRPK7Q2YVCYHYJDNDOSEOHGQPJHV5AHJB4GNG66RKBHCBA/m/wagon-providers/wagon-webdav-jackrabbit/src/main/java/org/apache/maven/wagon/providers/webdav/WebDavWagon.java uses or overrides a deprecated API.
[linux-jdk10] [INFO] /home/jenkins/jenkins-slave/workspace/n-box_maven-wagon_WAGON-527-KWYDRBGRPK7Q2YVCYHYJDNDOSEOHGQPJHV5AHJB4GNG66RKBHCBA/m/wagon-providers/wagon-webdav-jackrabbit/src/main/java/org/apache/maven/wagon/providers/webdav/WebDavWagon.java: Recompile with -Xlint:deprecation for details.
[linux-jdk10] [INFO]
[linux-jdk10] [INFO] --- plexus-component-metadata:1.7.1:generate-metadata (generate) @ wagon-webdav-jackrabbit ---
[linux-jdk10] [INFO] Discovered 1 component descriptors(s)
[linux-jdk10] [INFO]
[linux-jdk10] [INFO] --- animal-sniffer-maven-plugin:1.15:check (check-java-1.7-compat) @ wagon-webdav-jackrabbit ---
[linux-jdk10] [INFO] Checking unresolved references to org.codehaus.mojo.signature:java17:1.0
[linux-jdk10] [INFO]
[linux-jdk10] [INFO] --- maven-resources-plugin:3.0.2:testResources (default-testResources) @ wagon-webdav-jackrabbit ---
[linux-jdk10] [INFO] Using 'UTF-8' encoding to copy filtered resources.
[linux-jdk10] [INFO] Copying 2 resources
[linux-jdk10] [INFO] Copying 3 resources
[linux-jdk10] [INFO]
[linux-jdk10] [INFO] --- maven-compiler-plugin:3.7.0:testCompile (default-testCompile) @ wagon-webdav-jackrabbit ---
[linux-jdk10] [INFO] Changes detected - recompiling the module!
[linux-jdk10] [INFO] Compiling 4 source files to /home/jenkins/jenkins-slave/workspace/n-box_maven-wagon_WAGON-527-KWYDRBGRPK7Q2YVCYHYJDNDOSEOHGQPJHV5AHJB4GNG66RKBHCBA/m/wagon-providers/wagon-webdav-jackrabbit/target/test-classes
[linux-jdk10] [INFO] /home/jenkins/jenkins-slave/workspace/n-box_maven-wagon_WAGON-527-KWYDRBGRPK7Q2YVCYHYJDNDOSEOHGQPJHV5AHJB4GNG66RKBHCBA/m/wagon-providers/wagon-webdav-jackrabbit/src/test/java/org/apache/maven/wagon/providers/webdav/HttpClientWagonTest.java: /home/jenkins/jenkins-slave/workspace/n-box_maven-wagon_WAGON-527-KWYDRBGRPK7Q2YVCYHYJDNDOSEOHGQPJHV5AHJB4GNG66RKBHCBA/m/wagon-providers/wagon-webdav-jackrabbit/src/test/java/org/apache/maven/wagon/providers/webdav/HttpClientWagonTest.java uses or overrides a deprecated API.
[linux-jdk10] [INFO] /home/jenkins/jenkins-slave/workspace/n-box_maven-wagon_WAGON-527-KWYDRBGRPK7Q2YVCYHYJDNDOSEOHGQPJHV5AHJB4GNG66RKBHCBA/m/wagon-providers/wagon-webdav-jackrabbit/src/test/java/org/apache/maven/wagon/providers/webdav/HttpClientWagonTest.java: Recompile with -Xlint:deprecation for details.
[linux-jdk10] [INFO]
[linux-jdk10] [INFO] --- maven-surefire-plugin:2.20:test (default-test) @ wagon-webdav-jackrabbit ---
[linux-jdk10] [INFO]
[linux-jdk10] [INFO] -------------------------------------------------------
[linux-jdk10] [INFO]  T E S T S
[linux-jdk10] [INFO] -------------------------------------------------------
[linux-jdk10] [INFO] Running org.apache.maven.wagon.providers.webdav.WebDavsWagonTest
[windows-jdk9] [ERROR] Tests run: 69, Failures: 0, Errors: 1, Skipped: 0, Time elapsed: 34.129 s <<< FAILURE! - in org.apache.maven.wagon.providers.webdav.WebDavsWagonTest
[windows-jdk9] [ERROR] testWagonGetFileListWhenDirectoryDoesNotExist(org.apache.maven.wagon.providers.webdav.WebDavsWagonTest)  Time elapsed: 0.247 s  <<< ERROR!
[windows-jdk9] java.io.IOException: File F:\jenkins\jenkins-slave\workspace\n-box_maven-wagon_WAGON-527-KWYDRBGRPK7Q2YVCYHYJDNDOSEOHGQPJHV5AHJB4GNG66RKBHCBA\m\wagon-providers\wagon-webdav-jackrabbit\target\test-output\http-repository\newfolder\folder2\deep0\deep1\deep2\a\b\test-resource-3.txt unable to be deleted.
[windows-jdk9]
[windows-jdk9] [INFO] Running org.apache.maven.wagon.providers.webdav.WebDavWagonTest
[linux-jdk10] [INFO] Tests run: 69, Failures: 0, Errors: 0, Skipped: 0, Time elapsed: 29.057 s - in org.apache.maven.wagon.providers.webdav.WebDavsWagonTest
[linux-jdk10] [INFO] Running org.apache.maven.wagon.providers.webdav.WebDavWagonTest
[windows-jdk9] [INFO] Tests run: 69, Failures: 0, Errors: 0, Skipped: 0, Time elapsed: 26.701 s - in org.apache.maven.wagon.providers.webdav.WebDavWagonTest
[windows-jdk9] [INFO]
[windows-jdk9] [INFO] Results:
[windows-jdk9] [INFO]
[windows-jdk9] [ERROR] Errors:
[windows-jdk9] [ERROR]   WebDavsWagonTest>WagonTestCase.runTest:291->WagonTestCase.testWagonGetFileListWhenDirectoryDoesNotExist:814->HttpWagonTestCase.setupWagonTestingFixtures:108 � IO
[windows-jdk9] [INFO]
[windows-jdk9] [ERROR] Tests run: 145, Failures: 0, Errors: 1, Skipped: 0
[windows-jdk9] [INFO]
[windows-jdk9] [ERROR] There are test failures.
[windows-jdk9]
[windows-jdk9] Please refer to F:\jenkins\jenkins-slave\workspace\n-box_maven-wagon_WAGON-527-KWYDRBGRPK7Q2YVCYHYJDNDOSEOHGQPJHV5AHJB4GNG66RKBHCBA\m\wagon-providers\wagon-webdav-jackrabbit\target\surefire-reports for the individual test results.
[windows-jdk9] Please refer to dump files (if any exist) [date]-jvmRun[N].dump, [date].dumpstream and [date]-jvmRun[N].dumpstream.
[windows-jdk9] [INFO]
[windows-jdk9] [INFO] --- maven-jar-plugin:3.0.2:jar (default-jar) @ wagon-webdav-jackrabbit ---
[windows-jdk9] [INFO] Building jar: F:\jenkins\jenkins-slave\workspace\n-box_maven-wagon_WAGON-527-KWYDRBGRPK7Q2YVCYHYJDNDOSEOHGQPJHV5AHJB4GNG66RKBHCBA\m\wagon-providers\wagon-webdav-jackrabbit\target\wagon-webdav-jackrabbit-3.1.1-SNAPSHOT.jar
[windows-jdk9] [INFO]
[windows-jdk9] [INFO] --- maven-site-plugin:3.7:attach-descriptor (attach-descriptor) @ wagon-webdav-jackrabbit ---
[windows-jdk9] [INFO] Skipping because packaging 'jar' is not pom.
[windows-jdk9] [INFO]
[windows-jdk9] [INFO] --- maven-checkstyle-plugin:3.0.0:check (checkstyle-check) @ wagon-webdav-jackrabbit ---
[windows-jdk9] [INFO] ------------------------------------------------------------------------
[windows-jdk9] [INFO] Reactor Summary:
[windows-jdk9] [INFO]
[windows-jdk9] [INFO] Apache Maven Wagon ................................. SUCCESS [ 15.334 s]
[windows-jdk9] [INFO] Apache Maven Wagon :: API .......................... SUCCESS [  9.501 s]
[windows-jdk9] [INFO] Apache Maven Wagon :: Provider Test ................ SUCCESS [  2.462 s]
[windows-jdk9] [INFO] Apache Maven Wagon :: Providers .................... SUCCESS [  1.129 s]
[windows-jdk9] [INFO] Apache Maven Wagon :: Providers :: File Provider ... SUCCESS [  3.216 s]
[windows-jdk9] [INFO] Apache Maven Wagon :: Providers :: FTP Provider .... SUCCESS [  6.274 s]
[windows-jdk9] [INFO] Apache Maven Wagon :: Providers :: HTTP Shared Library SUCCESS [  3.682 s]
[windows-jdk9] [INFO] Apache Maven Wagon :: Test Compatibility Kits ...... SUCCESS [  0.911 s]
[windows-jdk9] [INFO] Apache Maven Wagon :: HTTP Test Compatibility Kit .. SUCCESS [  2.855 s]
[windows-jdk9] [INFO] Apache Maven Wagon :: Providers :: HTTP Provider ... SUCCESS [04:45 min]
[windows-jdk9] [INFO] Apache Maven Wagon :: Providers :: Lightweight HTTP Provider SUCCESS [02:09 min]
[windows-jdk9] [INFO] Apache Maven Wagon :: Providers :: SCM Provider .... SUCCESS [ 17.282 s]
[windows-jdk9] [INFO] Apache Maven Wagon :: Providers :: SSH Common Library SUCCESS [  2.554 s]
[windows-jdk9] [INFO] Apache Maven Wagon :: Providers :: SSH Common Tests  SUCCESS [  2.275 s]
[windows-jdk9] [INFO] Apache Maven Wagon :: Providers :: SSH External Provider SUCCESS [  1.413 s]
[windows-jdk9] [INFO] Apache Maven Wagon :: Providers :: SSH Provider .... SUCCESS [  2.226 s]
[windows-jdk9] [INFO] Apache Maven Wagon :: Providers :: WebDAV Provider . SUCCESS [01:04 min]
[windows-jdk9] [INFO] ------------------------------------------------------------------------
[windows-jdk9] [INFO] BUILD SUCCESS
[windows-jdk9] [INFO] ------------------------------------------------------------------------
[windows-jdk9] [INFO] Total time: 09:12 min
[windows-jdk9] [INFO] Finished at: 2018-09-12T17:55:08Z
[windows-jdk9] [INFO] Final Memory: 47M/157M
[windows-jdk9] [INFO] ------------------------------------------------------------------------
[windows-jdk9] [WARNING] The requested profile "run-its" could not be activated because it does not exist.
[windows-jdk9] [INFO] [jenkins-event-spy] Generated F:\jenkins\jenkins-slave\workspace\n-box_maven-wagon_WAGON-527-KWYDRBGRPK7Q2YVCYHYJDNDOSEOHGQPJHV5AHJB4GNG66RKBHCBA@tmp\withMaven4cb507ce\maven-spy-20180912-174555-4743230277883454276176.log
[Pipeline] [windows-jdk9] }
[Pipeline] [windows-jdk9] // dir
[Pipeline] [windows-jdk9] }
[windows-jdk9] [withMaven] junitPublisher - Archive test results for Maven artifact org.apache.maven.wagon:wagon-provider-api:3.1.1-SNAPSHOT generated by maven-surefire-plugin:test (default-test): m\wagon-provider-api\target\surefire-reports\*.xml
[windows-jdk9] Recording test results
[windows-jdk9] [withMaven] junitPublisher - Archive test results for Maven artifact org.apache.maven.wagon:wagon-provider-test:3.1.1-SNAPSHOT generated by maven-surefire-plugin:test (default-test): m\wagon-provider-test\target\surefire-reports\*.xml
[windows-jdk9] Recording test results
[windows-jdk9] None of the test reports contained any result
[windows-jdk9] [withMaven] junitPublisher - Archive test results for Maven artifact org.apache.maven.wagon:wagon-file:3.1.1-SNAPSHOT generated by maven-surefire-plugin:test (default-test): m\wagon-providers\wagon-file\target\surefire-reports\*.xml
[windows-jdk9] Recording test results
[windows-jdk9] [withMaven] junitPublisher - Archive test results for Maven artifact org.apache.maven.wagon:wagon-ftp:3.1.1-SNAPSHOT generated by maven-surefire-plugin:test (default-test): m\wagon-providers\wagon-ftp\target\surefire-reports\*.xml
[windows-jdk9] Recording test results
[windows-jdk9] [withMaven] junitPublisher - Archive test results for Maven artifact org.apache.maven.wagon:wagon-http-shared:3.1.1-SNAPSHOT generated by maven-surefire-plugin:test (default-test): m\wagon-providers\wagon-http-shared\target\surefire-reports\*.xml
[windows-jdk9] Recording test results
[windows-jdk9] [withMaven] junitPublisher - Archive test results for Maven artifact org.apache.maven.wagon:wagon-tck-http:3.1.1-SNAPSHOT generated by maven-surefire-plugin:test (default-test): m\wagon-tcks\wagon-tck-http\target\surefire-reports\*.xml
[windows-jdk9] Recording test results
[windows-jdk9] None of the test reports contained any result
[windows-jdk9] [withMaven] junitPublisher - Archive test results for Maven artifact org.apache.maven.wagon:wagon-http:3.1.1-SNAPSHOT generated by maven-surefire-plugin:test (default-test): m\wagon-providers\wagon-http\target\surefire-reports\*.xml
[windows-jdk9] Recording test results
[windows-jdk9] [withMaven] junitPublisher - Archive test results for Maven artifact org.apache.maven.wagon:wagon-http-lightweight:3.1.1-SNAPSHOT generated by maven-surefire-plugin:test (default-test): m\wagon-providers\wagon-http-lightweight\target\surefire-reports\*.xml
[windows-jdk9] Recording test results
[windows-jdk9] [withMaven] junitPublisher - Archive test results for Maven artifact org.apache.maven.wagon:wagon-scm:3.1.1-SNAPSHOT generated by maven-surefire-plugin:test (default-test): m\wagon-providers\wagon-scm\target\surefire-reports\*.xml
[windows-jdk9] Recording test results
[windows-jdk9] [withMaven] junitPublisher - Archive test results for Maven artifact org.apache.maven.wagon:wagon-ssh-common:3.1.1-SNAPSHOT generated by maven-surefire-plugin:test (default-test): m\wagon-providers\wagon-ssh-common\target\surefire-reports\*.xml
[windows-jdk9] Recording test results
[windows-jdk9] [withMaven] junitPublisher - Archive test results for Maven artifact org.apache.maven.wagon:wagon-ssh-common-test:3.1.1-SNAPSHOT generated by maven-surefire-plugin:test (default-test): m\wagon-providers\wagon-ssh-common-test\target\surefire-reports\*.xml
[windows-jdk9] Recording test results
[windows-jdk9] None of the test reports contained any result
[windows-jdk9] [withMaven] junitPublisher - Archive test results for Maven artifact org.apache.maven.wagon:wagon-ssh-external:3.1.1-SNAPSHOT generated by maven-surefire-plugin:test (default-test): m\wagon-providers\wagon-ssh-external\target\surefire-reports\*.xml
[windows-jdk9] Recording test results
[windows-jdk9] None of the test reports contained any result
[windows-jdk9] [withMaven] junitPublisher - Archive test results for Maven artifact org.apache.maven.wagon:wagon-ssh:3.1.1-SNAPSHOT generated by maven-surefire-plugin:test (default-test): m\wagon-providers\wagon-ssh\target\surefire-reports\*.xml
[windows-jdk9] Recording test results
[windows-jdk9] None of the test reports contained any result
[windows-jdk9] [withMaven] junitPublisher - Archive test results for Maven artifact org.apache.maven.wagon:wagon-webdav-jackrabbit:3.1.1-SNAPSHOT generated by maven-surefire-plugin:test (default-test): m\wagon-providers\wagon-webdav-jackrabbit\target\surefire-reports\*.xml
[windows-jdk9] Recording test results
[Pipeline] [windows-jdk9] // withMaven
[Pipeline] [windows-jdk9] cleanWs
[windows-jdk9] [WS-CLEANUP] Deleting project workspace...[WS-CLEANUP] done
[Pipeline] [windows-jdk9] }
[Pipeline] [windows-jdk9] // stage
[Pipeline] [windows-jdk9] }
[Pipeline] [windows-jdk9] // node
[Pipeline] [windows-jdk9] }
[linux-jdk10] [INFO] Tests run: 69, Failures: 0, Errors: 0, Skipped: 0, Time elapsed: 25.14 s - in org.apache.maven.wagon.providers.webdav.WebDavWagonTest
[linux-jdk10] [INFO] Running org.apache.maven.wagon.providers.webdav.HttpClientWagonTest
[linux-jdk10] [INFO] Tests run: 6, Failures: 0, Errors: 0, Skipped: 0, Time elapsed: 0.003 s - in org.apache.maven.wagon.providers.webdav.HttpClientWagonTest
[linux-jdk10] [INFO] Running org.apache.maven.wagon.providers.webdav.PathNavigatorTest
[linux-jdk10] [INFO] Tests run: 1, Failures: 0, Errors: 0, Skipped: 0, Time elapsed: 0 s - in org.apache.maven.wagon.providers.webdav.PathNavigatorTest
[linux-jdk10] [INFO]
[linux-jdk10] [INFO] Results:
[linux-jdk10] [INFO]
[linux-jdk10] [INFO] Tests run: 145, Failures: 0, Errors: 0, Skipped: 0
[linux-jdk10] [INFO]
[linux-jdk10] [INFO]
[linux-jdk10] [INFO] --- maven-jar-plugin:3.0.2:jar (default-jar) @ wagon-webdav-jackrabbit ---
[linux-jdk10] [INFO] Building jar: /home/jenkins/jenkins-slave/workspace/n-box_maven-wagon_WAGON-527-KWYDRBGRPK7Q2YVCYHYJDNDOSEOHGQPJHV5AHJB4GNG66RKBHCBA/m/wagon-providers/wagon-webdav-jackrabbit/target/wagon-webdav-jackrabbit-3.1.1-SNAPSHOT.jar
[linux-jdk10] [INFO]
[linux-jdk10] [INFO] --- maven-site-plugin:3.7:attach-descriptor (attach-descriptor) @ wagon-webdav-jackrabbit ---
[linux-jdk10] [INFO] Skipping because packaging 'jar' is not pom.
[linux-jdk10] [INFO]
[linux-jdk10] [INFO] --- maven-checkstyle-plugin:3.0.0:check (checkstyle-check) @ wagon-webdav-jackrabbit ---
[linux-jdk10] [INFO] ------------------------------------------------------------------------
[linux-jdk10] [INFO] Reactor Summary:
[linux-jdk10] [INFO]
[linux-jdk10] [INFO] Apache Maven Wagon 3.1.1-SNAPSHOT .................. SUCCESS [ 39.031 s]
[linux-jdk10] [INFO] Apache Maven Wagon :: API .......................... SUCCESS [  8.674 s]
[linux-jdk10] [INFO] Apache Maven Wagon :: Provider Test ................ SUCCESS [  3.339 s]
[linux-jdk10] [INFO] Apache Maven Wagon :: Providers .................... SUCCESS [  1.001 s]
[linux-jdk10] [INFO] Apache Maven Wagon :: Providers :: File Provider ... SUCCESS [  2.484 s]
[linux-jdk10] [INFO] Apache Maven Wagon :: Providers :: FTP Provider .... SUCCESS [  7.582 s]
[linux-jdk10] [INFO] Apache Maven Wagon :: Providers :: HTTP Shared Library SUCCESS [  3.362 s]
[linux-jdk10] [INFO] Apache Maven Wagon :: Test Compatibility Kits ...... SUCCESS [  0.696 s]
[linux-jdk10] [INFO] Apache Maven Wagon :: HTTP Test Compatibility Kit .. SUCCESS [  1.597 s]
[linux-jdk10] [INFO] Apache Maven Wagon :: Providers :: HTTP Provider ... SUCCESS [05:19 min]
[linux-jdk10] [INFO] Apache Maven Wagon :: Providers :: Lightweight HTTP Provider SUCCESS [02:02 min]
[linux-jdk10] [INFO] Apache Maven Wagon :: Providers :: SCM Provider .... SUCCESS [ 12.491 s]
[linux-jdk10] [INFO] Apache Maven Wagon :: Providers :: SSH Common Library SUCCESS [  2.165 s]
[linux-jdk10] [INFO] Apache Maven Wagon :: Providers :: SSH Common Tests  SUCCESS [  2.020 s]
[linux-jdk10] [INFO] Apache Maven Wagon :: Providers :: SSH External Provider SUCCESS [  1.039 s]
[linux-jdk10] [INFO] Apache Maven Wagon :: Providers :: SSH Provider .... SUCCESS [  2.444 s]
[linux-jdk10] [INFO] Apache Maven Wagon :: Providers :: WebDAV Provider 3.1.1-SNAPSHOT SUCCESS [ 56.895 s]
[linux-jdk10] [INFO] ------------------------------------------------------------------------
[linux-jdk10] [INFO] BUILD SUCCESS
[linux-jdk10] [INFO] ------------------------------------------------------------------------
[linux-jdk10] [INFO] Total time: 09:48 min
[linux-jdk10] [INFO] Finished at: 2018-09-12T17:55:33Z
[linux-jdk10] [INFO] ------------------------------------------------------------------------
[linux-jdk10] [WARNING] The requested profile "run-its" could not be activated because it does not exist.
[linux-jdk10] [INFO] [jenkins-event-spy] Generated /home/jenkins/jenkins-slave/workspace/n-box_maven-wagon_WAGON-527-KWYDRBGRPK7Q2YVCYHYJDNDOSEOHGQPJHV5AHJB4GNG66RKBHCBA@tmp/withMaven92b99432/maven-spy-20180912-174544-4087836697421307699789.log
[Pipeline] [linux-jdk10] }
[Pipeline] [linux-jdk10] // dir
[Pipeline] [linux-jdk10] }
[linux-jdk10] [withMaven] junitPublisher - Archive test results for Maven artifact org.apache.maven.wagon:wagon-provider-api:3.1.1-SNAPSHOT generated by maven-surefire-plugin:test (default-test): m/wagon-provider-api/target/surefire-reports/*.xml
[linux-jdk10] Recording test results
[linux-jdk10] [withMaven] junitPublisher - Archive test results for Maven artifact org.apache.maven.wagon:wagon-provider-test:3.1.1-SNAPSHOT generated by maven-surefire-plugin:test (default-test): m/wagon-provider-test/target/surefire-reports/*.xml
[linux-jdk10] Recording test results
[linux-jdk10] None of the test reports contained any result
[linux-jdk10] [withMaven] junitPublisher - Archive test results for Maven artifact org.apache.maven.wagon:wagon-file:3.1.1-SNAPSHOT generated by maven-surefire-plugin:test (default-test): m/wagon-providers/wagon-file/target/surefire-reports/*.xml
[linux-jdk10] Recording test results
[linux-jdk10] [withMaven] junitPublisher - Archive test results for Maven artifact org.apache.maven.wagon:wagon-ftp:3.1.1-SNAPSHOT generated by maven-surefire-plugin:test (default-test): m/wagon-providers/wagon-ftp/target/surefire-reports/*.xml
[linux-jdk10] Recording test results
[linux-jdk10] [withMaven] junitPublisher - Archive test results for Maven artifact org.apache.maven.wagon:wagon-http-shared:3.1.1-SNAPSHOT generated by maven-surefire-plugin:test (default-test): m/wagon-providers/wagon-http-shared/target/surefire-reports/*.xml
[linux-jdk10] Recording test results
[linux-jdk10] [withMaven] junitPublisher - Archive test results for Maven artifact org.apache.maven.wagon:wagon-tck-http:3.1.1-SNAPSHOT generated by maven-surefire-plugin:test (default-test): m/wagon-tcks/wagon-tck-http/target/surefire-reports/*.xml
[linux-jdk10] Recording test results
[linux-jdk10] None of the test reports contained any result
[linux-jdk10] [withMaven] junitPublisher - Archive test results for Maven artifact org.apache.maven.wagon:wagon-http:3.1.1-SNAPSHOT generated by maven-surefire-plugin:test (default-test): m/wagon-providers/wagon-http/target/surefire-reports/*.xml
[linux-jdk10] Recording test results
[linux-jdk10] [withMaven] junitPublisher - Archive test results for Maven artifact org.apache.maven.wagon:wagon-http-lightweight:3.1.1-SNAPSHOT generated by maven-surefire-plugin:test (default-test): m/wagon-providers/wagon-http-lightweight/target/surefire-reports/*.xml
[linux-jdk10] Recording test results
[linux-jdk10] [withMaven] junitPublisher - Archive test results for Maven artifact org.apache.maven.wagon:wagon-scm:3.1.1-SNAPSHOT generated by maven-surefire-plugin:test (default-test): m/wagon-providers/wagon-scm/target/surefire-reports/*.xml
[linux-jdk10] Recording test results
[linux-jdk10] [withMaven] junitPublisher - Archive test results for Maven artifact org.apache.maven.wagon:wagon-ssh-common:3.1.1-SNAPSHOT generated by maven-surefire-plugin:test (default-test): m/wagon-providers/wagon-ssh-common/target/surefire-reports/*.xml
[linux-jdk10] Recording test results
[linux-jdk10] [withMaven] junitPublisher - Archive test results for Maven artifact org.apache.maven.wagon:wagon-ssh-common-test:3.1.1-SNAPSHOT generated by maven-surefire-plugin:test (default-test): m/wagon-providers/wagon-ssh-common-test/target/surefire-reports/*.xml
[linux-jdk10] Recording test results
[linux-jdk10] None of the test reports contained any result
[linux-jdk10] [withMaven] junitPublisher - Archive test results for Maven artifact org.apache.maven.wagon:wagon-ssh-external:3.1.1-SNAPSHOT generated by maven-surefire-plugin:test (default-test): m/wagon-providers/wagon-ssh-external/target/surefire-reports/*.xml
[linux-jdk10] Recording test results
[linux-jdk10] None of the test reports contained any result
[linux-jdk10] [withMaven] junitPublisher - Archive test results for Maven artifact org.apache.maven.wagon:wagon-ssh:3.1.1-SNAPSHOT generated by maven-surefire-plugin:test (default-test): m/wagon-providers/wagon-ssh/target/surefire-reports/*.xml
[linux-jdk10] Recording test results
[linux-jdk10] None of the test reports contained any result
[linux-jdk10] [withMaven] junitPublisher - Archive test results for Maven artifact org.apache.maven.wagon:wagon-webdav-jackrabbit:3.1.1-SNAPSHOT generated by maven-surefire-plugin:test (default-test): m/wagon-providers/wagon-webdav-jackrabbit/target/surefire-reports/*.xml
[linux-jdk10] Recording test results
[Pipeline] [linux-jdk10] // withMaven
[Pipeline] [linux-jdk10] cleanWs
[linux-jdk10] [WS-CLEANUP] Deleting project workspace...[WS-CLEANUP] done
[Pipeline] [linux-jdk10] }
[Pipeline] [linux-jdk10] // stage
[Pipeline] [linux-jdk10] }
[Pipeline] [linux-jdk10] // node
[Pipeline] [linux-jdk10] }
[Pipeline] // parallel
[Pipeline] stage
[Pipeline] { (Notifications)
[Pipeline] echo
Build result: FAILURE
[Pipeline] jiraIssueSelector
[Pipeline] emailext
Reply | Threaded
Open this post in threaded view
|

Build failed in Jenkins: Maven TLP » maven-wagon » WAGON-527 #4

Apache Jenkins Server-2
See https://builds.apache.org/job/maven-box/job/maven-wagon/job/WAGON-527/4/

No changes.

38 tests failed.
FAILED:  org.apache.maven.wagon.providers.scm.ScmGitExeWagonTest.testWagonPutDirectory

Error Message:
Error interacting with SCM: Unable to commit file. The git-commit command failed.
*** Please tell me who you are.

Run

  git config --global user.email "[hidden email]"
  git config --global user.name "Your Name"

to set your account's default identity.
Omit --global to set the identity only in this repository.

fatal:********@asf924.gq1.ygridcore.net>) not allowed


Stack Trace:
org.apache.maven.wagon.TransferFailedException:
Error interacting with SCM: Unable to commit file. The git-commit command failed.
*** Please tell me who you are.

Run

  git config --global user.email "[hidden email]"
  git config --global user.name "Your Name"

to set your account's default identity.
Omit --global to set the identity only in this repository.

fatal:********@asf924.gq1.ygridcore.net>) not allowed

Caused by: org.apache.maven.scm.ScmException:
Unable to commit file. The git-commit command failed.
*** Please tell me who you are.

Run

  git config --global user.email "[hidden email]"
  git config --global user.name "Your Name"

to set your account's default identity.
Omit --global to set the identity only in this repository.

fatal:********@asf924.gq1.ygridcore.net>) not allowed



FAILED:  org.apache.maven.wagon.providers.scm.ScmGitExeWagonTest.testWagonPutDirectoryDeepDestination

Error Message:
Error interacting with SCM: Unable to commit file. The git-commit command failed.
*** Please tell me who you are.

Run

  git config --global user.email "[hidden email]"
  git config --global user.name "Your Name"

to set your account's default identity.
Omit --global to set the identity only in this repository.

fatal:********@asf924.gq1.ygridcore.net>) not allowed


Stack Trace:
org.apache.maven.wagon.TransferFailedException:
Error interacting with SCM: Unable to commit file. The git-commit command failed.
*** Please tell me who you are.

Run

  git config --global user.email "[hidden email]"
  git config --global user.name "Your Name"

to set your account's default identity.
Omit --global to set the identity only in this repository.

fatal:********@asf924.gq1.ygridcore.net>) not allowed

Caused by: org.apache.maven.scm.ScmException:
Unable to commit file. The git-commit command failed.
*** Please tell me who you are.

Run

  git config --global user.email "[hidden email]"
  git config --global user.name "Your Name"

to set your account's default identity.
Omit --global to set the identity only in this repository.

fatal:********@asf924.gq1.ygridcore.net>) not allowed



FAILED:  org.apache.maven.wagon.providers.scm.ScmGitExeWagonTest.testWagon

Error Message:

  Unexpected method call TransferListener.transferError(TransferEvent[PUT|ERROR|Repository[scm:git:file:///home/jenkins/jenkins-slave/workspace/n-box_maven-wagon_WAGON-527-KWYDRBGRPK7Q2YVCYHYJDNDOSEOHGQPJHV5AHJB4GNG66RKBHCBA/m/wagon-providers/wagon-scm/target/test-classes/test-repo-git-test/]|null|test-resource[len = 18; mod = 1536860587000]]):
    TransferListener.transferCompleted(TransferEvent[PUT|COMPLETED|Repository[scm:git:file:///home/jenkins/jenkins-slave/workspace/n-box_maven-wagon_WAGON-527-KWYDRBGRPK7Q2YVCYHYJDNDOSEOHGQPJHV5AHJB4GNG66RKBHCBA/m/wagon-providers/wagon-scm/target/test-classes/test-repo-git-test/]|/home/jenkins/jenkins-slave/workspace/n-box_maven-wagon_WAGON-527-KWYDRBGRPK7Q2YVCYHYJDNDOSEOHGQPJHV5AHJB4GNG66RKBHCBA/m/wagon-providers/wagon-scm/target/test-output/test-resource|test-resource[len = 18; mod = 1536860587000]]): expected: 1, actual: 0

Stack Trace:
java.lang.AssertionError:

  Unexpected method call TransferListener.transferError(TransferEvent[PUT|ERROR|Repository[scm:git:file:///home/jenkins/jenkins-slave/workspace/n-box_maven-wagon_WAGON-527-KWYDRBGRPK7Q2YVCYHYJDNDOSEOHGQPJHV5AHJB4GNG66RKBHCBA/m/wagon-providers/wagon-scm/target/test-classes/test-repo-git-test/]|null|test-resource[len = 18; mod = 1536860587000]]):
    TransferListener.transferCompleted(TransferEvent[PUT|COMPLETED|Repository[scm:git:file:///home/jenkins/jenkins-slave/workspace/n-box_maven-wagon_WAGON-527-KWYDRBGRPK7Q2YVCYHYJDNDOSEOHGQPJHV5AHJB4GNG66RKBHCBA/m/wagon-providers/wagon-scm/target/test-classes/test-repo-git-test/]|/home/jenkins/jenkins-slave/workspace/n-box_maven-wagon_WAGON-527-KWYDRBGRPK7Q2YVCYHYJDNDOSEOHGQPJHV5AHJB4GNG66RKBHCBA/m/wagon-providers/wagon-scm/target/test-output/test-resource|test-resource[len = 18; mod = 1536860587000]]): expected: 1, actual: 0


FAILED:  org.apache.maven.wagon.providers.scm.ScmGitExeWagonTest.testWagonPutDirectoryForDot

Error Message:
Error interacting with SCM: Unable to commit file. The git-commit command failed.
*** Please tell me who you are.

Run

  git config --global user.email "[hidden email]"
  git config --global user.name "Your Name"

to set your account's default identity.
Omit --global to set the identity only in this repository.

fatal:********@asf924.gq1.ygridcore.net>) not allowed


Stack Trace:
org.apache.maven.wagon.TransferFailedException:
Error interacting with SCM: Unable to commit file. The git-commit command failed.
*** Please tell me who you are.

Run

  git config --global user.email "[hidden email]"
  git config --global user.name "Your Name"

to set your account's default identity.
Omit --global to set the identity only in this repository.

fatal:********@asf924.gq1.ygridcore.net>) not allowed

Caused by: org.apache.maven.scm.ScmException:
Unable to commit file. The git-commit command failed.
*** Please tell me who you are.

Run

  git config --global user.email "[hidden email]"
  git config --global user.name "Your Name"

to set your account's default identity.
Omit --global to set the identity only in this repository.

fatal:********@asf924.gq1.ygridcore.net>) not allowed



FAILED:  org.apache.maven.wagon.providers.scm.ScmGitExeWagonTest.testWagonPutDirectoryWhenDirectoryAlreadyExists

Error Message:
Error interacting with SCM: Unable to commit file. The git-commit command failed.
*** Please tell me who you are.

Run

  git config --global user.email "[hidden email]"
  git config --global user.name "Your Name"

to set your account's default identity.
Omit --global to set the identity only in this repository.

fatal:********@asf924.gq1.ygridcore.net>) not allowed


Stack Trace:
org.apache.maven.wagon.TransferFailedException:
Error interacting with SCM: Unable to commit file. The git-commit command failed.
*** Please tell me who you are.

Run

  git config --global user.email "[hidden email]"
  git config --global user.name "Your Name"

to set your account's default identity.
Omit --global to set the identity only in this repository.

fatal:********@asf924.gq1.ygridcore.net>) not allowed

Caused by: org.apache.maven.scm.ScmException:
Unable to commit file. The git-commit command failed.
*** Please tell me who you are.

Run

  git config --global user.email "[hidden email]"
  git config --global user.name "Your Name"

to set your account's default identity.
Omit --global to set the identity only in this repository.

fatal:********@asf924.gq1.ygridcore.net>) not allowed



FAILED:  org.apache.maven.wagon.providers.scm.ScmGitExeWagonTest.testWagonPutDirectory

Error Message:
Error interacting with SCM: Unable to commit file. The git-commit command failed.
*** Please tell me who you are.

Run

  git config --global user.email "[hidden email]"
  git config --global user.name "Your Name"

to set your account's default identity.
Omit --global to set the identity only in this repository.

fatal:********@asf925.gq1.ygridcore.net>) not allowed


Stack Trace:
org.apache.maven.wagon.TransferFailedException:
Error interacting with SCM: Unable to commit file. The git-commit command failed.
*** Please tell me who you are.

Run

  git config --global user.email "[hidden email]"
  git config --global user.name "Your Name"

to set your account's default identity.
Omit --global to set the identity only in this repository.

fatal:********@asf925.gq1.ygridcore.net>) not allowed

Caused by: org.apache.maven.scm.ScmException:
Unable to commit file. The git-commit command failed.
*** Please tell me who you are.

Run

  git config --global user.email "[hidden email]"
  git config --global user.name "Your Name"

to set your account's default identity.
Omit --global to set the identity only in this repository.

fatal:********@asf925.gq1.ygridcore.net>) not allowed



FAILED:  org.apache.maven.wagon.providers.scm.ScmGitExeWagonTest.testWagonPutDirectoryDeepDestination

Error Message:
Error interacting with SCM: Unable to commit file. The git-commit command failed.
*** Please tell me who you are.

Run

  git config --global user.email "[hidden email]"
  git config --global user.name "Your Name"

to set your account's default identity.
Omit --global to set the identity only in this repository.

fatal:********@asf925.gq1.ygridcore.net>) not allowed


Stack Trace:
org.apache.maven.wagon.TransferFailedException:
Error interacting with SCM: Unable to commit file. The git-commit command failed.
*** Please tell me who you are.

Run

  git config --global user.email "[hidden email]"
  git config --global user.name "Your Name"

to set your account's default identity.
Omit --global to set the identity only in this repository.

fatal:********@asf925.gq1.ygridcore.net>) not allowed

Caused by: org.apache.maven.scm.ScmException:
Unable to commit file. The git-commit command failed.
*** Please tell me who you are.

Run

  git config --global user.email "[hidden email]"
  git config --global user.name "Your Name"

to set your account's default identity.
Omit --global to set the identity only in this repository.

fatal:********@asf925.gq1.ygridcore.net>) not allowed



FAILED:  org.apache.maven.wagon.providers.scm.ScmGitExeWagonTest.testWagon

Error Message:

  Unexpected method call TransferListener.transferError(TransferEvent[PUT|ERROR|Repository[scm:git:file:///home/jenkins/jenkins-slave/workspace/n-box_maven-wagon_WAGON-527-KWYDRBGRPK7Q2YVCYHYJDNDOSEOHGQPJHV5AHJB4GNG66RKBHCBA/m/wagon-providers/wagon-scm/target/test-classes/test-repo-git-test/]|null|test-resource[len = 18; mod = 1536860671000]]):
    TransferListener.transferCompleted(TransferEvent[PUT|COMPLETED|Repository[scm:git:file:///home/jenkins/jenkins-slave/workspace/n-box_maven-wagon_WAGON-527-KWYDRBGRPK7Q2YVCYHYJDNDOSEOHGQPJHV5AHJB4GNG66RKBHCBA/m/wagon-providers/wagon-scm/target/test-classes/test-repo-git-test/]|/home/jenkins/jenkins-slave/workspace/n-box_maven-wagon_WAGON-527-KWYDRBGRPK7Q2YVCYHYJDNDOSEOHGQPJHV5AHJB4GNG66RKBHCBA/m/wagon-providers/wagon-scm/target/test-output/test-resource|test-resource[len = 18; mod = 1536860671000]]): expected: 1, actual: 0

Stack Trace:
java.lang.AssertionError:

  Unexpected method call TransferListener.transferError(TransferEvent[PUT|ERROR|Repository[scm:git:file:///home/jenkins/jenkins-slave/workspace/n-box_maven-wagon_WAGON-527-KWYDRBGRPK7Q2YVCYHYJDNDOSEOHGQPJHV5AHJB4GNG66RKBHCBA/m/wagon-providers/wagon-scm/target/test-classes/test-repo-git-test/]|null|test-resource[len = 18; mod = 1536860671000]]):
    TransferListener.transferCompleted(TransferEvent[PUT|COMPLETED|Repository[scm:git:file:///home/jenkins/jenkins-slave/workspace/n-box_maven-wagon_WAGON-527-KWYDRBGRPK7Q2YVCYHYJDNDOSEOHGQPJHV5AHJB4GNG66RKBHCBA/m/wagon-providers/wagon-scm/target/test-classes/test-repo-git-test/]|/home/jenkins/jenkins-slave/workspace/n-box_maven-wagon_WAGON-527-KWYDRBGRPK7Q2YVCYHYJDNDOSEOHGQPJHV5AHJB4GNG66RKBHCBA/m/wagon-providers/wagon-scm/target/test-output/test-resource|test-resource[len = 18; mod = 1536860671000]]): expected: 1, actual: 0


FAILED:  org.apache.maven.wagon.providers.scm.ScmGitExeWagonTest.testWagonPutDirectoryForDot

Error Message:
Error interacting with SCM: Unable to commit file. The git-commit command failed.
*** Please tell me who you are.

Run

  git config --global user.email "[hidden email]"
  git config --global user.name "Your Name"

to set your account's default identity.
Omit --global to set the identity only in this repository.

fatal:********@asf925.gq1.ygridcore.net>) not allowed


Stack Trace:
org.apache.maven.wagon.TransferFailedException:
Error interacting with SCM: Unable to commit file. The git-commit command failed.
*** Please tell me who you are.

Run

  git config --global user.email "[hidden email]"
  git config --global user.name "Your Name"

to set your account's default identity.
Omit --global to set the identity only in this repository.

fatal:********@asf925.gq1.ygridcore.net>) not allowed

Caused by: org.apache.maven.scm.ScmException:
Unable to commit file. The git-commit command failed.
*** Please tell me who you are.

Run

  git config --global user.email "[hidden email]"
  git config --global user.name "Your Name"

to set your account's default identity.
Omit --global to set the identity only in this repository.

fatal:********@asf925.gq1.ygridcore.net>) not allowed



FAILED:  org.apache.maven.wagon.providers.scm.ScmGitExeWagonTest.testWagonPutDirectoryWhenDirectoryAlreadyExists

Error Message:
Error interacting with SCM: Unable to commit file. The git-commit command failed.
*** Please tell me who you are.

Run

  git config --global user.email "[hidden email]"
  git config --global user.name "Your Name"

to set your account's default identity.
Omit --global to set the identity only in this repository.

fatal:********@asf925.gq1.ygridcore.net>) not allowed


Stack Trace:
org.apache.maven.wagon.TransferFailedException:
Error interacting with SCM: Unable to commit file. The git-commit command failed.
*** Please tell me who you are.

Run

  git config --global user.email "[hidden email]"
  git config --global user.name "Your Name"

to set your account's default identity.
Omit --global to set the identity only in this repository.

fatal:********@asf925.gq1.ygridcore.net>) not allowed

Caused by: org.apache.maven.scm.ScmException:
Unable to commit file. The git-commit command failed.
*** Please tell me who you are.

Run

  git config --global user.email "[hidden email]"
  git config --global user.name "Your Name"

to set your account's default identity.
Omit --global to set the identity only in this repository.

fatal:********@asf925.gq1.ygridcore.net>) not allowed



FAILED:  org.apache.maven.wagon.providers.scm.ScmGitExeWagonTest.testWagonPutDirectory

Error Message:
Error interacting with SCM: Unable to commit file. The git-commit command failed.
*** Please tell me who you are.

Run

  git config --global user.email "[hidden email]"
  git config --global user.name "Your Name"

to set your account's default identity.
Omit --global to set the identity only in this repository.

fatal:********@asf935.gq1.ygridcore.net>) not allowed


Stack Trace:
org.apache.maven.wagon.TransferFailedException:
Error interacting with SCM: Unable to commit file. The git-commit command failed.
*** Please tell me who you are.

Run

  git config --global user.email "[hidden email]"
  git config --global user.name "Your Name"

to set your account's default identity.
Omit --global to set the identity only in this repository.

fatal:********@asf935.gq1.ygridcore.net>) not allowed

Caused by: org.apache.maven.scm.ScmException:
Unable to commit file. The git-commit command failed.
*** Please tell me who you are.

Run

  git config --global user.email "[hidden email]"
  git config --global user.name "Your Name"

to set your account's default identity.
Omit --global to set the identity only in this repository.

fatal:********@asf935.gq1.ygridcore.net>) not allowed



FAILED:  org.apache.maven.wagon.providers.scm.ScmGitExeWagonTest.testWagonPutDirectoryDeepDestination

Error Message:
Error interacting with SCM: Unable to commit file. The git-commit command failed.
*** Please tell me who you are.

Run

  git config --global user.email "[hidden email]"
  git config --global user.name "Your Name"

to set your account's default identity.
Omit --global to set the identity only in this repository.

fatal:********@asf935.gq1.ygridcore.net>) not allowed


Stack Trace:
org.apache.maven.wagon.TransferFailedException:
Error interacting with SCM: Unable to commit file. The git-commit command failed.
*** Please tell me who you are.

Run

  git config --global user.email "[hidden email]"
  git config --global user.name "Your Name"

to set your account's default identity.
Omit --global to set the identity only in this repository.

fatal:********@asf935.gq1.ygridcore.net>) not allowed

Caused by: org.apache.maven.scm.ScmException:
Unable to commit file. The git-commit command failed.
*** Please tell me who you are.

Run

  git config --global user.email "[hidden email]"
  git config --global user.name "Your Name"

to set your account's default identity.
Omit --global to set the identity only in this repository.

fatal:********@asf935.gq1.ygridcore.net>) not allowed



FAILED:  org.apache.maven.wagon.providers.scm.ScmGitExeWagonTest.testWagon

Error Message:

  Unexpected method call TransferListener.transferError(TransferEvent[PUT|ERROR|Repository[scm:git:file:///home/jenkins/jenkins-slave/workspace/n-box_maven-wagon_WAGON-527-KWYDRBGRPK7Q2YVCYHYJDNDOSEOHGQPJHV5AHJB4GNG66RKBHCBA/m/wagon-providers/wagon-scm/target/test-classes/test-repo-git-test/]|null|test-resource[len = 18; mod = 1536860738000]]):
    TransferListener.transferCompleted(TransferEvent[PUT|COMPLETED|Repository[scm:git:file:///home/jenkins/jenkins-slave/workspace/n-box_maven-wagon_WAGON-527-KWYDRBGRPK7Q2YVCYHYJDNDOSEOHGQPJHV5AHJB4GNG66RKBHCBA/m/wagon-providers/wagon-scm/target/test-classes/test-repo-git-test/]|/home/jenkins/jenkins-slave/workspace/n-box_maven-wagon_WAGON-527-KWYDRBGRPK7Q2YVCYHYJDNDOSEOHGQPJHV5AHJB4GNG66RKBHCBA/m/wagon-providers/wagon-scm/target/test-output/test-resource|test-resource[len = 18; mod = 1536860738000]]): expected: 1, actual: 0

Stack Trace:
java.lang.AssertionError:

  Unexpected method call TransferListener.transferError(TransferEvent[PUT|ERROR|Repository[scm:git:file:///home/jenkins/jenkins-slave/workspace/n-box_maven-wagon_WAGON-527-KWYDRBGRPK7Q2YVCYHYJDNDOSEOHGQPJHV5AHJB4GNG66RKBHCBA/m/wagon-providers/wagon-scm/target/test-classes/test-repo-git-test/]|null|test-resource[len = 18; mod = 1536860738000]]):
    TransferListener.transferCompleted(TransferEvent[PUT|COMPLETED|Repository[scm:git:file:///home/jenkins/jenkins-slave/workspace/n-box_maven-wagon_WAGON-527-KWYDRBGRPK7Q2YVCYHYJDNDOSEOHGQPJHV5AHJB4GNG66RKBHCBA/m/wagon-providers/wagon-scm/target/test-classes/test-repo-git-test/]|/home/jenkins/jenkins-slave/workspace/n-box_maven-wagon_WAGON-527-KWYDRBGRPK7Q2YVCYHYJDNDOSEOHGQPJHV5AHJB4GNG66RKBHCBA/m/wagon-providers/wagon-scm/target/test-output/test-resource|test-resource[len = 18; mod = 1536860738000]]): expected: 1, actual: 0


FAILED:  org.apache.maven.wagon.providers.scm.ScmGitExeWagonTest.testWagonPutDirectoryForDot

Error Message:
Error interacting with SCM: Unable to commit file. The git-commit command failed.
*** Please tell me who you are.

Run

  git config --global user.email "[hidden email]"
  git config --global user.name "Your Name"

to set your account's default identity.
Omit --global to set the identity only in this repository.

fatal:********@asf935.gq1.ygridcore.net>) not allowed


Stack Trace:
org.apache.maven.wagon.TransferFailedException:
Error interacting with SCM: Unable to commit file. The git-commit command failed.
*** Please tell me who you are.

Run

  git config --global user.email "[hidden email]"
  git config --global user.name "Your Name"

to set your account's default identity.
Omit --global to set the identity only in this repository.

fatal:********@asf935.gq1.ygridcore.net>) not allowed

Caused by: org.apache.maven.scm.ScmException:
Unable to commit file. The git-commit command failed.
*** Please tell me who you are.

Run

  git config --global user.email "[hidden email]"
  git config --global user.name "Your Name"

to set your account's default identity.
Omit --global to set the identity only in this repository.

fatal:********@asf935.gq1.ygridcore.net>) not allowed



FAILED:  org.apache.maven.wagon.providers.scm.ScmGitExeWagonTest.testWagonPutDirectoryWhenDirectoryAlreadyExists

Error Message:
Error interacting with SCM: Unable to commit file. The git-commit command failed.
*** Please tell me who you are.

Run

  git config --global user.email "[hidden email]"
  git config --global user.name "Your Name"

to set your account's default identity.
Omit --global to set the identity only in this repository.

fatal:********@asf935.gq1.ygridcore.net>) not allowed


Stack Trace:
org.apache.maven.wagon.TransferFailedException:
Error interacting with SCM: Unable to commit file. The git-commit command failed.
*** Please tell me who you are.

Run

  git config --global user.email "[hidden email]"
  git config --global user.name "Your Name"

to set your account's default identity.
Omit --global to set the identity only in this repository.

fatal:********@asf935.gq1.ygridcore.net>) not allowed

Caused by: org.apache.maven.scm.ScmException:
Unable to commit file. The git-commit command failed.
*** Please tell me who you are.

Run

  git config --global user.email "[hidden email]"
  git config --global user.name "Your Name"

to set your account's default identity.
Omit --global to set the identity only in this repository.

fatal:********@asf935.gq1.ygridcore.net>) not allowed



FAILED:  org.apache.maven.wagon.providers.scm.ScmGitExeWagonTest.testWagonPutDirectory

Error Message:
Error interacting with SCM: Unable to commit file. The git-commit command failed.
*** Please tell me who you are.

Run

  git config --global user.email "[hidden email]"
  git config --global user.name "Your Name"

to set your account's default identity.
Omit --global to set the identity only in this repository.

fatal:********@asf922.gq1.ygridcore.net>) not allowed


Stack Trace:
org.apache.maven.wagon.TransferFailedException:
Error interacting with SCM: Unable to commit file. The git-commit command failed.
*** Please tell me who you are.

Run

  git config --global user.email "[hidden email]"
  git config --global user.name "Your Name"

to set your account's default identity.
Omit --global to set the identity only in this repository.

fatal:********@asf922.gq1.ygridcore.net>) not allowed

Caused by: org.apache.maven.scm.ScmException:
Unable to commit file. The git-commit command failed.
*** Please tell me who you are.

Run

  git config --global user.email "[hidden email]"
  git config --global user.name "Your Name"

to set your account's default identity.
Omit --global to set the identity only in this repository.

fatal:********@asf922.gq1.ygridcore.net>) not allowed



FAILED:  org.apache.maven.wagon.providers.scm.ScmGitExeWagonTest.testWagonPutDirectoryDeepDestination

Error Message:
Error interacting with SCM: Unable to commit file. The git-commit command failed.
*** Please tell me who you are.

Run

  git config --global user.email "[hidden email]"
  git config --global user.name "Your Name"

to set your account's default identity.
Omit --global to set the identity only in this repository.

fatal:********@asf922.gq1.ygridcore.net>) not allowed


Stack Trace:
org.apache.maven.wagon.TransferFailedException:
Error interacting with SCM: Unable to commit file. The git-commit command failed.
*** Please tell me who you are.

Run

  git config --global user.email "[hidden email]"
  git config --global user.name "Your Name"

to set your account's default identity.
Omit --global to set the identity only in this repository.

fatal:********@asf922.gq1.ygridcore.net>) not allowed

Caused by: org.apache.maven.scm.ScmException:
Unable to commit file. The git-commit command failed.
*** Please tell me who you are.

Run

  git config --global user.email "[hidden email]"
  git config --global user.name "Your Name"

to set your account's default identity.
Omit --global to set the identity only in this repository.

fatal:********@asf922.gq1.ygridcore.net>) not allowed



FAILED:  org.apache.maven.wagon.providers.scm.ScmGitExeWagonTest.testWagon

Error Message:

  Unexpected method call TransferListener.transferError(TransferEvent[PUT|ERROR|Repository[scm:git:file:///home/jenkins/jenkins-slave/workspace/n-box_maven-wagon_WAGON-527-KWYDRBGRPK7Q2YVCYHYJDNDOSEOHGQPJHV5AHJB4GNG66RKBHCBA/m/wagon-providers/wagon-scm/target/test-classes/test-repo-git-test/]|null|test-resource[len = 18; mod = 1536860907831]]):
    TransferListener.transferCompleted(TransferEvent[PUT|COMPLETED|Repository[scm:git:file:///home/jenkins/jenkins-slave/workspace/n-box_maven-wagon_WAGON-527-KWYDRBGRPK7Q2YVCYHYJDNDOSEOHGQPJHV5AHJB4GNG66RKBHCBA/m/wagon-providers/wagon-scm/target/test-classes/test-repo-git-test/]|/home/jenkins/jenkins-slave/workspace/n-box_maven-wagon_WAGON-527-KWYDRBGRPK7Q2YVCYHYJDNDOSEOHGQPJHV5AHJB4GNG66RKBHCBA/m/wagon-providers/wagon-scm/target/test-output/test-resource|test-resource[len = 18; mod = 1536860907831]]): expected: 1, actual: 0

Stack Trace:
java.lang.AssertionError:

  Unexpected method call TransferListener.transferError(TransferEvent[PUT|ERROR|Repository[scm:git:file:///home/jenkins/jenkins-slave/workspace/n-box_maven-wagon_WAGON-527-KWYDRBGRPK7Q2YVCYHYJDNDOSEOHGQPJHV5AHJB4GNG66RKBHCBA/m/wagon-providers/wagon-scm/target/test-classes/test-repo-git-test/]|null|test-resource[len = 18; mod = 1536860907831]]):
    TransferListener.transferCompleted(TransferEvent[PUT|COMPLETED|Repository[scm:git:file:///home/jenkins/jenkins-slave/workspace/n-box_maven-wagon_WAGON-527-KWYDRBGRPK7Q2YVCYHYJDNDOSEOHGQPJHV5AHJB4GNG66RKBHCBA/m/wagon-providers/wagon-scm/target/test-classes/test-repo-git-test/]|/home/jenkins/jenkins-slave/workspace/n-box_maven-wagon_WAGON-527-KWYDRBGRPK7Q2YVCYHYJDNDOSEOHGQPJHV5AHJB4GNG66RKBHCBA/m/wagon-providers/wagon-scm/target/test-output/test-resource|test-resource[len = 18; mod = 1536860907831]]): expected: 1, actual: 0


FAILED:  org.apache.maven.wagon.providers.scm.ScmGitExeWagonTest.testWagonPutDirectoryForDot

Error Message:
Error interacting with SCM: Unable to commit file. The git-commit command failed.
*** Please tell me who you are.

Run

  git config --global user.email "[hidden email]"
  git config --global user.name "Your Name"

to set your account's default identity.
Omit --global to set the identity only in this repository.

fatal:********@asf922.gq1.ygridcore.net>) not allowed


Stack Trace:
org.apache.maven.wagon.TransferFailedException:
Error interacting with SCM: Unable to commit file. The git-commit command failed.
*** Please tell me who you are.

Run

  git config --global user.email "[hidden email]"
  git config --global user.name "Your Name"

to set your account's default identity.
Omit --global to set the identity only in this repository.

fatal:********@asf922.gq1.ygridcore.net>) not allowed

Caused by: org.apache.maven.scm.ScmException:
Unable to commit file. The git-commit command failed.
*** Please tell me who you are.

Run

  git config --global user.email "[hidden email]"
  git config --global user.name "Your Name"

to set your account's default identity.
Omit --global to set the identity only in this repository.

fatal:********@asf922.gq1.ygridcore.net>) not allowed



FAILED:  org.apache.maven.wagon.providers.scm.ScmGitExeWagonTest.testWagonPutDirectoryWhenDirectoryAlreadyExists

Error Message:
Error interacting with SCM: Unable to commit file. The git-commit command failed.
*** Please tell me who you are.

Run

  git config --global user.email "[hidden email]"
  git config --global user.name "Your Name"

to set your account's default identity.
Omit --global to set the identity only in this repository.

fatal:********@asf922.gq1.ygridcore.net>) not allowed


Stack Trace:
org.apache.maven.wagon.TransferFailedException:
Error interacting with SCM: Unable to commit file. The git-commit command failed.
*** Please tell me who you are.

Run

  git config --global user.email "[hidden email]"
  git config --global user.name "Your Name"

to set your account's default identity.
Omit --global to set the identity only in this repository.

fatal:********@asf922.gq1.ygridcore.net>) not allowed

Caused by: org.apache.maven.scm.ScmException:
Unable to commit file. The git-commit command failed.
*** Please tell me who you are.

Run

  git config --global user.email "[hidden email]"
  git config --global user.name "Your Name"

to set your account's default identity.
Omit --global to set the identity only in this repository.

fatal:********@asf922.gq1.ygridcore.net>) not allowed



FAILED:  org.apache.maven.wagon.providers.scm.ScmGitExeWagonTest.testWagonPutDirectory

Error Message:
Error checking out: command failed: Cloning into 'F:\jenkins\jenkins-slave\workspace\n-box_maven-wagon_WAGON-527-KWYDRBGRPK7Q2YVCYHYJDNDOSEOHGQPJHV5AHJB4GNG66RKBHCBA\m\wagon-providers\wagon-scm\target\test-output\checkout-org.apache.maven.scm.provider.git.gitexe.GitExeScmProvider'...
fatal: '$GIT_DIR' too big
fatal: index-pack failed

Stack Trace:
org.apache.maven.wagon.TransferFailedException:
Error checking out: command failed: Cloning into 'F:\jenkins\jenkins-slave\workspace\n-box_maven-wagon_WAGON-527-KWYDRBGRPK7Q2YVCYHYJDNDOSEOHGQPJHV5AHJB4GNG66RKBHCBA\m\wagon-providers\wagon-scm\target\test-output\checkout-org.apache.maven.scm.provider.git.gitexe.GitExeScmProvider'...
fatal: '$GIT_DIR' too big
fatal: index-pack failed
Caused by: org.apache.maven.scm.ScmException:
command failed: Cloning into 'F:\jenkins\jenkins-slave\workspace\n-box_maven-wagon_WAGON-527-KWYDRBGRPK7Q2YVCYHYJDNDOSEOHGQPJHV5AHJB4GNG66RKBHCBA\m\wagon-providers\wagon-scm\target\test-output\checkout-org.apache.maven.scm.provider.git.gitexe.GitExeScmProvider'...
fatal: '$GIT_DIR' too big
fatal: index-pack failed


FAILED:  org.apache.maven.wagon.providers.scm.ScmGitExeWagonTest.testWagonPutDirectoryDeepDestination

Error Message:
Error checking out: command failed: Cloning into 'F:\jenkins\jenkins-slave\workspace\n-box_maven-wagon_WAGON-527-KWYDRBGRPK7Q2YVCYHYJDNDOSEOHGQPJHV5AHJB4GNG66RKBHCBA\m\wagon-providers\wagon-scm\target\test-output\checkout-org.apache.maven.scm.provider.git.gitexe.GitExeScmProvider'...
fatal: '$GIT_DIR' too big
fatal: index-pack failed

Stack Trace:
org.apache.maven.wagon.TransferFailedException:
Error checking out: command failed: Cloning into 'F:\jenkins\jenkins-slave\workspace\n-box_maven-wagon_WAGON-527-KWYDRBGRPK7Q2YVCYHYJDNDOSEOHGQPJHV5AHJB4GNG66RKBHCBA\m\wagon-providers\wagon-scm\target\test-output\checkout-org.apache.maven.scm.provider.git.gitexe.GitExeScmProvider'...
fatal: '$GIT_DIR' too big
fatal: index-pack failed
Caused by: org.apache.maven.scm.ScmException:
command failed: Cloning into 'F:\jenkins\jenkins-slave\workspace\n-box_maven-wagon_WAGON-527-KWYDRBGRPK7Q2YVCYHYJDNDOSEOHGQPJHV5AHJB4GNG66RKBHCBA\m\wagon-providers\wagon-scm\target\test-output\checkout-org.apache.maven.scm.provider.git.gitexe.GitExeScmProvider'...
fatal: '$GIT_DIR' too big
fatal: index-pack failed


FAILED:  org.apache.maven.wagon.providers.scm.ScmGitExeWagonTest.testWagon

Error Message:

  Unexpected method call TransferListener.transferError(TransferEvent[GET|ERROR|Repository[scm:git:file:///F:/jenkins/jenkins-slave/workspace/n-box_maven-wagon_WAGON-527-KWYDRBGRPK7Q2YVCYHYJDNDOSEOHGQPJHV5AHJB4GNG66RKBHCBA/m/wagon-providers/wagon-scm/target/test-classes/test-repo-git-test/]|null|test-resource[len = 18; mod = 1536861068533]]):
    TransferListener.transferCompleted(TransferEvent[PUT|COMPLETED|Repository[scm:git:file:///F:/jenkins/jenkins-slave/workspace/n-box_maven-wagon_WAGON-527-KWYDRBGRPK7Q2YVCYHYJDNDOSEOHGQPJHV5AHJB4GNG66RKBHCBA/m/wagon-providers/wagon-scm/target/test-classes/test-repo-git-test/]|F:\jenkins\jenkins-slave\workspace\n-box_maven-wagon_WAGON-527-KWYDRBGRPK7Q2YVCYHYJDNDOSEOHGQPJHV5AHJB4GNG66RKBHCBA\m\wagon-providers\wagon-scm\target\test-output\test-resource|test-resource[len = 18; mod = 1536861068533]]): expected: 1, actual: 0

Stack Trace:
java.lang.AssertionError:

  Unexpected method call TransferListener.transferError(TransferEvent[GET|ERROR|Repository[scm:git:file:///F:/jenkins/jenkins-slave/workspace/n-box_maven-wagon_WAGON-527-KWYDRBGRPK7Q2YVCYHYJDNDOSEOHGQPJHV5AHJB4GNG66RKBHCBA/m/wagon-providers/wagon-scm/target/test-classes/test-repo-git-test/]|null|test-resource[len = 18; mod = 1536861068533]]):
    TransferListener.transferCompleted(TransferEvent[PUT|COMPLETED|Repository[scm:git:file:///F:/jenkins/jenkins-slave/workspace/n-box_maven-wagon_WAGON-527-KWYDRBGRPK7Q2YVCYHYJDNDOSEOHGQPJHV5AHJB4GNG66RKBHCBA/m/wagon-providers/wagon-scm/target/test-classes/test-repo-git-test/]|F:\jenkins\jenkins-slave\workspace\n-box_maven-wagon_WAGON-527-KWYDRBGRPK7Q2YVCYHYJDNDOSEOHGQPJHV5AHJB4GNG66RKBHCBA\m\wagon-providers\wagon-scm\target\test-output\test-resource|test-resource[len = 18; mod = 1536861068533]]): expected: 1, actual: 0


FAILED:  org.apache.maven.wagon.providers.scm.ScmGitExeWagonTest.testWagonPutDirectoryForDot

Error Message:
Error checking out: command failed: Cloning into 'F:\jenkins\jenkins-slave\workspace\n-box_maven-wagon_WAGON-527-KWYDRBGRPK7Q2YVCYHYJDNDOSEOHGQPJHV5AHJB4GNG66RKBHCBA\m\wagon-providers\wagon-scm\target\test-output\checkout-org.apache.maven.scm.provider.git.gitexe.GitExeScmProvider'...
fatal: '$GIT_DIR' too big
fatal: index-pack failed

Stack Trace:
org.apache.maven.wagon.TransferFailedException:
Error checking out: command failed: Cloning into 'F:\jenkins\jenkins-slave\workspace\n-box_maven-wagon_WAGON-527-KWYDRBGRPK7Q2YVCYHYJDNDOSEOHGQPJHV5AHJB4GNG66RKBHCBA\m\wagon-providers\wagon-scm\target\test-output\checkout-org.apache.maven.scm.provider.git.gitexe.GitExeScmProvider'...
fatal: '$GIT_DIR' too big
fatal: index-pack failed
Caused by: org.apache.maven.scm.ScmException:
command failed: Cloning into 'F:\jenkins\jenkins-slave\workspace\n-box_maven-wagon_WAGON-527-KWYDRBGRPK7Q2YVCYHYJDNDOSEOHGQPJHV5AHJB4GNG66RKBHCBA\m\wagon-providers\wagon-scm\target\test-output\checkout-org.apache.maven.scm.provider.git.gitexe.GitExeScmProvider'...
fatal: '$GIT_DIR' too big
fatal: index-pack failed


FAILED:  org.apache.maven.wagon.providers.scm.ScmGitExeWagonTest.testFailedGet

Error Message:
Error getting file from SCM

Stack Trace:
org.apache.maven.wagon.TransferFailedException: Error getting file from SCM
Caused by: org.apache.maven.scm.ScmException:
command failed: Cloning into 'F:\jenkins\jenkins-slave\workspace\n-box_maven-wagon_WAGON-527-KWYDRBGRPK7Q2YVCYHYJDNDOSEOHGQPJHV5AHJB4GNG66RKBHCBA\m\wagon-providers\wagon-scm\target\test-output\checkout-org.apache.maven.scm.provider.git.gitexe.GitExeScmProvider'...
fatal: '$GIT_DIR' too big
fatal: index-pack failed


FAILED:  org.apache.maven.wagon.providers.scm.ScmGitExeWagonTest.testWagonPutDirectoryWhenDirectoryAlreadyExists

Error Message:
Error checking out: command failed: Cloning into 'F:\jenkins\jenkins-slave\workspace\n-box_maven-wagon_WAGON-527-KWYDRBGRPK7Q2YVCYHYJDNDOSEOHGQPJHV5AHJB4GNG66RKBHCBA\m\wagon-providers\wagon-scm\target\test-output\checkout-org.apache.maven.scm.provider.git.gitexe.GitExeScmProvider'...
fatal: '$GIT_DIR' too big
fatal: index-pack failed

Stack Trace:
org.apache.maven.wagon.TransferFailedException:
Error checking out: command failed: Cloning into 'F:\jenkins\jenkins-slave\workspace\n-box_maven-wagon_WAGON-527-KWYDRBGRPK7Q2YVCYHYJDNDOSEOHGQPJHV5AHJB4GNG66RKBHCBA\m\wagon-providers\wagon-scm\target\test-output\checkout-org.apache.maven.scm.provider.git.gitexe.GitExeScmProvider'...
fatal: '$GIT_DIR' too big
fatal: index-pack failed
Caused by: org.apache.maven.scm.ScmException:
command failed: Cloning into 'F:\jenkins\jenkins-slave\workspace\n-box_maven-wagon_WAGON-527-KWYDRBGRPK7Q2YVCYHYJDNDOSEOHGQPJHV5AHJB4GNG66RKBHCBA\m\wagon-providers\wagon-scm\target\test-output\checkout-org.apache.maven.scm.provider.git.gitexe.GitExeScmProvider'...
fatal: '$GIT_DIR' too big
fatal: index-pack failed


FAILED:  org.apache.maven.wagon.providers.scm.ScmGitExeWagonTest.testWagonPutDirectory

Error Message:
Error checking out: command failed: Cloning into 'F:\jenkins\jenkins-slave\workspace\n-box_maven-wagon_WAGON-527-KWYDRBGRPK7Q2YVCYHYJDNDOSEOHGQPJHV5AHJB4GNG66RKBHCBA\m\wagon-providers\wagon-scm\target\test-output\checkout-org.apache.maven.scm.provider.git.gitexe.GitExeScmProvider'...
fatal: '$GIT_DIR' too big
fatal: index-pack failed

Stack Trace:
org.apache.maven.wagon.TransferFailedException:
Error checking out: command failed: Cloning into 'F:\jenkins\jenkins-slave\workspace\n-box_maven-wagon_WAGON-527-KWYDRBGRPK7Q2YVCYHYJDNDOSEOHGQPJHV5AHJB4GNG66RKBHCBA\m\wagon-providers\wagon-scm\target\test-output\checkout-org.apache.maven.scm.provider.git.gitexe.GitExeScmProvider'...
fatal: '$GIT_DIR' too big
fatal: index-pack failed
Caused by: org.apache.maven.scm.ScmException:
command failed: Cloning into 'F:\jenkins\jenkins-slave\workspace\n-box_maven-wagon_WAGON-527-KWYDRBGRPK7Q2YVCYHYJDNDOSEOHGQPJHV5AHJB4GNG66RKBHCBA\m\wagon-providers\wagon-scm\target\test-output\checkout-org.apache.maven.scm.provider.git.gitexe.GitExeScmProvider'...
fatal: '$GIT_DIR' too big
fatal: index-pack failed


FAILED:  org.apache.maven.wagon.providers.scm.ScmGitExeWagonTest.testWagonPutDirectoryDeepDestination

Error Message:
Error checking out: command failed: Cloning into 'F:\jenkins\jenkins-slave\workspace\n-box_maven-wagon_WAGON-527-KWYDRBGRPK7Q2YVCYHYJDNDOSEOHGQPJHV5AHJB4GNG66RKBHCBA\m\wagon-providers\wagon-scm\target\test-output\checkout-org.apache.maven.scm.provider.git.gitexe.GitExeScmProvider'...
fatal: '$GIT_DIR' too big
fatal: index-pack failed

Stack Trace:
org.apache.maven.wagon.TransferFailedException:
Error checking out: command failed: Cloning into 'F:\jenkins\jenkins-slave\workspace\n-box_maven-wagon_WAGON-527-KWYDRBGRPK7Q2YVCYHYJDNDOSEOHGQPJHV5AHJB4GNG66RKBHCBA\m\wagon-providers\wagon-scm\target\test-output\checkout-org.apache.maven.scm.provider.git.gitexe.GitExeScmProvider'...
fatal: '$GIT_DIR' too big
fatal: index-pack failed
Caused by: org.apache.maven.scm.ScmException:
command failed: Cloning into 'F:\jenkins\jenkins-slave\workspace\n-box_maven-wagon_WAGON-527-KWYDRBGRPK7Q2YVCYHYJDNDOSEOHGQPJHV5AHJB4GNG66RKBHCBA\m\wagon-providers\wagon-scm\target\test-output\checkout-org.apache.maven.scm.provider.git.gitexe.GitExeScmProvider'...
fatal: '$GIT_DIR' too big
fatal: index-pack failed


FAILED:  org.apache.maven.wagon.providers.scm.ScmGitExeWagonTest.testWagon

Error Message:

  Unexpected method call TransferListener.transferError(TransferEvent[GET|ERROR|Repository[scm:git:file:///F:/jenkins/jenkins-slave/workspace/n-box_maven-wagon_WAGON-527-KWYDRBGRPK7Q2YVCYHYJDNDOSEOHGQPJHV5AHJB4GNG66RKBHCBA/m/wagon-providers/wagon-scm/target/test-classes/test-repo-git-test/]|null|test-resource[len = 18; mod = 1536861085171]]):
    TransferListener.transferCompleted(TransferEvent[PUT|COMPLETED|Repository[scm:git:file:///F:/jenkins/jenkins-slave/workspace/n-box_maven-wagon_WAGON-527-KWYDRBGRPK7Q2YVCYHYJDNDOSEOHGQPJHV5AHJB4GNG66RKBHCBA/m/wagon-providers/wagon-scm/target/test-classes/test-repo-git-test/]|F:\jenkins\jenkins-slave\workspace\n-box_maven-wagon_WAGON-527-KWYDRBGRPK7Q2YVCYHYJDNDOSEOHGQPJHV5AHJB4GNG66RKBHCBA\m\wagon-providers\wagon-scm\target\test-output\test-resource|test-resource[len = 18; mod = 1536861085171]]): expected: 1, actual: 0

Stack Trace:
java.lang.AssertionError:

  Unexpected method call TransferListener.transferError(TransferEvent[GET|ERROR|Repository[scm:git:file:///F:/jenkins/jenkins-slave/workspace/n-box_maven-wagon_WAGON-527-KWYDRBGRPK7Q2YVCYHYJDNDOSEOHGQPJHV5AHJB4GNG66RKBHCBA/m/wagon-providers/wagon-scm/target/test-classes/test-repo-git-test/]|null|test-resource[len = 18; mod = 1536861085171]]):
    TransferListener.transferCompleted(TransferEvent[PUT|COMPLETED|Repository[scm:git:file:///F:/jenkins/jenkins-slave/workspace/n-box_maven-wagon_WAGON-527-KWYDRBGRPK7Q2YVCYHYJDNDOSEOHGQPJHV5AHJB4GNG66RKBHCBA/m/wagon-providers/wagon-scm/target/test-classes/test-repo-git-test/]|F:\jenkins\jenkins-slave\workspace\n-box_maven-wagon_WAGON-527-KWYDRBGRPK7Q2YVCYHYJDNDOSEOHGQPJHV5AHJB4GNG66RKBHCBA\m\wagon-providers\wagon-scm\target\test-output\test-resource|test-resource[len = 18; mod = 1536861085171]]): expected: 1, actual: 0


FAILED:  org.apache.maven.wagon.providers.scm.ScmGitExeWagonTest.testWagonPutDirectoryForDot

Error Message:
Error checking out: command failed: Cloning into 'F:\jenkins\jenkins-slave\workspace\n-box_maven-wagon_WAGON-527-KWYDRBGRPK7Q2YVCYHYJDNDOSEOHGQPJHV5AHJB4GNG66RKBHCBA\m\wagon-providers\wagon-scm\target\test-output\checkout-org.apache.maven.scm.provider.git.gitexe.GitExeScmProvider'...
fatal: '$GIT_DIR' too big
fatal: index-pack failed

Stack Trace:
org.apache.maven.wagon.TransferFailedException:
Error checking out: command failed: Cloning into 'F:\jenkins\jenkins-slave\workspace\n-box_maven-wagon_WAGON-527-KWYDRBGRPK7Q2YVCYHYJDNDOSEOHGQPJHV5AHJB4GNG66RKBHCBA\m\wagon-providers\wagon-scm\target\test-output\checkout-org.apache.maven.scm.provider.git.gitexe.GitExeScmProvider'...
fatal: '$GIT_DIR' too big
fatal: index-pack failed
Caused by: org.apache.maven.scm.ScmException:
command failed: Cloning into 'F:\jenkins\jenkins-slave\workspace\n-box_maven-wagon_WAGON-527-KWYDRBGRPK7Q2YVCYHYJDNDOSEOHGQPJHV5AHJB4GNG66RKBHCBA\m\wagon-providers\wagon-scm\target\test-output\checkout-org.apache.maven.scm.provider.git.gitexe.GitExeScmProvider'...
fatal: '$GIT_DIR' too big
fatal: index-pack failed


FAILED:  org.apache.maven.wagon.providers.scm.ScmGitExeWagonTest.testFailedGet

Error Message:
Error getting file from SCM

Stack Trace:
org.apache.maven.wagon.TransferFailedException: Error getting file from SCM
Caused by: org.apache.maven.scm.ScmException:
command failed: Cloning into 'F:\jenkins\jenkins-slave\workspace\n-box_maven-wagon_WAGON-527-KWYDRBGRPK7Q2YVCYHYJDNDOSEOHGQPJHV5AHJB4GNG66RKBHCBA\m\wagon-providers\wagon-scm\target\test-output\checkout-org.apache.maven.scm.provider.git.gitexe.GitExeScmProvider'...
fatal: '$GIT_DIR' too big
fatal: index-pack failed


FAILED:  org.apache.maven.wagon.providers.scm.ScmGitExeWagonTest.testWagonPutDirectoryWhenDirectoryAlreadyExists

Error Message:
Error checking out: command failed: Cloning into 'F:\jenkins\jenkins-slave\workspace\n-box_maven-wagon_WAGON-527-KWYDRBGRPK7Q2YVCYHYJDNDOSEOHGQPJHV5AHJB4GNG66RKBHCBA\m\wagon-providers\wagon-scm\target\test-output\checkout-org.apache.maven.scm.provider.git.gitexe.GitExeScmProvider'...
fatal: '$GIT_DIR' too big
fatal: index-pack failed

Stack Trace:
org.apache.maven.wagon.TransferFailedException:
Error checking out: command failed: Cloning into 'F:\jenkins\jenkins-slave\workspace\n-box_maven-wagon_WAGON-527-KWYDRBGRPK7Q2YVCYHYJDNDOSEOHGQPJHV5AHJB4GNG66RKBHCBA\m\wagon-providers\wagon-scm\target\test-output\checkout-org.apache.maven.scm.provider.git.gitexe.GitExeScmProvider'...
fatal: '$GIT_DIR' too big
fatal: index-pack failed
Caused by: org.apache.maven.scm.ScmException:
command failed: Cloning into 'F:\jenkins\jenkins-slave\workspace\n-box_maven-wagon_WAGON-527-KWYDRBGRPK7Q2YVCYHYJDNDOSEOHGQPJHV5AHJB4GNG66RKBHCBA\m\wagon-providers\wagon-scm\target\test-output\checkout-org.apache.maven.scm.provider.git.gitexe.GitExeScmProvider'...
fatal: '$GIT_DIR' too big
fatal: index-pack failed


FAILED:  org.apache.maven.wagon.providers.scm.ScmGitExeWagonTest.testWagonPutDirectory

Error Message:
Error checking out: command failed: Cloning into 'F:\jenkins\jenkins-slave\workspace\n-box_maven-wagon_WAGON-527-KWYDRBGRPK7Q2YVCYHYJDNDOSEOHGQPJHV5AHJB4GNG66RKBHCBA\m\wagon-providers\wagon-scm\target\test-output\checkout-org.apache.maven.scm.provider.git.gitexe.GitExeScmProvider'...
fatal: cannot stat 'F:/jenkins/jenkins-slave/workspace/n-box_maven-wagon_WAGON-527-KWYDRBGRPK7Q2YVCYHYJDNDOSEOHGQPJHV5AHJB4GNG66RKBHCBA/m/wagon-providers/wagon-scm/target/test-output/checkout-org.apache.maven.scm.provider.git.gitexe.GitExeScmProvider/.git/hooks/applypatch-msg.sample': Filename too long

Stack Trace:
org.apache.maven.wagon.TransferFailedException:
Error checking out: command failed: Cloning into 'F:\jenkins\jenkins-slave\workspace\n-box_maven-wagon_WAGON-527-KWYDRBGRPK7Q2YVCYHYJDNDOSEOHGQPJHV5AHJB4GNG66RKBHCBA\m\wagon-providers\wagon-scm\target\test-output\checkout-org.apache.maven.scm.provider.git.gitexe.GitExeScmProvider'...
fatal: cannot stat 'F:/jenkins/jenkins-slave/workspace/n-box_maven-wagon_WAGON-527-KWYDRBGRPK7Q2YVCYHYJDNDOSEOHGQPJHV5AHJB4GNG66RKBHCBA/m/wagon-providers/wagon-scm/target/test-output/checkout-org.apache.maven.scm.provider.git.gitexe.GitExeScmProvider/.git/hooks/applypatch-msg.sample': Filename too long
Caused by: org.apache.maven.scm.ScmException:
command failed: Cloning into 'F:\jenkins\jenkins-slave\workspace\n-box_maven-wagon_WAGON-527-KWYDRBGRPK7Q2YVCYHYJDNDOSEOHGQPJHV5AHJB4GNG66RKBHCBA\m\wagon-providers\wagon-scm\target\test-output\checkout-org.apache.maven.scm.provider.git.gitexe.GitExeScmProvider'...
fatal: cannot stat 'F:/jenkins/jenkins-slave/workspace/n-box_maven-wagon_WAGON-527-KWYDRBGRPK7Q2YVCYHYJDNDOSEOHGQPJHV5AHJB4GNG66RKBHCBA/m/wagon-providers/wagon-scm/target/test-output/checkout-org.apache.maven.scm.provider.git.gitexe.GitExeScmProvider/.git/hooks/applypatch-msg.sample': Filename too long


FAILED:  org.apache.maven.wagon.providers.scm.ScmGitExeWagonTest.testWagonPutDirectoryDeepDestination

Error Message:
Error checking out: command failed: Cloning into 'F:\jenkins\jenkins-slave\workspace\n-box_maven-wagon_WAGON-527-KWYDRBGRPK7Q2YVCYHYJDNDOSEOHGQPJHV5AHJB4GNG66RKBHCBA\m\wagon-providers\wagon-scm\target\test-output\checkout-org.apache.maven.scm.provider.git.gitexe.GitExeScmProvider'...
fatal: cannot stat 'F:/jenkins/jenkins-slave/workspace/n-box_maven-wagon_WAGON-527-KWYDRBGRPK7Q2YVCYHYJDNDOSEOHGQPJHV5AHJB4GNG66RKBHCBA/m/wagon-providers/wagon-scm/target/test-output/checkout-org.apache.maven.scm.provider.git.gitexe.GitExeScmProvider/.git/hooks/applypatch-msg.sample': Filename too long

Stack Trace:
org.apache.maven.wagon.TransferFailedException:
Error checking out: command failed: Cloning into 'F:\jenkins\jenkins-slave\workspace\n-box_maven-wagon_WAGON-527-KWYDRBGRPK7Q2YVCYHYJDNDOSEOHGQPJHV5AHJB4GNG66RKBHCBA\m\wagon-providers\wagon-scm\target\test-output\checkout-org.apache.maven.scm.provider.git.gitexe.GitExeScmProvider'...
fatal: cannot stat 'F:/jenkins/jenkins-slave/workspace/n-box_maven-wagon_WAGON-527-KWYDRBGRPK7Q2YVCYHYJDNDOSEOHGQPJHV5AHJB4GNG66RKBHCBA/m/wagon-providers/wagon-scm/target/test-output/checkout-org.apache.maven.scm.provider.git.gitexe.GitExeScmProvider/.git/hooks/applypatch-msg.sample': Filename too long
Caused by: org.apache.maven.scm.ScmException:
command failed: Cloning into 'F:\jenkins\jenkins-slave\workspace\n-box_maven-wagon_WAGON-527-KWYDRBGRPK7Q2YVCYHYJDNDOSEOHGQPJHV5AHJB4GNG66RKBHCBA\m\wagon-providers\wagon-scm\target\test-output\checkout-org.apache.maven.scm.provider.git.gitexe.GitExeScmProvider'...
fatal: cannot stat 'F:/jenkins/jenkins-slave/workspace/n-box_maven-wagon_WAGON-527-KWYDRBGRPK7Q2YVCYHYJDNDOSEOHGQPJHV5AHJB4GNG66RKBHCBA/m/wagon-providers/wagon-scm/target/test-output/checkout-org.apache.maven.scm.provider.git.gitexe.GitExeScmProvider/.git/hooks/applypatch-msg.sample': Filename too long


FAILED:  org.apache.maven.wagon.providers.scm.ScmGitExeWagonTest.testWagon

Error Message:

  Unexpected method call TransferListener.transferError(TransferEvent[GET|ERROR|Repository[scm:git:file:///F:/jenkins/jenkins-slave/workspace/n-box_maven-wagon_WAGON-527-KWYDRBGRPK7Q2YVCYHYJDNDOSEOHGQPJHV5AHJB4GNG66RKBHCBA/m/wagon-providers/wagon-scm/target/test-classes/test-repo-git-test/]|null|test-resource[len = 18; mod = 1536861137561]]):
    TransferListener.transferCompleted(TransferEvent[PUT|COMPLETED|Repository[scm:git:file:///F:/jenkins/jenkins-slave/workspace/n-box_maven-wagon_WAGON-527-KWYDRBGRPK7Q2YVCYHYJDNDOSEOHGQPJHV5AHJB4GNG66RKBHCBA/m/wagon-providers/wagon-scm/target/test-classes/test-repo-git-test/]|F:\jenkins\jenkins-slave\workspace\n-box_maven-wagon_WAGON-527-KWYDRBGRPK7Q2YVCYHYJDNDOSEOHGQPJHV5AHJB4GNG66RKBHCBA\m\wagon-providers\wagon-scm\target\test-output\test-resource|test-resource[len = 18; mod = 1536861137561]]): expected: 1, actual: 0

Stack Trace:
java.lang.AssertionError:

  Unexpected method call TransferListener.transferError(TransferEvent[GET|ERROR|Repository[scm:git:file:///F:/jenkins/jenkins-slave/workspace/n-box_maven-wagon_WAGON-527-KWYDRBGRPK7Q2YVCYHYJDNDOSEOHGQPJHV5AHJB4GNG66RKBHCBA/m/wagon-providers/wagon-scm/target/test-classes/test-repo-git-test/]|null|test-resource[len = 18; mod = 1536861137561]]):
    TransferListener.transferCompleted(TransferEvent[PUT|COMPLETED|Repository[scm:git:file:///F:/jenkins/jenkins-slave/workspace/n-box_maven-wagon_WAGON-527-KWYDRBGRPK7Q2YVCYHYJDNDOSEOHGQPJHV5AHJB4GNG66RKBHCBA/m/wagon-providers/wagon-scm/target/test-classes/test-repo-git-test/]|F:\jenkins\jenkins-slave\workspace\n-box_maven-wagon_WAGON-527-KWYDRBGRPK7Q2YVCYHYJDNDOSEOHGQPJHV5AHJB4GNG66RKBHCBA\m\wagon-providers\wagon-scm\target\test-output\test-resource|test-resource[len = 18; mod = 1536861137561]]): expected: 1, actual: 0


FAILED:  org.apache.maven.wagon.providers.scm.ScmGitExeWagonTest.testWagonPutDirectoryForDot

Error Message:
Error checking out: command failed: Cloning into 'F:\jenkins\jenkins-slave\workspace\n-box_maven-wagon_WAGON-527-KWYDRBGRPK7Q2YVCYHYJDNDOSEOHGQPJHV5AHJB4GNG66RKBHCBA\m\wagon-providers\wagon-scm\target\test-output\checkout-org.apache.maven.scm.provider.git.gitexe.GitExeScmProvider'...
fatal: cannot stat 'F:/jenkins/jenkins-slave/workspace/n-box_maven-wagon_WAGON-527-KWYDRBGRPK7Q2YVCYHYJDNDOSEOHGQPJHV5AHJB4GNG66RKBHCBA/m/wagon-providers/wagon-scm/target/test-output/checkout-org.apache.maven.scm.provider.git.gitexe.GitExeScmProvider/.git/hooks/applypatch-msg.sample': Filename too long

Stack Trace:
org.apache.maven.wagon.TransferFailedException:
Error checking out: command failed: Cloning into 'F:\jenkins\jenkins-slave\workspace\n-box_maven-wagon_WAGON-527-KWYDRBGRPK7Q2YVCYHYJDNDOSEOHGQPJHV5AHJB4GNG66RKBHCBA\m\wagon-providers\wagon-scm\target\test-output\checkout-org.apache.maven.scm.provider.git.gitexe.GitExeScmProvider'...
fatal: cannot stat 'F:/jenkins/jenkins-slave/workspace/n-box_maven-wagon_WAGON-527-KWYDRBGRPK7Q2YVCYHYJDNDOSEOHGQPJHV5AHJB4GNG66RKBHCBA/m/wagon-providers/wagon-scm/target/test-output/checkout-org.apache.maven.scm.provider.git.gitexe.GitExeScmProvider/.git/hooks/applypatch-msg.sample': Filename too long
Caused by: org.apache.maven.scm.ScmException:
command failed: Cloning into 'F:\jenkins\jenkins-slave\workspace\n-box_maven-wagon_WAGON-527-KWYDRBGRPK7Q2YVCYHYJDNDOSEOHGQPJHV5AHJB4GNG66RKBHCBA\m\wagon-providers\wagon-scm\target\test-output\checkout-org.apache.maven.scm.provider.git.gitexe.GitExeScmProvider'...
fatal: cannot stat 'F:/jenkins/jenkins-slave/workspace/n-box_maven-wagon_WAGON-527-KWYDRBGRPK7Q2YVCYHYJDNDOSEOHGQPJHV5AHJB4GNG66RKBHCBA/m/wagon-providers/wagon-scm/target/test-output/checkout-org.apache.maven.scm.provider.git.gitexe.GitExeScmProvider/.git/hooks/applypatch-msg.sample': Filename too long


FAILED:  org.apache.maven.wagon.providers.scm.ScmGitExeWagonTest.testFailedGet

Error Message:
Error getting file from SCM

Stack Trace:
org.apache.maven.wagon.TransferFailedException: Error getting file from SCM
Caused by: org.apache.maven.scm.ScmException:
command failed: Cloning into 'F:\jenkins\jenkins-slave\workspace\n-box_maven-wagon_WAGON-527-KWYDRBGRPK7Q2YVCYHYJDNDOSEOHGQPJHV5AHJB4GNG66RKBHCBA\m\wagon-providers\wagon-scm\target\test-output\checkout-org.apache.maven.scm.provider.git.gitexe.GitExeScmProvider'...
fatal: cannot stat 'F:/jenkins/jenkins-slave/workspace/n-box_maven-wagon_WAGON-527-KWYDRBGRPK7Q2YVCYHYJDNDOSEOHGQPJHV5AHJB4GNG66RKBHCBA/m/wagon-providers/wagon-scm/target/test-output/checkout-org.apache.maven.scm.provider.git.gitexe.GitExeScmProvider/.git/hooks/applypatch-msg.sample': Filename too long


FAILED:  org.apache.maven.wagon.providers.scm.ScmGitExeWagonTest.testWagonPutDirectoryWhenDirectoryAlreadyExists

Error Message:
Error checking out: command failed: Cloning into 'F:\jenkins\jenkins-slave\workspace\n-box_maven-wagon_WAGON-527-KWYDRBGRPK7Q2YVCYHYJDNDOSEOHGQPJHV5AHJB4GNG66RKBHCBA\m\wagon-providers\wagon-scm\target\test-output\checkout-org.apache.maven.scm.provider.git.gitexe.GitExeScmProvider'...
fatal: cannot stat 'F:/jenkins/jenkins-slave/workspace/n-box_maven-wagon_WAGON-527-KWYDRBGRPK7Q2YVCYHYJDNDOSEOHGQPJHV5AHJB4GNG66RKBHCBA/m/wagon-providers/wagon-scm/target/test-output/checkout-org.apache.maven.scm.provider.git.gitexe.GitExeScmProvider/.git/hooks/applypatch-msg.sample': Filename too long

Stack Trace:
org.apache.maven.wagon.TransferFailedException:
Error checking out: command failed: Cloning into 'F:\jenkins\jenkins-slave\workspace\n-box_maven-wagon_WAGON-527-KWYDRBGRPK7Q2YVCYHYJDNDOSEOHGQPJHV5AHJB4GNG66RKBHCBA\m\wagon-providers\wagon-scm\target\test-output\checkout-org.apache.maven.scm.provider.git.gitexe.GitExeScmProvider'...
fatal: cannot stat 'F:/jenkins/jenkins-slave/workspace/n-box_maven-wagon_WAGON-527-KWYDRBGRPK7Q2YVCYHYJDNDOSEOHGQPJHV5AHJB4GNG66RKBHCBA/m/wagon-providers/wagon-scm/target/test-output/checkout-org.apache.maven.scm.provider.git.gitexe.GitExeScmProvider/.git/hooks/applypatch-msg.sample': Filename too long
Caused by: org.apache.maven.scm.ScmException:
command failed: Cloning into 'F:\jenkins\jenkins-slave\workspace\n-box_maven-wagon_WAGON-527-KWYDRBGRPK7Q2YVCYHYJDNDOSEOHGQPJHV5AHJB4GNG66RKBHCBA\m\wagon-providers\wagon-scm\target\test-output\checkout-org.apache.maven.scm.provider.git.gitexe.GitExeScmProvider'...
fatal: cannot stat 'F:/jenkins/jenkins-slave/workspace/n-box_maven-wagon_WAGON-527-KWYDRBGRPK7Q2YVCYHYJDNDOSEOHGQPJHV5AHJB4GNG66RKBHCBA/m/wagon-providers/wagon-scm/target/test-output/checkout-org.apache.maven.scm.provider.git.gitexe.GitExeScmProvider/.git/hooks/applypatch-msg.sample': Filename too long




Build log:
[...truncated 3.37 MB...]
[windows-jdk9] [INFO] Checking unresolved references to org.codehaus.mojo.signature:java17:1.0
[windows-jdk9] [INFO]
[windows-jdk9] [INFO] --- maven-resources-plugin:3.0.2:testResources (default-testResources) @ wagon-webdav-jackrabbit ---
[windows-jdk9] [INFO] Using 'UTF-8' encoding to copy filtered resources.
[windows-jdk9] [INFO] Copying 2 resources
[windows-jdk9] [INFO] Copying 3 resources
[windows-jdk9] [INFO]
[windows-jdk9] [INFO] --- maven-compiler-plugin:3.7.0:testCompile (default-testCompile) @ wagon-webdav-jackrabbit ---
[windows-jdk9] [INFO] Changes detected - recompiling the module!
[windows-jdk9] [INFO] Compiling 4 source files to F:\jenkins\jenkins-slave\workspace\n-box_maven-wagon_WAGON-527-KWYDRBGRPK7Q2YVCYHYJDNDOSEOHGQPJHV5AHJB4GNG66RKBHCBA\m\wagon-providers\wagon-webdav-jackrabbit\target\test-classes
[windows-jdk9] [INFO] /F:/jenkins/jenkins-slave/workspace/n-box_maven-wagon_WAGON-527-KWYDRBGRPK7Q2YVCYHYJDNDOSEOHGQPJHV5AHJB4GNG66RKBHCBA/m/wagon-providers/wagon-webdav-jackrabbit/src/test/java/org/apache/maven/wagon/providers/webdav/HttpClientWagonTest.java: F:\jenkins\jenkins-slave\workspace\n-box_maven-wagon_WAGON-527-KWYDRBGRPK7Q2YVCYHYJDNDOSEOHGQPJHV5AHJB4GNG66RKBHCBA\m\wagon-providers\wagon-webdav-jackrabbit\src\test\java\org\apache\maven\wagon\providers\webdav\HttpClientWagonTest.java uses or overrides a deprecated API.
[windows-jdk9] [INFO] /F:/jenkins/jenkins-slave/workspace/n-box_maven-wagon_WAGON-527-KWYDRBGRPK7Q2YVCYHYJDNDOSEOHGQPJHV5AHJB4GNG66RKBHCBA/m/wagon-providers/wagon-webdav-jackrabbit/src/test/java/org/apache/maven/wagon/providers/webdav/HttpClientWagonTest.java: Recompile with -Xlint:deprecation for details.
[windows-jdk9] [INFO]
[windows-jdk9] [INFO] --- maven-surefire-plugin:2.20:test (default-test) @ wagon-webdav-jackrabbit ---
[windows-jdk9] [INFO]
[windows-jdk9] [INFO] -------------------------------------------------------
[windows-jdk9] [INFO]  T E S T S
[windows-jdk9] [INFO] -------------------------------------------------------
[windows-jdk9] [INFO] Running org.apache.maven.wagon.providers.webdav.HttpClientWagonTest
[windows-jdk9] [INFO] Tests run: 6, Failures: 0, Errors: 0, Skipped: 0, Time elapsed: 0.741 s - in org.apache.maven.wagon.providers.webdav.HttpClientWagonTest
[windows-jdk9] [INFO] Running org.apache.maven.wagon.providers.webdav.PathNavigatorTest
[windows-jdk9] [INFO] Tests run: 1, Failures: 0, Errors: 0, Skipped: 0, Time elapsed: 0 s - in org.apache.maven.wagon.providers.webdav.PathNavigatorTest
[windows-jdk9] [INFO] Running org.apache.maven.wagon.providers.webdav.WebDavsWagonTest
[windows-jdk7] [INFO] Tests run: 69, Failures: 0, Errors: 0, Skipped: 0, Time elapsed: 26.566 s - in org.apache.maven.wagon.providers.webdav.WebDavWagonTest
[windows-jdk7] [INFO]
[windows-jdk7] [INFO] Results:
[windows-jdk7] [INFO]
[windows-jdk7] [INFO] Tests run: 145, Failures: 0, Errors: 0, Skipped: 0
[windows-jdk7] [INFO]
[windows-jdk7] [INFO]
[windows-jdk7] [INFO] --- maven-jar-plugin:3.0.2:jar (default-jar) @ wagon-webdav-jackrabbit ---
[windows-jdk7] [INFO] Building jar: F:\jenkins\jenkins-slave\workspace\n-box_maven-wagon_WAGON-527-KWYDRBGRPK7Q2YVCYHYJDNDOSEOHGQPJHV5AHJB4GNG66RKBHCBA\m\wagon-providers\wagon-webdav-jackrabbit\target\wagon-webdav-jackrabbit-3.1.1-SNAPSHOT.jar
[windows-jdk7] [INFO]
[windows-jdk7] [INFO] --- maven-site-plugin:3.7:attach-descriptor (attach-descriptor) @ wagon-webdav-jackrabbit ---
[windows-jdk7] [INFO] Skipping because packaging 'jar' is not pom.
[windows-jdk7] [INFO]
[windows-jdk7] [INFO] --- maven-checkstyle-plugin:3.0.0:check (checkstyle-check) @ wagon-webdav-jackrabbit ---
[windows-jdk7] [INFO] ------------------------------------------------------------------------
[windows-jdk7] [INFO] Reactor Summary:
[windows-jdk7] [INFO]
[windows-jdk7] [INFO] Apache Maven Wagon ................................. SUCCESS [ 17.408 s]
[windows-jdk7] [INFO] Apache Maven Wagon :: API .......................... SUCCESS [  9.607 s]
[windows-jdk7] [INFO] Apache Maven Wagon :: Provider Test ................ SUCCESS [  3.360 s]
[windows-jdk7] [INFO] Apache Maven Wagon :: Providers .................... SUCCESS [  1.477 s]
[windows-jdk7] [INFO] Apache Maven Wagon :: Providers :: File Provider ... SUCCESS [  3.039 s]
[windows-jdk7] [INFO] Apache Maven Wagon :: Providers :: FTP Provider .... SUCCESS [  6.792 s]
[windows-jdk7] [INFO] Apache Maven Wagon :: Providers :: HTTP Shared Library SUCCESS [  3.454 s]
[windows-jdk7] [INFO] Apache Maven Wagon :: Test Compatibility Kits ...... SUCCESS [  1.143 s]
[windows-jdk7] [INFO] Apache Maven Wagon :: HTTP Test Compatibility Kit .. SUCCESS [  2.020 s]
[windows-jdk7] [INFO] Apache Maven Wagon :: Providers :: HTTP Provider ... SUCCESS [04:34 min]
[windows-jdk7] [INFO] Apache Maven Wagon :: Providers :: Lightweight HTTP Provider SUCCESS [02:10 min]
[windows-jdk7] [INFO] Apache Maven Wagon :: Providers :: SCM Provider .... SUCCESS [ 17.123 s]
[windows-jdk7] [INFO] Apache Maven Wagon :: Providers :: SSH Common Library SUCCESS [  2.750 s]
[windows-jdk7] [INFO] Apache Maven Wagon :: Providers :: SSH Common Tests  SUCCESS [  2.574 s]
[windows-jdk7] [INFO] Apache Maven Wagon :: Providers :: SSH External Provider SUCCESS [  1.722 s]
[windows-jdk7] [INFO] Apache Maven Wagon :: Providers :: SSH Provider .... SUCCESS [  2.793 s]
[windows-jdk7] [INFO] Apache Maven Wagon :: Providers :: WebDAV Provider . SUCCESS [01:02 min]
[windows-jdk7] [INFO] ------------------------------------------------------------------------
[windows-jdk7] [INFO] BUILD SUCCESS
[windows-jdk7] [INFO] ------------------------------------------------------------------------
[windows-jdk7] [INFO] Total time: 09:04 min
[windows-jdk7] [INFO] Finished at: 2018-09-13T17:52:51Z
[windows-jdk7] [INFO] Final Memory: 61M/897M
[windows-jdk7] [INFO] ------------------------------------------------------------------------
[windows-jdk7] [WARNING] The requested profile "run-its" could not be activated because it does not exist.
[windows-jdk7] [INFO] [jenkins-event-spy] Generated F:\jenkins\jenkins-slave\workspace\n-box_maven-wagon_WAGON-527-KWYDRBGRPK7Q2YVCYHYJDNDOSEOHGQPJHV5AHJB4GNG66RKBHCBA@tmp\withMaven4663d6f3\maven-spy-20180913-174346-3054704556265768878424.log
[windows-jdk7] Picked up JAVA_TOOL_OPTIONS: -Dmaven.ext.class.path="f:\jenkins\jenkins-slave\workspace\n-box_maven-wagon_WAGON-527-KWYDRBGRPK7Q2YVCYHYJDNDOSEOHGQPJHV5AHJB4GNG66RKBHCBA@tmp\withMaven4663d6f3\pipeline-maven-spy.jar" -Dorg.jenkinsci.plugins.pipeline.maven.reportsFolder="f:\jenkins\jenkins-slave\workspace\n-box_maven-wagon_WAGON-527-KWYDRBGRPK7Q2YVCYHYJDNDOSEOHGQPJHV5AHJB4GNG66RKBHCBA@tmp\withMaven4663d6f3"
[Pipeline] [windows-jdk8] }
[windows-jdk8] [withMaven] junitPublisher - Archive test results for Maven artifact org.apache.maven.wagon:wagon-provider-api:3.1.1-SNAPSHOT generated by maven-surefire-plugin:test (default-test): m\wagon-provider-api\target\surefire-reports\*.xml
[windows-jdk8] Recording test results
[windows-jdk8] [withMaven] junitPublisher - Archive test results for Maven artifact org.apache.maven.wagon:wagon-provider-test:3.1.1-SNAPSHOT generated by maven-surefire-plugin:test (default-test): m\wagon-provider-test\target\surefire-reports\*.xml
[windows-jdk8] Recording test results
[windows-jdk8] None of the test reports contained any result
[windows-jdk8] [withMaven] junitPublisher - Archive test results for Maven artifact org.apache.maven.wagon:wagon-file:3.1.1-SNAPSHOT generated by maven-surefire-plugin:test (default-test): m\wagon-providers\wagon-file\target\surefire-reports\*.xml
[windows-jdk8] Recording test results
[windows-jdk8] [withMaven] junitPublisher - Archive test results for Maven artifact org.apache.maven.wagon:wagon-ftp:3.1.1-SNAPSHOT generated by maven-surefire-plugin:test (default-test): m\wagon-providers\wagon-ftp\target\surefire-reports\*.xml
[windows-jdk8] Recording test results
[windows-jdk8] [withMaven] junitPublisher - Archive test results for Maven artifact org.apache.maven.wagon:wagon-http-shared:3.1.1-SNAPSHOT generated by maven-surefire-plugin:test (default-test): m\wagon-providers\wagon-http-shared\target\surefire-reports\*.xml
[windows-jdk8] Recording test results
[windows-jdk8] [withMaven] junitPublisher - Archive test results for Maven artifact org.apache.maven.wagon:wagon-tck-http:3.1.1-SNAPSHOT generated by maven-surefire-plugin:test (default-test): m\wagon-tcks\wagon-tck-http\target\surefire-reports\*.xml
[windows-jdk8] Recording test results
[windows-jdk8] None of the test reports contained any result
[windows-jdk8] [withMaven] junitPublisher - Archive test results for Maven artifact org.apache.maven.wagon:wagon-http:3.1.1-SNAPSHOT generated by maven-surefire-plugin:test (default-test): m\wagon-providers\wagon-http\target\surefire-reports\*.xml
[windows-jdk8] Recording test results
[windows-jdk8] [withMaven] junitPublisher - Archive test results for Maven artifact org.apache.maven.wagon:wagon-http-lightweight:3.1.1-SNAPSHOT generated by maven-surefire-plugin:test (default-test): m\wagon-providers\wagon-http-lightweight\target\surefire-reports\*.xml
[windows-jdk8] Recording test results
[windows-jdk8] [withMaven] junitPublisher - Archive test results for Maven artifact org.apache.maven.wagon:wagon-scm:3.1.1-SNAPSHOT generated by maven-surefire-plugin:test (default-test): m\wagon-providers\wagon-scm\target\surefire-reports\*.xml
[windows-jdk8] Recording test results
[windows-jdk8] [withMaven] junitPublisher - Archive test results for Maven artifact org.apache.maven.wagon:wagon-ssh-common:3.1.1-SNAPSHOT generated by maven-surefire-plugin:test (default-test): m\wagon-providers\wagon-ssh-common\target\surefire-reports\*.xml
[windows-jdk8] Recording test results
[windows-jdk8] [withMaven] junitPublisher - Archive test results for Maven artifact org.apache.maven.wagon:wagon-ssh-common-test:3.1.1-SNAPSHOT generated by maven-surefire-plugin:test (default-test): m\wagon-providers\wagon-ssh-common-test\target\surefire-reports\*.xml
[windows-jdk8] Recording test results
[windows-jdk8] None of the test reports contained any result
[windows-jdk8] [withMaven] junitPublisher - Archive test results for Maven artifact org.apache.maven.wagon:wagon-ssh-external:3.1.1-SNAPSHOT generated by maven-surefire-plugin:test (default-test): m\wagon-providers\wagon-ssh-external\target\surefire-reports\*.xml
[windows-jdk8] Recording test results
[windows-jdk8] None of the test reports contained any result
[windows-jdk8] [withMaven] junitPublisher - Archive test results for Maven artifact org.apache.maven.wagon:wagon-ssh:3.1.1-SNAPSHOT generated by maven-surefire-plugin:test (default-test): m\wagon-providers\wagon-ssh\target\surefire-reports\*.xml
[windows-jdk8] Recording test results
[windows-jdk8] None of the test reports contained any result
[windows-jdk8] [withMaven] junitPublisher - Archive test results for Maven artifact org.apache.maven.wagon:wagon-webdav-jackrabbit:3.1.1-SNAPSHOT generated by maven-surefire-plugin:test (default-test): m\wagon-providers\wagon-webdav-jackrabbit\target\surefire-reports\*.xml
[windows-jdk8] Recording test results
[Pipeline] [windows-jdk8] // withMaven
[Pipeline] [windows-jdk7] }
[Pipeline] [windows-jdk8] cleanWs
[Pipeline] [windows-jdk7] // dir
[windows-jdk8] [WS-CLEANUP] Deleting project workspace...[WS-CLEANUP] done
[Pipeline] [windows-jdk7] }
[windows-jdk7] [withMaven] junitPublisher - Archive test results for Maven artifact org.apache.maven.wagon:wagon-provider-api:3.1.1-SNAPSHOT generated by maven-surefire-plugin:test (default-test): m\wagon-provider-api\target\surefire-reports\*.xml
[windows-jdk7] Recording test results
[windows-jdk7] [withMaven] junitPublisher - Archive test results for Maven artifact org.apache.maven.wagon:wagon-provider-test:3.1.1-SNAPSHOT generated by maven-surefire-plugin:test (default-test): m\wagon-provider-test\target\surefire-reports\*.xml
[windows-jdk7] Recording test results
[windows-jdk7] None of the test reports contained any result
[windows-jdk7] [withMaven] junitPublisher - Archive test results for Maven artifact org.apache.maven.wagon:wagon-file:3.1.1-SNAPSHOT generated by maven-surefire-plugin:test (default-test): m\wagon-providers\wagon-file\target\surefire-reports\*.xml
[windows-jdk7] Recording test results
[windows-jdk7] [withMaven] junitPublisher - Archive test results for Maven artifact org.apache.maven.wagon:wagon-ftp:3.1.1-SNAPSHOT generated by maven-surefire-plugin:test (default-test): m\wagon-providers\wagon-ftp\target\surefire-reports\*.xml
[windows-jdk7] Recording test results
[windows-jdk7] [withMaven] junitPublisher - Archive test results for Maven artifact org.apache.maven.wagon:wagon-http-shared:3.1.1-SNAPSHOT generated by maven-surefire-plugin:test (default-test): m\wagon-providers\wagon-http-shared\target\surefire-reports\*.xml
[windows-jdk7] Recording test results
[windows-jdk7] [withMaven] junitPublisher - Archive test results for Maven artifact org.apache.maven.wagon:wagon-tck-http:3.1.1-SNAPSHOT generated by maven-surefire-plugin:test (default-test): m\wagon-tcks\wagon-tck-http\target\surefire-reports\*.xml
[windows-jdk7] Recording test results
[windows-jdk7] None of the test reports contained any result
[windows-jdk7] [withMaven] junitPublisher - Archive test results for Maven artifact org.apache.maven.wagon:wagon-http:3.1.1-SNAPSHOT generated by maven-surefire-plugin:test (default-test): m\wagon-providers\wagon-http\target\surefire-reports\*.xml
[windows-jdk7] Recording test results
[windows-jdk7] [withMaven] junitPublisher - Archive test results for Maven artifact org.apache.maven.wagon:wagon-http-lightweight:3.1.1-SNAPSHOT generated by maven-surefire-plugin:test (default-test): m\wagon-providers\wagon-http-lightweight\target\surefire-reports\*.xml
[windows-jdk7] Recording test results
[windows-jdk7] [withMaven] junitPublisher - Archive test results for Maven artifact org.apache.maven.wagon:wagon-scm:3.1.1-SNAPSHOT generated by maven-surefire-plugin:test (default-test): m\wagon-providers\wagon-scm\target\surefire-reports\*.xml
[windows-jdk7] Recording test results
[windows-jdk7] [withMaven] junitPublisher - Archive test results for Maven artifact org.apache.maven.wagon:wagon-ssh-common:3.1.1-SNAPSHOT generated by maven-surefire-plugin:test (default-test): m\wagon-providers\wagon-ssh-common\target\surefire-reports\*.xml
[windows-jdk7] Recording test results
[windows-jdk7] [withMaven] junitPublisher - Archive test results for Maven artifact org.apache.maven.wagon:wagon-ssh-common-test:3.1.1-SNAPSHOT generated by maven-surefire-plugin:test (default-test): m\wagon-providers\wagon-ssh-common-test\target\surefire-reports\*.xml
[windows-jdk7] Recording test results
[windows-jdk7] None of the test reports contained any result
[windows-jdk7] [withMaven] junitPublisher - Archive test results for Maven artifact org.apache.maven.wagon:wagon-ssh-external:3.1.1-SNAPSHOT generated by maven-surefire-plugin:test (default-test): m\wagon-providers\wagon-ssh-external\target\surefire-reports\*.xml
[windows-jdk7] Recording test results
[windows-jdk7] None of the test reports contained any result
[windows-jdk7] [withMaven] junitPublisher - Archive test results for Maven artifact org.apache.maven.wagon:wagon-ssh:3.1.1-SNAPSHOT generated by maven-surefire-plugin:test (default-test): m\wagon-providers\wagon-ssh\target\surefire-reports\*.xml
[windows-jdk7] Recording test results
[windows-jdk7] None of the test reports contained any result
[windows-jdk7] [withMaven] junitPublisher - Archive test results for Maven artifact org.apache.maven.wagon:wagon-webdav-jackrabbit:3.1.1-SNAPSHOT generated by maven-surefire-plugin:test (default-test): m\wagon-providers\wagon-webdav-jackrabbit\target\surefire-reports\*.xml
[windows-jdk7] Recording test results
[Pipeline] [windows-jdk7] // withMaven
[Pipeline] [windows-jdk7] cleanWs
[Pipeline] [windows-jdk8] }
[Pipeline] [windows-jdk8] // stage
[Pipeline] [windows-jdk8] }
[Pipeline] [windows-jdk8] // node
[windows-jdk7] [WS-CLEANUP] Deleting project workspace...[WS-CLEANUP] done
[Pipeline] [windows-jdk8] }
[Pipeline] [windows-jdk7] }
[Pipeline] [windows-jdk7] // stage
[Pipeline] [windows-jdk7] }
[Pipeline] [windows-jdk7] // node
[Pipeline] [windows-jdk7] }
[windows-jdk9] [INFO] Tests run: 69, Failures: 0, Errors: 0, Skipped: 0, Time elapsed: 32.622 s - in org.apache.maven.wagon.providers.webdav.WebDavsWagonTest
[windows-jdk9] [INFO] Running org.apache.maven.wagon.providers.webdav.WebDavWagonTest
[windows-jdk9] [INFO] Tests run: 69, Failures: 0, Errors: 0, Skipped: 0, Time elapsed: 27.297 s - in org.apache.maven.wagon.providers.webdav.WebDavWagonTest
[windows-jdk9] [INFO]
[windows-jdk9] [INFO] Results:
[windows-jdk9] [INFO]
[windows-jdk9] [INFO] Tests run: 145, Failures: 0, Errors: 0, Skipped: 0
[windows-jdk9] [INFO]
[windows-jdk9] [INFO]
[windows-jdk9] [INFO] --- maven-jar-plugin:3.0.2:jar (default-jar) @ wagon-webdav-jackrabbit ---
[windows-jdk9] [INFO] Building jar: F:\jenkins\jenkins-slave\workspace\n-box_maven-wagon_WAGON-527-KWYDRBGRPK7Q2YVCYHYJDNDOSEOHGQPJHV5AHJB4GNG66RKBHCBA\m\wagon-providers\wagon-webdav-jackrabbit\target\wagon-webdav-jackrabbit-3.1.1-SNAPSHOT.jar
[windows-jdk9] [INFO]
[windows-jdk9] [INFO] --- maven-site-plugin:3.7:attach-descriptor (attach-descriptor) @ wagon-webdav-jackrabbit ---
[windows-jdk9] [INFO] Skipping because packaging 'jar' is not pom.
[windows-jdk9] [INFO]
[windows-jdk9] [INFO] --- maven-checkstyle-plugin:3.0.0:check (checkstyle-check) @ wagon-webdav-jackrabbit ---
[windows-jdk9] [INFO] ------------------------------------------------------------------------
[windows-jdk9] [INFO] Reactor Summary:
[windows-jdk9] [INFO]
[windows-jdk9] [INFO] Apache Maven Wagon ................................. SUCCESS [ 18.173 s]
[windows-jdk9] [INFO] Apache Maven Wagon :: API .......................... SUCCESS [ 11.190 s]
[windows-jdk9] [INFO] Apache Maven Wagon :: Provider Test ................ SUCCESS [  3.442 s]
[windows-jdk9] [INFO] Apache Maven Wagon :: Providers .................... SUCCESS [  1.540 s]
[windows-jdk9] [INFO] Apache Maven Wagon :: Providers :: File Provider ... SUCCESS [  4.905 s]
[windows-jdk9] [INFO] Apache Maven Wagon :: Providers :: FTP Provider .... SUCCESS [  9.560 s]
[windows-jdk9] [INFO] Apache Maven Wagon :: Providers :: HTTP Shared Library SUCCESS [  4.759 s]
[windows-jdk9] [INFO] Apache Maven Wagon :: Test Compatibility Kits ...... SUCCESS [  1.318 s]
[windows-jdk9] [INFO] Apache Maven Wagon :: HTTP Test Compatibility Kit .. SUCCESS [  2.585 s]
[windows-jdk9] [INFO] Apache Maven Wagon :: Providers :: HTTP Provider ... SUCCESS [04:49 min]
[windows-jdk9] [INFO] Apache Maven Wagon :: Providers :: Lightweight HTTP Provider SUCCESS [02:12 min]
[windows-jdk9] [INFO] Apache Maven Wagon :: Providers :: SCM Provider .... SUCCESS [ 13.819 s]
[windows-jdk9] [INFO] Apache Maven Wagon :: Providers :: SSH Common Library SUCCESS [  2.587 s]
[windows-jdk9] [INFO] Apache Maven Wagon :: Providers :: SSH Common Tests  SUCCESS [  2.180 s]
[windows-jdk9] [INFO] Apache Maven Wagon :: Providers :: SSH External Provider SUCCESS [  1.438 s]
[windows-jdk9] [INFO] Apache Maven Wagon :: Providers :: SSH Provider .... SUCCESS [  2.268 s]
[windows-jdk9] [INFO] Apache Maven Wagon :: Providers :: WebDAV Provider . SUCCESS [01:03 min]
[windows-jdk9] [INFO] ------------------------------------------------------------------------
[windows-jdk9] [INFO] BUILD SUCCESS
[windows-jdk9] [INFO] ------------------------------------------------------------------------
[windows-jdk9] [INFO] Total time: 09:28 min
[windows-jdk9] [INFO] Finished at: 2018-09-13T17:53:39Z
[windows-jdk9] [INFO] Final Memory: 47M/156M
[windows-jdk9] [INFO] ------------------------------------------------------------------------
[windows-jdk9] [WARNING] The requested profile "run-its" could not be activated because it does not exist.
[windows-jdk9] [INFO] [jenkins-event-spy] Generated F:\jenkins\jenkins-slave\workspace\n-box_maven-wagon_WAGON-527-KWYDRBGRPK7Q2YVCYHYJDNDOSEOHGQPJHV5AHJB4GNG66RKBHCBA@tmp\withMaven9e3f01de\maven-spy-20180913-174410-69213356335771113901070.log
[Pipeline] [windows-jdk9] }
[Pipeline] [windows-jdk9] // dir
[Pipeline] [windows-jdk9] }
[windows-jdk9] [withMaven] junitPublisher - Archive test results for Maven artifact org.apache.maven.wagon:wagon-provider-api:3.1.1-SNAPSHOT generated by maven-surefire-plugin:test (default-test): m\wagon-provider-api\target\surefire-reports\*.xml
[windows-jdk9] Recording test results
[windows-jdk9] [withMaven] junitPublisher - Archive test results for Maven artifact org.apache.maven.wagon:wagon-provider-test:3.1.1-SNAPSHOT generated by maven-surefire-plugin:test (default-test): m\wagon-provider-test\target\surefire-reports\*.xml
[windows-jdk9] Recording test results
[windows-jdk9] None of the test reports contained any result
[windows-jdk9] [withMaven] junitPublisher - Archive test results for Maven artifact org.apache.maven.wagon:wagon-file:3.1.1-SNAPSHOT generated by maven-surefire-plugin:test (default-test): m\wagon-providers\wagon-file\target\surefire-reports\*.xml
[windows-jdk9] Recording test results
[windows-jdk9] [withMaven] junitPublisher - Archive test results for Maven artifact org.apache.maven.wagon:wagon-ftp:3.1.1-SNAPSHOT generated by maven-surefire-plugin:test (default-test): m\wagon-providers\wagon-ftp\target\surefire-reports\*.xml
[windows-jdk9] Recording test results
[windows-jdk9] [withMaven] junitPublisher - Archive test results for Maven artifact org.apache.maven.wagon:wagon-http-shared:3.1.1-SNAPSHOT generated by maven-surefire-plugin:test (default-test): m\wagon-providers\wagon-http-shared\target\surefire-reports\*.xml
[windows-jdk9] Recording test results
[windows-jdk9] [withMaven] junitPublisher - Archive test results for Maven artifact org.apache.maven.wagon:wagon-tck-http:3.1.1-SNAPSHOT generated by maven-surefire-plugin:test (default-test): m\wagon-tcks\wagon-tck-http\target\surefire-reports\*.xml
[windows-jdk9] Recording test results
[windows-jdk9] None of the test reports contained any result
[windows-jdk9] [withMaven] junitPublisher - Archive test results for Maven artifact org.apache.maven.wagon:wagon-http:3.1.1-SNAPSHOT generated by maven-surefire-plugin:test (default-test): m\wagon-providers\wagon-http\target\surefire-reports\*.xml
[windows-jdk9] Recording test results
[windows-jdk9] [withMaven] junitPublisher - Archive test results for Maven artifact org.apache.maven.wagon:wagon-http-lightweight:3.1.1-SNAPSHOT generated by maven-surefire-plugin:test (default-test): m\wagon-providers\wagon-http-lightweight\target\surefire-reports\*.xml
[windows-jdk9] Recording test results
[windows-jdk9] [withMaven] junitPublisher - Archive test results for Maven artifact org.apache.maven.wagon:wagon-scm:3.1.1-SNAPSHOT generated by maven-surefire-plugin:test (default-test): m\wagon-providers\wagon-scm\target\surefire-reports\*.xml
[windows-jdk9] Recording test results
[windows-jdk9] [withMaven] junitPublisher - Archive test results for Maven artifact org.apache.maven.wagon:wagon-ssh-common:3.1.1-SNAPSHOT generated by maven-surefire-plugin:test (default-test): m\wagon-providers\wagon-ssh-common\target\surefire-reports\*.xml
[windows-jdk9] Recording test results
[windows-jdk9] [withMaven] junitPublisher - Archive test results for Maven artifact org.apache.maven.wagon:wagon-ssh-common-test:3.1.1-SNAPSHOT generated by maven-surefire-plugin:test (default-test): m\wagon-providers\wagon-ssh-common-test\target\surefire-reports\*.xml
[windows-jdk9] Recording test results
[windows-jdk9] None of the test reports contained any result
[windows-jdk9] [withMaven] junitPublisher - Archive test results for Maven artifact org.apache.maven.wagon:wagon-ssh-external:3.1.1-SNAPSHOT generated by maven-surefire-plugin:test (default-test): m\wagon-providers\wagon-ssh-external\target\surefire-reports\*.xml
[windows-jdk9] Recording test results
[windows-jdk9] None of the test reports contained any result
[windows-jdk9] [withMaven] junitPublisher - Archive test results for Maven artifact org.apache.maven.wagon:wagon-ssh:3.1.1-SNAPSHOT generated by maven-surefire-plugin:test (default-test): m\wagon-providers\wagon-ssh\target\surefire-reports\*.xml
[windows-jdk9] Recording test results
[windows-jdk9] None of the test reports contained any result
[windows-jdk9] [withMaven] junitPublisher - Archive test results for Maven artifact org.apache.maven.wagon:wagon-webdav-jackrabbit:3.1.1-SNAPSHOT generated by maven-surefire-plugin:test (default-test): m\wagon-providers\wagon-webdav-jackrabbit\target\surefire-reports\*.xml
[windows-jdk9] Recording test results
[Pipeline] [windows-jdk9] // withMaven
[Pipeline] [windows-jdk9] cleanWs
[windows-jdk9] [WS-CLEANUP] Deleting project workspace...[WS-CLEANUP] done
[Pipeline] [windows-jdk9] }
[Pipeline] [windows-jdk9] // stage
[Pipeline] [windows-jdk9] }
[Pipeline] [windows-jdk9] // node
[Pipeline] [windows-jdk9] }
[Pipeline] // parallel
[Pipeline] stage
[Pipeline] { (Notifications)
[Pipeline] echo
Build result: FAILURE
[Pipeline] jiraIssueSelector
[Pipeline] emailext
Reply | Threaded
Open this post in threaded view
|

Build failed in Jenkins: Maven TLP » maven-wagon » WAGON-527 #5

Apache Jenkins Server-2
See https://builds.apache.org/job/maven-box/job/maven-wagon/job/WAGON-527/5/

Changes:

* Exclude H25
* Exclude H31 cause master is failing constantly.
* no need to test anymore with '3.0.x'
* Add Java 11 to defaults
* Try to shorten path for Windows by using tempDir
* Fix arguments
* Add option for temp workspace
* disable tmpWs
* enable tmpWs
* Use def
* Try to shorten wsDir

33 tests failed.
FAILED:  org.apache.maven.wagon.providers.scm.ScmGitExeWagonTest.testWagonPutDirectory

Error Message:
Error interacting with SCM: Unable to commit file. The git-commit command failed.
*** Please tell me who you are.

Run

  git config --global user.email "[hidden email]"
  git config --global user.name "Your Name"

to set your account's default identity.
Omit --global to set the identity only in this repository.

fatal:********@asf925.gq1.ygridcore.net>) not allowed


Stack Trace:
org.apache.maven.wagon.TransferFailedException:
Error interacting with SCM: Unable to commit file. The git-commit command failed.
*** Please tell me who you are.

Run

  git config --global user.email "[hidden email]"
  git config --global user.name "Your Name"

to set your account's default identity.
Omit --global to set the identity only in this repository.

fatal:********@asf925.gq1.ygridcore.net>) not allowed

Caused by: org.apache.maven.scm.ScmException:
Unable to commit file. The git-commit command failed.
*** Please tell me who you are.

Run

  git config --global user.email "[hidden email]"
  git config --global user.name "Your Name"

to set your account's default identity.
Omit --global to set the identity only in this repository.

fatal:********@asf925.gq1.ygridcore.net>) not allowed



FAILED:  org.apache.maven.wagon.providers.scm.ScmGitExeWagonTest.testWagonPutDirectoryDeepDestination

Error Message:
Error interacting with SCM: Unable to commit file. The git-commit command failed.
*** Please tell me who you are.

Run

  git config --global user.email "[hidden email]"
  git config --global user.name "Your Name"

to set your account's default identity.
Omit --global to set the identity only in this repository.

fatal:********@asf925.gq1.ygridcore.net>) not allowed


Stack Trace:
org.apache.maven.wagon.TransferFailedException:
Error interacting with SCM: Unable to commit file. The git-commit command failed.
*** Please tell me who you are.

Run

  git config --global user.email "[hidden email]"
  git config --global user.name "Your Name"

to set your account's default identity.
Omit --global to set the identity only in this repository.

fatal:********@asf925.gq1.ygridcore.net>) not allowed

Caused by: org.apache.maven.scm.ScmException:
Unable to commit file. The git-commit command failed.
*** Please tell me who you are.

Run

  git config --global user.email "[hidden email]"
  git config --global user.name "Your Name"

to set your account's default identity.
Omit --global to set the identity only in this repository.

fatal:********@asf925.gq1.ygridcore.net>) not allowed



FAILED:  org.apache.maven.wagon.providers.scm.ScmGitExeWagonTest.testWagon

Error Message:

  Unexpected method call TransferListener.transferError(TransferEvent[PUT|ERROR|Repository[scm:git:file:///home/jenkins/jenkins-slave/workspace/n-box_maven-wagon_WAGON-527-KWYDRBGRPK7Q2YVCYHYJDNDOSEOHGQPJHV5AHJB4GNG66RKBHCBA/m/wagon-providers/wagon-scm/target/test-classes/test-repo-git-test/]|null|test-resource[len = 18; mod = 1539193348000]]):
    TransferListener.transferCompleted(TransferEvent[PUT|COMPLETED|Repository[scm:git:file:///home/jenkins/jenkins-slave/workspace/n-box_maven-wagon_WAGON-527-KWYDRBGRPK7Q2YVCYHYJDNDOSEOHGQPJHV5AHJB4GNG66RKBHCBA/m/wagon-providers/wagon-scm/target/test-classes/test-repo-git-test/]|/home/jenkins/jenkins-slave/workspace/n-box_maven-wagon_WAGON-527-KWYDRBGRPK7Q2YVCYHYJDNDOSEOHGQPJHV5AHJB4GNG66RKBHCBA/m/wagon-providers/wagon-scm/target/test-output/test-resource|test-resource[len = 18; mod = 1539193348000]]): expected: 1, actual: 0

Stack Trace:
java.lang.AssertionError:

  Unexpected method call TransferListener.transferError(TransferEvent[PUT|ERROR|Repository[scm:git:file:///home/jenkins/jenkins-slave/workspace/n-box_maven-wagon_WAGON-527-KWYDRBGRPK7Q2YVCYHYJDNDOSEOHGQPJHV5AHJB4GNG66RKBHCBA/m/wagon-providers/wagon-scm/target/test-classes/test-repo-git-test/]|null|test-resource[len = 18; mod = 1539193348000]]):
    TransferListener.transferCompleted(TransferEvent[PUT|COMPLETED|Repository[scm:git:file:///home/jenkins/jenkins-slave/workspace/n-box_maven-wagon_WAGON-527-KWYDRBGRPK7Q2YVCYHYJDNDOSEOHGQPJHV5AHJB4GNG66RKBHCBA/m/wagon-providers/wagon-scm/target/test-classes/test-repo-git-test/]|/home/jenkins/jenkins-slave/workspace/n-box_maven-wagon_WAGON-527-KWYDRBGRPK7Q2YVCYHYJDNDOSEOHGQPJHV5AHJB4GNG66RKBHCBA/m/wagon-providers/wagon-scm/target/test-output/test-resource|test-resource[len = 18; mod = 1539193348000]]): expected: 1, actual: 0


FAILED:  org.apache.maven.wagon.providers.scm.ScmGitExeWagonTest.testWagonPutDirectoryForDot

Error Message:
Error interacting with SCM: Unable to commit file. The git-commit command failed.
*** Please tell me who you are.

Run

  git config --global user.email "[hidden email]"
  git config --global user.name "Your Name"

to set your account's default identity.
Omit --global to set the identity only in this repository.

fatal:********@asf925.gq1.ygridcore.net>) not allowed


Stack Trace:
org.apache.maven.wagon.TransferFailedException:
Error interacting with SCM: Unable to commit file. The git-commit command failed.
*** Please tell me who you are.

Run

  git config --global user.email "[hidden email]"
  git config --global user.name "Your Name"

to set your account's default identity.
Omit --global to set the identity only in this repository.

fatal:********@asf925.gq1.ygridcore.net>) not allowed

Caused by: org.apache.maven.scm.ScmException:
Unable to commit file. The git-commit command failed.
*** Please tell me who you are.

Run

  git config --global user.email "[hidden email]"
  git config --global user.name "Your Name"

to set your account's default identity.
Omit --global to set the identity only in this repository.

fatal:********@asf925.gq1.ygridcore.net>) not allowed



FAILED:  org.apache.maven.wagon.providers.scm.ScmGitExeWagonTest.testWagonPutDirectoryWhenDirectoryAlreadyExists

Error Message:
Error interacting with SCM: Unable to commit file. The git-commit command failed.
*** Please tell me who you are.

Run

  git config --global user.email "[hidden email]"
  git config --global user.name "Your Name"

to set your account's default identity.
Omit --global to set the identity only in this repository.

fatal:********@asf925.gq1.ygridcore.net>) not allowed


Stack Trace:
org.apache.maven.wagon.TransferFailedException:
Error interacting with SCM: Unable to commit file. The git-commit command failed.
*** Please tell me who you are.

Run

  git config --global user.email "[hidden email]"
  git config --global user.name "Your Name"

to set your account's default identity.
Omit --global to set the identity only in this repository.

fatal:********@asf925.gq1.ygridcore.net>) not allowed

Caused by: org.apache.maven.scm.ScmException:
Unable to commit file. The git-commit command failed.
*** Please tell me who you are.

Run

  git config --global user.email "[hidden email]"
  git config --global user.name "Your Name"

to set your account's default identity.
Omit --global to set the identity only in this repository.

fatal:********@asf925.gq1.ygridcore.net>) not allowed



FAILED:  org.apache.maven.wagon.providers.scm.ScmGitExeWagonTest.testWagonPutDirectory

Error Message:
Error interacting with SCM: Unable to commit file. The git-commit command failed.
*** Please tell me who you are.

Run

  git config --global user.email "[hidden email]"
  git config --global user.name "Your Name"

to set your account's default identity.
Omit --global to set the identity only in this repository.

fatal:********@asf924.gq1.ygridcore.net>) not allowed


Stack Trace:
org.apache.maven.wagon.TransferFailedException:
Error interacting with SCM: Unable to commit file. The git-commit command failed.
*** Please tell me who you are.

Run

  git config --global user.email "[hidden email]"
  git config --global user.name "Your Name"

to set your account's default identity.
Omit --global to set the identity only in this repository.

fatal:********@asf924.gq1.ygridcore.net>) not allowed

Caused by: org.apache.maven.scm.ScmException:
Unable to commit file. The git-commit command failed.
*** Please tell me who you are.

Run

  git config --global user.email "[hidden email]"
  git config --global user.name "Your Name"

to set your account's default identity.
Omit --global to set the identity only in this repository.

fatal:********@asf924.gq1.ygridcore.net>) not allowed



FAILED:  org.apache.maven.wagon.providers.scm.ScmGitExeWagonTest.testWagonPutDirectoryDeepDestination

Error Message:
Error interacting with SCM: Unable to commit file. The git-commit command failed.
*** Please tell me who you are.

Run

  git config --global user.email "[hidden email]"
  git config --global user.name "Your Name"

to set your account's default identity.
Omit --global to set the identity only in this repository.

fatal:********@asf924.gq1.ygridcore.net>) not allowed


Stack Trace:
org.apache.maven.wagon.TransferFailedException:
Error interacting with SCM: Unable to commit file. The git-commit command failed.
*** Please tell me who you are.

Run

  git config --global user.email "[hidden email]"
  git config --global user.name "Your Name"

to set your account's default identity.
Omit --global to set the identity only in this repository.

fatal:********@asf924.gq1.ygridcore.net>) not allowed

Caused by: org.apache.maven.scm.ScmException:
Unable to commit file. The git-commit command failed.
*** Please tell me who you are.

Run

  git config --global user.email "[hidden email]"
  git config --global user.name "Your Name"

to set your account's default identity.
Omit --global to set the identity only in this repository.

fatal:********@asf924.gq1.ygridcore.net>) not allowed



FAILED:  org.apache.maven.wagon.providers.scm.ScmGitExeWagonTest.testWagon

Error Message:

  Unexpected method call TransferListener.transferError(TransferEvent[PUT|ERROR|Repository[scm:git:file:///home/jenkins/jenkins-slave/workspace/n-box_maven-wagon_WAGON-527-KWYDRBGRPK7Q2YVCYHYJDNDOSEOHGQPJHV5AHJB4GNG66RKBHCBA/m/wagon-providers/wagon-scm/target/test-classes/test-repo-git-test/]|null|test-resource[len = 18; mod = 1539193369000]]):
    TransferListener.transferCompleted(TransferEvent[PUT|COMPLETED|Repository[scm:git:file:///home/jenkins/jenkins-slave/workspace/n-box_maven-wagon_WAGON-527-KWYDRBGRPK7Q2YVCYHYJDNDOSEOHGQPJHV5AHJB4GNG66RKBHCBA/m/wagon-providers/wagon-scm/target/test-classes/test-repo-git-test/]|/home/jenkins/jenkins-slave/workspace/n-box_maven-wagon_WAGON-527-KWYDRBGRPK7Q2YVCYHYJDNDOSEOHGQPJHV5AHJB4GNG66RKBHCBA/m/wagon-providers/wagon-scm/target/test-output/test-resource|test-resource[len = 18; mod = 1539193369000]]): expected: 1, actual: 0

Stack Trace:
java.lang.AssertionError:

  Unexpected method call TransferListener.transferError(TransferEvent[PUT|ERROR|Repository[scm:git:file:///home/jenkins/jenkins-slave/workspace/n-box_maven-wagon_WAGON-527-KWYDRBGRPK7Q2YVCYHYJDNDOSEOHGQPJHV5AHJB4GNG66RKBHCBA/m/wagon-providers/wagon-scm/target/test-classes/test-repo-git-test/]|null|test-resource[len = 18; mod = 1539193369000]]):
    TransferListener.transferCompleted(TransferEvent[PUT|COMPLETED|Repository[scm:git:file:///home/jenkins/jenkins-slave/workspace/n-box_maven-wagon_WAGON-527-KWYDRBGRPK7Q2YVCYHYJDNDOSEOHGQPJHV5AHJB4GNG66RKBHCBA/m/wagon-providers/wagon-scm/target/test-classes/test-repo-git-test/]|/home/jenkins/jenkins-slave/workspace/n-box_maven-wagon_WAGON-527-KWYDRBGRPK7Q2YVCYHYJDNDOSEOHGQPJHV5AHJB4GNG66RKBHCBA/m/wagon-providers/wagon-scm/target/test-output/test-resource|test-resource[len = 18; mod = 1539193369000]]): expected: 1, actual: 0


FAILED:  org.apache.maven.wagon.providers.scm.ScmGitExeWagonTest.testWagonPutDirectoryForDot

Error Message:
Error interacting with SCM: Unable to commit file. The git-commit command failed.
*** Please tell me who you are.

Run

  git config --global user.email "[hidden email]"
  git config --global user.name "Your Name"

to set your account's default identity.
Omit --global to set the identity only in this repository.

fatal:********@asf924.gq1.ygridcore.net>) not allowed


Stack Trace:
org.apache.maven.wagon.TransferFailedException:
Error interacting with SCM: Unable to commit file. The git-commit command failed.
*** Please tell me who you are.

Run

  git config --global user.email "[hidden email]"
  git config --global user.name "Your Name"

to set your account's default identity.
Omit --global to set the identity only in this repository.

fatal:********@asf924.gq1.ygridcore.net>) not allowed

Caused by: org.apache.maven.scm.ScmException:
Unable to commit file. The git-commit command failed.
*** Please tell me who you are.

Run

  git config --global user.email "[hidden email]"
  git config --global user.name "Your Name"

to set your account's default identity.
Omit --global to set the identity only in this repository.

fatal:********@asf924.gq1.ygridcore.net>) not allowed



FAILED:  org.apache.maven.wagon.providers.scm.ScmGitExeWagonTest.testWagonPutDirectoryWhenDirectoryAlreadyExists

Error Message:
Error interacting with SCM: Unable to commit file. The git-commit command failed.
*** Please tell me who you are.

Run

  git config --global user.email "[hidden email]"
  git config --global user.name "Your Name"

to set your account's default identity.
Omit --global to set the identity only in this repository.

fatal:********@asf924.gq1.ygridcore.net>) not allowed


Stack Trace:
org.apache.maven.wagon.TransferFailedException:
Error interacting with SCM: Unable to commit file. The git-commit command failed.
*** Please tell me who you are.

Run

  git config --global user.email "[hidden email]"
  git config --global user.name "Your Name"

to set your account's default identity.
Omit --global to set the identity only in this repository.

fatal:********@asf924.gq1.ygridcore.net>) not allowed

Caused by: org.apache.maven.scm.ScmException:
Unable to commit file. The git-commit command failed.
*** Please tell me who you are.

Run

  git config --global user.email "[hidden email]"
  git config --global user.name "Your Name"

to set your account's default identity.
Omit --global to set the identity only in this repository.

fatal:********@asf924.gq1.ygridcore.net>) not allowed



FAILED:  org.apache.maven.wagon.providers.scm.ScmGitExeWagonTest.testWagonPutDirectory

Error Message:
Error interacting with SCM: Unable to commit file. The git-commit command failed.
*** Please tell me who you are.

Run

  git config --global user.email "[hidden email]"
  git config --global user.name "Your Name"

to set your account's default identity.
Omit --global to set the identity only in this repository.

fatal:********@asf933.gq1.ygridcore.net>) not allowed


Stack Trace:
org.apache.maven.wagon.TransferFailedException:
Error interacting with SCM: Unable to commit file. The git-commit command failed.
*** Please tell me who you are.

Run

  git config --global user.email "[hidden email]"
  git config --global user.name "Your Name"

to set your account's default identity.
Omit --global to set the identity only in this repository.

fatal:********@asf933.gq1.ygridcore.net>) not allowed

Caused by: org.apache.maven.scm.ScmException:
Unable to commit file. The git-commit command failed.
*** Please tell me who you are.

Run

  git config --global user.email "[hidden email]"
  git config --global user.name "Your Name"

to set your account's default identity.
Omit --global to set the identity only in this repository.

fatal:********@asf933.gq1.ygridcore.net>) not allowed



FAILED:  org.apache.maven.wagon.providers.scm.ScmGitExeWagonTest.testWagonPutDirectoryDeepDestination

Error Message:
Error interacting with SCM: Unable to commit file. The git-commit command failed.
*** Please tell me who you are.

Run

  git config --global user.email "[hidden email]"
  git config --global user.name "Your Name"

to set your account's default identity.
Omit --global to set the identity only in this repository.

fatal:********@asf933.gq1.ygridcore.net>) not allowed


Stack Trace:
org.apache.maven.wagon.TransferFailedException:
Error interacting with SCM: Unable to commit file. The git-commit command failed.
*** Please tell me who you are.

Run

  git config --global user.email "[hidden email]"
  git config --global user.name "Your Name"

to set your account's default identity.
Omit --global to set the identity only in this repository.

fatal:********@asf933.gq1.ygridcore.net>) not allowed

Caused by: org.apache.maven.scm.ScmException:
Unable to commit file. The git-commit command failed.
*** Please tell me who you are.

Run

  git config --global user.email "[hidden email]"
  git config --global user.name "Your Name"

to set your account's default identity.
Omit --global to set the identity only in this repository.

fatal:********@asf933.gq1.ygridcore.net>) not allowed



FAILED:  org.apache.maven.wagon.providers.scm.ScmGitExeWagonTest.testWagon

Error Message:

  Unexpected method call TransferListener.transferError(TransferEvent[PUT|ERROR|Repository[scm:git:file:///home/jenkins/jenkins-slave/workspace/n-box_maven-wagon_WAGON-527-KWYDRBGRPK7Q2YVCYHYJDNDOSEOHGQPJHV5AHJB4GNG66RKBHCBA/m/wagon-providers/wagon-scm/target/test-classes/test-repo-git-test/]|null|test-resource[len = 18; mod = 1539193353000]]):
    TransferListener.transferCompleted(TransferEvent[PUT|COMPLETED|Repository[scm:git:file:///home/jenkins/jenkins-slave/workspace/n-box_maven-wagon_WAGON-527-KWYDRBGRPK7Q2YVCYHYJDNDOSEOHGQPJHV5AHJB4GNG66RKBHCBA/m/wagon-providers/wagon-scm/target/test-classes/test-repo-git-test/]|/home/jenkins/jenkins-slave/workspace/n-box_maven-wagon_WAGON-527-KWYDRBGRPK7Q2YVCYHYJDNDOSEOHGQPJHV5AHJB4GNG66RKBHCBA/m/wagon-providers/wagon-scm/target/test-output/test-resource|test-resource[len = 18; mod = 1539193353000]]): expected: 1, actual: 0

Stack Trace:
java.lang.AssertionError:

  Unexpected method call TransferListener.transferError(TransferEvent[PUT|ERROR|Repository[scm:git:file:///home/jenkins/jenkins-slave/workspace/n-box_maven-wagon_WAGON-527-KWYDRBGRPK7Q2YVCYHYJDNDOSEOHGQPJHV5AHJB4GNG66RKBHCBA/m/wagon-providers/wagon-scm/target/test-classes/test-repo-git-test/]|null|test-resource[len = 18; mod = 1539193353000]]):
    TransferListener.transferCompleted(TransferEvent[PUT|COMPLETED|Repository[scm:git:file:///home/jenkins/jenkins-slave/workspace/n-box_maven-wagon_WAGON-527-KWYDRBGRPK7Q2YVCYHYJDNDOSEOHGQPJHV5AHJB4GNG66RKBHCBA/m/wagon-providers/wagon-scm/target/test-classes/test-repo-git-test/]|/home/jenkins/jenkins-slave/workspace/n-box_maven-wagon_WAGON-527-KWYDRBGRPK7Q2YVCYHYJDNDOSEOHGQPJHV5AHJB4GNG66RKBHCBA/m/wagon-providers/wagon-scm/target/test-output/test-resource|test-resource[len = 18; mod = 1539193353000]]): expected: 1, actual: 0


FAILED:  org.apache.maven.wagon.providers.scm.ScmGitExeWagonTest.testWagonPutDirectoryForDot

Error Message:
Error interacting with SCM: Unable to commit file. The git-commit command failed.
*** Please tell me who you are.

Run

  git config --global user.email "[hidden email]"
  git config --global user.name "Your Name"

to set your account's default identity.
Omit --global to set the identity only in this repository.

fatal:********@asf933.gq1.ygridcore.net>) not allowed


Stack Trace:
org.apache.maven.wagon.TransferFailedException:
Error interacting with SCM: Unable to commit file. The git-commit command failed.
*** Please tell me who you are.

Run

  git config --global user.email "[hidden email]"
  git config --global user.name "Your Name"

to set your account's default identity.
Omit --global to set the identity only in this repository.

fatal:********@asf933.gq1.ygridcore.net>) not allowed

Caused by: org.apache.maven.scm.ScmException:
Unable to commit file. The git-commit command failed.
*** Please tell me who you are.

Run

  git config --global user.email "[hidden email]"
  git config --global user.name "Your Name"

to set your account's default identity.
Omit --global to set the identity only in this repository.

fatal:********@asf933.gq1.ygridcore.net>) not allowed



FAILED:  org.apache.maven.wagon.providers.scm.ScmGitExeWagonTest.testWagonPutDirectoryWhenDirectoryAlreadyExists

Error Message:
Error interacting with SCM: Unable to commit file. The git-commit command failed.
*** Please tell me who you are.

Run

  git config --global user.email "[hidden email]"
  git config --global user.name "Your Name"

to set your account's default identity.
Omit --global to set the identity only in this repository.

fatal:********@asf933.gq1.ygridcore.net>) not allowed


Stack Trace:
org.apache.maven.wagon.TransferFailedException:
Error interacting with SCM: Unable to commit file. The git-commit command failed.
*** Please tell me who you are.

Run

  git config --global user.email "[hidden email]"
  git config --global user.name "Your Name"

to set your account's default identity.
Omit --global to set the identity only in this repository.

fatal:********@asf933.gq1.ygridcore.net>) not allowed

Caused by: org.apache.maven.scm.ScmException:
Unable to commit file. The git-commit command failed.
*** Please tell me who you are.

Run

  git config --global user.email "[hidden email]"
  git config --global user.name "Your Name"

to set your account's default identity.
Omit --global to set the identity only in this repository.

fatal:********@asf933.gq1.ygridcore.net>) not allowed



FAILED:  org.apache.maven.wagon.providers.scm.ScmGitExeWagonTest.testWagonPutDirectory

Error Message:
Error checking out: command failed: Cloning into 'F:\jenkins\jenkins-slave\workspace\n-box_maven-wagon_WAGON-527-KWYDRBGRPK7Q2YVCYHYJDNDOSEOHGQPJHV5AHJB4GNG66RKBHCBA\m\wagon-providers\wagon-scm\target\test-output\checkout-org.apache.maven.scm.provider.git.gitexe.GitExeScmProvider'...
fatal: '$GIT_DIR' too big
fatal: index-pack failed

Stack Trace:
org.apache.maven.wagon.TransferFailedException:
Error checking out: command failed: Cloning into 'F:\jenkins\jenkins-slave\workspace\n-box_maven-wagon_WAGON-527-KWYDRBGRPK7Q2YVCYHYJDNDOSEOHGQPJHV5AHJB4GNG66RKBHCBA\m\wagon-providers\wagon-scm\target\test-output\checkout-org.apache.maven.scm.provider.git.gitexe.GitExeScmProvider'...
fatal: '$GIT_DIR' too big
fatal: index-pack failed
Caused by: org.apache.maven.scm.ScmException:
command failed: Cloning into 'F:\jenkins\jenkins-slave\workspace\n-box_maven-wagon_WAGON-527-KWYDRBGRPK7Q2YVCYHYJDNDOSEOHGQPJHV5AHJB4GNG66RKBHCBA\m\wagon-providers\wagon-scm\target\test-output\checkout-org.apache.maven.scm.provider.git.gitexe.GitExeScmProvider'...
fatal: '$GIT_DIR' too big
fatal: index-pack failed


FAILED:  org.apache.maven.wagon.providers.scm.ScmGitExeWagonTest.testWagonPutDirectoryDeepDestination

Error Message:
Error checking out: command failed: Cloning into 'F:\jenkins\jenkins-slave\workspace\n-box_maven-wagon_WAGON-527-KWYDRBGRPK7Q2YVCYHYJDNDOSEOHGQPJHV5AHJB4GNG66RKBHCBA\m\wagon-providers\wagon-scm\target\test-output\checkout-org.apache.maven.scm.provider.git.gitexe.GitExeScmProvider'...
fatal: '$GIT_DIR' too big
fatal: index-pack failed

Stack Trace:
org.apache.maven.wagon.TransferFailedException:
Error checking out: command failed: Cloning into 'F:\jenkins\jenkins-slave\workspace\n-box_maven-wagon_WAGON-527-KWYDRBGRPK7Q2YVCYHYJDNDOSEOHGQPJHV5AHJB4GNG66RKBHCBA\m\wagon-providers\wagon-scm\target\test-output\checkout-org.apache.maven.scm.provider.git.gitexe.GitExeScmProvider'...
fatal: '$GIT_DIR' too big
fatal: index-pack failed
Caused by: org.apache.maven.scm.ScmException:
command failed: Cloning into 'F:\jenkins\jenkins-slave\workspace\n-box_maven-wagon_WAGON-527-KWYDRBGRPK7Q2YVCYHYJDNDOSEOHGQPJHV5AHJB4GNG66RKBHCBA\m\wagon-providers\wagon-scm\target\test-output\checkout-org.apache.maven.scm.provider.git.gitexe.GitExeScmProvider'...
fatal: '$GIT_DIR' too big
fatal: index-pack failed


FAILED:  org.apache.maven.wagon.providers.scm.ScmGitExeWagonTest.testWagon

Error Message:

  Unexpected method call TransferListener.transferError(TransferEvent[GET|ERROR|Repository[scm:git:file:///F:/jenkins/jenkins-slave/workspace/n-box_maven-wagon_WAGON-527-KWYDRBGRPK7Q2YVCYHYJDNDOSEOHGQPJHV5AHJB4GNG66RKBHCBA/m/wagon-providers/wagon-scm/target/test-classes/test-repo-git-test/]|null|test-resource[len = 18; mod = 1539194025121]]):
    TransferListener.transferCompleted(TransferEvent[PUT|COMPLETED|Repository[scm:git:file:///F:/jenkins/jenkins-slave/workspace/n-box_maven-wagon_WAGON-527-KWYDRBGRPK7Q2YVCYHYJDNDOSEOHGQPJHV5AHJB4GNG66RKBHCBA/m/wagon-providers/wagon-scm/target/test-classes/test-repo-git-test/]|F:\jenkins\jenkins-slave\workspace\n-box_maven-wagon_WAGON-527-KWYDRBGRPK7Q2YVCYHYJDNDOSEOHGQPJHV5AHJB4GNG66RKBHCBA\m\wagon-providers\wagon-scm\target\test-output\test-resource|test-resource[len = 18; mod = 1539194025121]]): expected: 1, actual: 0

Stack Trace:
java.lang.AssertionError:

  Unexpected method call TransferListener.transferError(TransferEvent[GET|ERROR|Repository[scm:git:file:///F:/jenkins/jenkins-slave/workspace/n-box_maven-wagon_WAGON-527-KWYDRBGRPK7Q2YVCYHYJDNDOSEOHGQPJHV5AHJB4GNG66RKBHCBA/m/wagon-providers/wagon-scm/target/test-classes/test-repo-git-test/]|null|test-resource[len = 18; mod = 1539194025121]]):
    TransferListener.transferCompleted(TransferEvent[PUT|COMPLETED|Repository[scm:git:file:///F:/jenkins/jenkins-slave/workspace/n-box_maven-wagon_WAGON-527-KWYDRBGRPK7Q2YVCYHYJDNDOSEOHGQPJHV5AHJB4GNG66RKBHCBA/m/wagon-providers/wagon-scm/target/test-classes/test-repo-git-test/]|F:\jenkins\jenkins-slave\workspace\n-box_maven-wagon_WAGON-527-KWYDRBGRPK7Q2YVCYHYJDNDOSEOHGQPJHV5AHJB4GNG66RKBHCBA\m\wagon-providers\wagon-scm\target\test-output\test-resource|test-resource[len = 18; mod = 1539194025121]]): expected: 1, actual: 0


FAILED:  org.apache.maven.wagon.providers.scm.ScmGitExeWagonTest.testWagonPutDirectoryForDot

Error Message:
Error checking out: command failed: Cloning into 'F:\jenkins\jenkins-slave\workspace\n-box_maven-wagon_WAGON-527-KWYDRBGRPK7Q2YVCYHYJDNDOSEOHGQPJHV5AHJB4GNG66RKBHCBA\m\wagon-providers\wagon-scm\target\test-output\checkout-org.apache.maven.scm.provider.git.gitexe.GitExeScmProvider'...
fatal: '$GIT_DIR' too big
fatal: index-pack failed

Stack Trace:
org.apache.maven.wagon.TransferFailedException:
Error checking out: command failed: Cloning into 'F:\jenkins\jenkins-slave\workspace\n-box_maven-wagon_WAGON-527-KWYDRBGRPK7Q2YVCYHYJDNDOSEOHGQPJHV5AHJB4GNG66RKBHCBA\m\wagon-providers\wagon-scm\target\test-output\checkout-org.apache.maven.scm.provider.git.gitexe.GitExeScmProvider'...
fatal: '$GIT_DIR' too big
fatal: index-pack failed
Caused by: org.apache.maven.scm.ScmException:
command failed: Cloning into 'F:\jenkins\jenkins-slave\workspace\n-box_maven-wagon_WAGON-527-KWYDRBGRPK7Q2YVCYHYJDNDOSEOHGQPJHV5AHJB4GNG66RKBHCBA\m\wagon-providers\wagon-scm\target\test-output\checkout-org.apache.maven.scm.provider.git.gitexe.GitExeScmProvider'...
fatal: '$GIT_DIR' too big
fatal: index-pack failed


FAILED:  org.apache.maven.wagon.providers.scm.ScmGitExeWagonTest.testFailedGet

Error Message:
Error getting file from SCM

Stack Trace:
org.apache.maven.wagon.TransferFailedException: Error getting file from SCM
Caused by: org.apache.maven.scm.ScmException:
command failed: Cloning into 'F:\jenkins\jenkins-slave\workspace\n-box_maven-wagon_WAGON-527-KWYDRBGRPK7Q2YVCYHYJDNDOSEOHGQPJHV5AHJB4GNG66RKBHCBA\m\wagon-providers\wagon-scm\target\test-output\checkout-org.apache.maven.scm.provider.git.gitexe.GitExeScmProvider'...
fatal: '$GIT_DIR' too big
fatal: index-pack failed


FAILED:  org.apache.maven.wagon.providers.scm.ScmGitExeWagonTest.testWagonPutDirectoryWhenDirectoryAlreadyExists

Error Message:
Error checking out: command failed: Cloning into 'F:\jenkins\jenkins-slave\workspace\n-box_maven-wagon_WAGON-527-KWYDRBGRPK7Q2YVCYHYJDNDOSEOHGQPJHV5AHJB4GNG66RKBHCBA\m\wagon-providers\wagon-scm\target\test-output\checkout-org.apache.maven.scm.provider.git.gitexe.GitExeScmProvider'...
fatal: '$GIT_DIR' too big
fatal: index-pack failed

Stack Trace:
org.apache.maven.wagon.TransferFailedException:
Error checking out: command failed: Cloning into 'F:\jenkins\jenkins-slave\workspace\n-box_maven-wagon_WAGON-527-KWYDRBGRPK7Q2YVCYHYJDNDOSEOHGQPJHV5AHJB4GNG66RKBHCBA\m\wagon-providers\wagon-scm\target\test-output\checkout-org.apache.maven.scm.provider.git.gitexe.GitExeScmProvider'...
fatal: '$GIT_DIR' too big
fatal: index-pack failed
Caused by: org.apache.maven.scm.ScmException:
command failed: Cloning into 'F:\jenkins\jenkins-slave\workspace\n-box_maven-wagon_WAGON-527-KWYDRBGRPK7Q2YVCYHYJDNDOSEOHGQPJHV5AHJB4GNG66RKBHCBA\m\wagon-providers\wagon-scm\target\test-output\checkout-org.apache.maven.scm.provider.git.gitexe.GitExeScmProvider'...
fatal: '$GIT_DIR' too big
fatal: index-pack failed


FAILED:  org.apache.maven.wagon.providers.scm.ScmGitExeWagonTest.testWagonPutDirectory

Error Message:
Error checking out: command failed: Cloning into 'F:\jenkins\jenkins-slave\workspace\n-box_maven-wagon_WAGON-527-KWYDRBGRPK7Q2YVCYHYJDNDOSEOHGQPJHV5AHJB4GNG66RKBHCBA\m\wagon-providers\wagon-scm\target\test-output\checkout-org.apache.maven.scm.provider.git.gitexe.GitExeScmProvider'...
fatal: cannot stat 'F:/jenkins/jenkins-slave/workspace/n-box_maven-wagon_WAGON-527-KWYDRBGRPK7Q2YVCYHYJDNDOSEOHGQPJHV5AHJB4GNG66RKBHCBA/m/wagon-providers/wagon-scm/target/test-output/checkout-org.apache.maven.scm.provider.git.gitexe.GitExeScmProvider/.git/hooks/applypatch-msg.sample': Filename too long

Stack Trace:
org.apache.maven.wagon.TransferFailedException:
Error checking out: command failed: Cloning into 'F:\jenkins\jenkins-slave\workspace\n-box_maven-wagon_WAGON-527-KWYDRBGRPK7Q2YVCYHYJDNDOSEOHGQPJHV5AHJB4GNG66RKBHCBA\m\wagon-providers\wagon-scm\target\test-output\checkout-org.apache.maven.scm.provider.git.gitexe.GitExeScmProvider'...
fatal: cannot stat 'F:/jenkins/jenkins-slave/workspace/n-box_maven-wagon_WAGON-527-KWYDRBGRPK7Q2YVCYHYJDNDOSEOHGQPJHV5AHJB4GNG66RKBHCBA/m/wagon-providers/wagon-scm/target/test-output/checkout-org.apache.maven.scm.provider.git.gitexe.GitExeScmProvider/.git/hooks/applypatch-msg.sample': Filename too long
Caused by: org.apache.maven.scm.ScmException:
command failed: Cloning into 'F:\jenkins\jenkins-slave\workspace\n-box_maven-wagon_WAGON-527-KWYDRBGRPK7Q2YVCYHYJDNDOSEOHGQPJHV5AHJB4GNG66RKBHCBA\m\wagon-providers\wagon-scm\target\test-output\checkout-org.apache.maven.scm.provider.git.gitexe.GitExeScmProvider'...
fatal: cannot stat 'F:/jenkins/jenkins-slave/workspace/n-box_maven-wagon_WAGON-527-KWYDRBGRPK7Q2YVCYHYJDNDOSEOHGQPJHV5AHJB4GNG66RKBHCBA/m/wagon-providers/wagon-scm/target/test-output/checkout-org.apache.maven.scm.provider.git.gitexe.GitExeScmProvider/.git/hooks/applypatch-msg.sample': Filename too long


FAILED:  org.apache.maven.wagon.providers.scm.ScmGitExeWagonTest.testWagonPutDirectoryDeepDestination

Error Message:
Error checking out: command failed: Cloning into 'F:\jenkins\jenkins-slave\workspace\n-box_maven-wagon_WAGON-527-KWYDRBGRPK7Q2YVCYHYJDNDOSEOHGQPJHV5AHJB4GNG66RKBHCBA\m\wagon-providers\wagon-scm\target\test-output\checkout-org.apache.maven.scm.provider.git.gitexe.GitExeScmProvider'...
fatal: cannot stat 'F:/jenkins/jenkins-slave/workspace/n-box_maven-wagon_WAGON-527-KWYDRBGRPK7Q2YVCYHYJDNDOSEOHGQPJHV5AHJB4GNG66RKBHCBA/m/wagon-providers/wagon-scm/target/test-output/checkout-org.apache.maven.scm.provider.git.gitexe.GitExeScmProvider/.git/hooks/applypatch-msg.sample': Filename too long

Stack Trace:
org.apache.maven.wagon.TransferFailedException:
Error checking out: command failed: Cloning into 'F:\jenkins\jenkins-slave\workspace\n-box_maven-wagon_WAGON-527-KWYDRBGRPK7Q2YVCYHYJDNDOSEOHGQPJHV5AHJB4GNG66RKBHCBA\m\wagon-providers\wagon-scm\target\test-output\checkout-org.apache.maven.scm.provider.git.gitexe.GitExeScmProvider'...
fatal: cannot stat 'F:/jenkins/jenkins-slave/workspace/n-box_maven-wagon_WAGON-527-KWYDRBGRPK7Q2YVCYHYJDNDOSEOHGQPJHV5AHJB4GNG66RKBHCBA/m/wagon-providers/wagon-scm/target/test-output/checkout-org.apache.maven.scm.provider.git.gitexe.GitExeScmProvider/.git/hooks/applypatch-msg.sample': Filename too long
Caused by: org.apache.maven.scm.ScmException:
command failed: Cloning into 'F:\jenkins\jenkins-slave\workspace\n-box_maven-wagon_WAGON-527-KWYDRBGRPK7Q2YVCYHYJDNDOSEOHGQPJHV5AHJB4GNG66RKBHCBA\m\wagon-providers\wagon-scm\target\test-output\checkout-org.apache.maven.scm.provider.git.gitexe.GitExeScmProvider'...
fatal: cannot stat 'F:/jenkins/jenkins-slave/workspace/n-box_maven-wagon_WAGON-527-KWYDRBGRPK7Q2YVCYHYJDNDOSEOHGQPJHV5AHJB4GNG66RKBHCBA/m/wagon-providers/wagon-scm/target/test-output/checkout-org.apache.maven.scm.provider.git.gitexe.GitExeScmProvider/.git/hooks/applypatch-msg.sample': Filename too long


FAILED:  org.apache.maven.wagon.providers.scm.ScmGitExeWagonTest.testWagon

Error Message:

  Unexpected method call TransferListener.transferError(TransferEvent[GET|ERROR|Repository[scm:git:file:///F:/jenkins/jenkins-slave/workspace/n-box_maven-wagon_WAGON-527-KWYDRBGRPK7Q2YVCYHYJDNDOSEOHGQPJHV5AHJB4GNG66RKBHCBA/m/wagon-providers/wagon-scm/target/test-classes/test-repo-git-test/]|null|test-resource[len = 18; mod = 1539194038725]]):
    TransferListener.transferCompleted(TransferEvent[PUT|COMPLETED|Repository[scm:git:file:///F:/jenkins/jenkins-slave/workspace/n-box_maven-wagon_WAGON-527-KWYDRBGRPK7Q2YVCYHYJDNDOSEOHGQPJHV5AHJB4GNG66RKBHCBA/m/wagon-providers/wagon-scm/target/test-classes/test-repo-git-test/]|F:\jenkins\jenkins-slave\workspace\n-box_maven-wagon_WAGON-527-KWYDRBGRPK7Q2YVCYHYJDNDOSEOHGQPJHV5AHJB4GNG66RKBHCBA\m\wagon-providers\wagon-scm\target\test-output\test-resource|test-resource[len = 18; mod = 1539194038725]]): expected: 1, actual: 0

Stack Trace:
java.lang.AssertionError:

  Unexpected method call TransferListener.transferError(TransferEvent[GET|ERROR|Repository[scm:git:file:///F:/jenkins/jenkins-slave/workspace/n-box_maven-wagon_WAGON-527-KWYDRBGRPK7Q2YVCYHYJDNDOSEOHGQPJHV5AHJB4GNG66RKBHCBA/m/wagon-providers/wagon-scm/target/test-classes/test-repo-git-test/]|null|test-resource[len = 18; mod = 1539194038725]]):
    TransferListener.transferCompleted(TransferEvent[PUT|COMPLETED|Repository[scm:git:file:///F:/jenkins/jenkins-slave/workspace/n-box_maven-wagon_WAGON-527-KWYDRBGRPK7Q2YVCYHYJDNDOSEOHGQPJHV5AHJB4GNG66RKBHCBA/m/wagon-providers/wagon-scm/target/test-classes/test-repo-git-test/]|F:\jenkins\jenkins-slave\workspace\n-box_maven-wagon_WAGON-527-KWYDRBGRPK7Q2YVCYHYJDNDOSEOHGQPJHV5AHJB4GNG66RKBHCBA\m\wagon-providers\wagon-scm\target\test-output\test-resource|test-resource[len = 18; mod = 1539194038725]]): expected: 1, actual: 0


FAILED:  org.apache.maven.wagon.providers.scm.ScmGitExeWagonTest.testWagonPutDirectoryForDot

Error Message:
Error checking out: command failed: Cloning into 'F:\jenkins\jenkins-slave\workspace\n-box_maven-wagon_WAGON-527-KWYDRBGRPK7Q2YVCYHYJDNDOSEOHGQPJHV5AHJB4GNG66RKBHCBA\m\wagon-providers\wagon-scm\target\test-output\checkout-org.apache.maven.scm.provider.git.gitexe.GitExeScmProvider'...
fatal: cannot stat 'F:/jenkins/jenkins-slave/workspace/n-box_maven-wagon_WAGON-527-KWYDRBGRPK7Q2YVCYHYJDNDOSEOHGQPJHV5AHJB4GNG66RKBHCBA/m/wagon-providers/wagon-scm/target/test-output/checkout-org.apache.maven.scm.provider.git.gitexe.GitExeScmProvider/.git/hooks/applypatch-msg.sample': Filename too long

Stack Trace:
org.apache.maven.wagon.TransferFailedException:
Error checking out: command failed: Cloning into 'F:\jenkins\jenkins-slave\workspace\n-box_maven-wagon_WAGON-527-KWYDRBGRPK7Q2YVCYHYJDNDOSEOHGQPJHV5AHJB4GNG66RKBHCBA\m\wagon-providers\wagon-scm\target\test-output\checkout-org.apache.maven.scm.provider.git.gitexe.GitExeScmProvider'...
fatal: cannot stat 'F:/jenkins/jenkins-slave/workspace/n-box_maven-wagon_WAGON-527-KWYDRBGRPK7Q2YVCYHYJDNDOSEOHGQPJHV5AHJB4GNG66RKBHCBA/m/wagon-providers/wagon-scm/target/test-output/checkout-org.apache.maven.scm.provider.git.gitexe.GitExeScmProvider/.git/hooks/applypatch-msg.sample': Filename too long
Caused by: org.apache.maven.scm.ScmException:
command failed: Cloning into 'F:\jenkins\jenkins-slave\workspace\n-box_maven-wagon_WAGON-527-KWYDRBGRPK7Q2YVCYHYJDNDOSEOHGQPJHV5AHJB4GNG66RKBHCBA\m\wagon-providers\wagon-scm\target\test-output\checkout-org.apache.maven.scm.provider.git.gitexe.GitExeScmProvider'...
fatal: cannot stat 'F:/jenkins/jenkins-slave/workspace/n-box_maven-wagon_WAGON-527-KWYDRBGRPK7Q2YVCYHYJDNDOSEOHGQPJHV5AHJB4GNG66RKBHCBA/m/wagon-providers/wagon-scm/target/test-output/checkout-org.apache.maven.scm.provider.git.gitexe.GitExeScmProvider/.git/hooks/applypatch-msg.sample': Filename too long


FAILED:  org.apache.maven.wagon.providers.scm.ScmGitExeWagonTest.testFailedGet

Error Message:
Error getting file from SCM

Stack Trace:
org.apache.maven.wagon.TransferFailedException: Error getting file from SCM
Caused by: org.apache.maven.scm.ScmException:
command failed: Cloning into 'F:\jenkins\jenkins-slave\workspace\n-box_maven-wagon_WAGON-527-KWYDRBGRPK7Q2YVCYHYJDNDOSEOHGQPJHV5AHJB4GNG66RKBHCBA\m\wagon-providers\wagon-scm\target\test-output\checkout-org.apache.maven.scm.provider.git.gitexe.GitExeScmProvider'...
fatal: cannot stat 'F:/jenkins/jenkins-slave/workspace/n-box_maven-wagon_WAGON-527-KWYDRBGRPK7Q2YVCYHYJDNDOSEOHGQPJHV5AHJB4GNG66RKBHCBA/m/wagon-providers/wagon-scm/target/test-output/checkout-org.apache.maven.scm.provider.git.gitexe.GitExeScmProvider/.git/hooks/applypatch-msg.sample': Filename too long


FAILED:  org.apache.maven.wagon.providers.scm.ScmGitExeWagonTest.testWagonPutDirectoryWhenDirectoryAlreadyExists

Error Message:
Error checking out: command failed: Cloning into 'F:\jenkins\jenkins-slave\workspace\n-box_maven-wagon_WAGON-527-KWYDRBGRPK7Q2YVCYHYJDNDOSEOHGQPJHV5AHJB4GNG66RKBHCBA\m\wagon-providers\wagon-scm\target\test-output\checkout-org.apache.maven.scm.provider.git.gitexe.GitExeScmProvider'...
fatal: cannot stat 'F:/jenkins/jenkins-slave/workspace/n-box_maven-wagon_WAGON-527-KWYDRBGRPK7Q2YVCYHYJDNDOSEOHGQPJHV5AHJB4GNG66RKBHCBA/m/wagon-providers/wagon-scm/target/test-output/checkout-org.apache.maven.scm.provider.git.gitexe.GitExeScmProvider/.git/hooks/applypatch-msg.sample': Filename too long

Stack Trace:
org.apache.maven.wagon.TransferFailedException:
Error checking out: command failed: Cloning into 'F:\jenkins\jenkins-slave\workspace\n-box_maven-wagon_WAGON-527-KWYDRBGRPK7Q2YVCYHYJDNDOSEOHGQPJHV5AHJB4GNG66RKBHCBA\m\wagon-providers\wagon-scm\target\test-output\checkout-org.apache.maven.scm.provider.git.gitexe.GitExeScmProvider'...
fatal: cannot stat 'F:/jenkins/jenkins-slave/workspace/n-box_maven-wagon_WAGON-527-KWYDRBGRPK7Q2YVCYHYJDNDOSEOHGQPJHV5AHJB4GNG66RKBHCBA/m/wagon-providers/wagon-scm/target/test-output/checkout-org.apache.maven.scm.provider.git.gitexe.GitExeScmProvider/.git/hooks/applypatch-msg.sample': Filename too long
Caused by: org.apache.maven.scm.ScmException:
command failed: Cloning into 'F:\jenkins\jenkins-slave\workspace\n-box_maven-wagon_WAGON-527-KWYDRBGRPK7Q2YVCYHYJDNDOSEOHGQPJHV5AHJB4GNG66RKBHCBA\m\wagon-providers\wagon-scm\target\test-output\checkout-org.apache.maven.scm.provider.git.gitexe.GitExeScmProvider'...
fatal: cannot stat 'F:/jenkins/jenkins-slave/workspace/n-box_maven-wagon_WAGON-527-KWYDRBGRPK7Q2YVCYHYJDNDOSEOHGQPJHV5AHJB4GNG66RKBHCBA/m/wagon-providers/wagon-scm/target/test-output/checkout-org.apache.maven.scm.provider.git.gitexe.GitExeScmProvider/.git/hooks/applypatch-msg.sample': Filename too long


FAILED:  org.apache.maven.wagon.providers.scm.ScmGitExeWagonTest.testWagonPutDirectory

Error Message:
Error checking out: command failed: Cloning into 'F:\jenkins\jenkins-slave\workspace\n-box_maven-wagon_WAGON-527-KWYDRBGRPK7Q2YVCYHYJDNDOSEOHGQPJHV5AHJB4GNG66RKBHCBA\m\wagon-providers\wagon-scm\target\test-output\checkout-org.apache.maven.scm.provider.git.gitexe.GitExeScmProvider'...
fatal: '$GIT_DIR' too big
fatal: index-pack failed

Stack Trace:
org.apache.maven.wagon.TransferFailedException:
Error checking out: command failed: Cloning into 'F:\jenkins\jenkins-slave\workspace\n-box_maven-wagon_WAGON-527-KWYDRBGRPK7Q2YVCYHYJDNDOSEOHGQPJHV5AHJB4GNG66RKBHCBA\m\wagon-providers\wagon-scm\target\test-output\checkout-org.apache.maven.scm.provider.git.gitexe.GitExeScmProvider'...
fatal: '$GIT_DIR' too big
fatal: index-pack failed
Caused by: org.apache.maven.scm.ScmException:
command failed: Cloning into 'F:\jenkins\jenkins-slave\workspace\n-box_maven-wagon_WAGON-527-KWYDRBGRPK7Q2YVCYHYJDNDOSEOHGQPJHV5AHJB4GNG66RKBHCBA\m\wagon-providers\wagon-scm\target\test-output\checkout-org.apache.maven.scm.provider.git.gitexe.GitExeScmProvider'...
fatal: '$GIT_DIR' too big
fatal: index-pack failed


FAILED:  org.apache.maven.wagon.providers.scm.ScmGitExeWagonTest.testWagonPutDirectoryDeepDestination

Error Message:
Error checking out: command failed: Cloning into 'F:\jenkins\jenkins-slave\workspace\n-box_maven-wagon_WAGON-527-KWYDRBGRPK7Q2YVCYHYJDNDOSEOHGQPJHV5AHJB4GNG66RKBHCBA\m\wagon-providers\wagon-scm\target\test-output\checkout-org.apache.maven.scm.provider.git.gitexe.GitExeScmProvider'...
fatal: '$GIT_DIR' too big
fatal: index-pack failed

Stack Trace:
org.apache.maven.wagon.TransferFailedException:
Error checking out: command failed: Cloning into 'F:\jenkins\jenkins-slave\workspace\n-box_maven-wagon_WAGON-527-KWYDRBGRPK7Q2YVCYHYJDNDOSEOHGQPJHV5AHJB4GNG66RKBHCBA\m\wagon-providers\wagon-scm\target\test-output\checkout-org.apache.maven.scm.provider.git.gitexe.GitExeScmProvider'...
fatal: '$GIT_DIR' too big
fatal: index-pack failed
Caused by: org.apache.maven.scm.ScmException:
command failed: Cloning into 'F:\jenkins\jenkins-slave\workspace\n-box_maven-wagon_WAGON-527-KWYDRBGRPK7Q2YVCYHYJDNDOSEOHGQPJHV5AHJB4GNG66RKBHCBA\m\wagon-providers\wagon-scm\target\test-output\checkout-org.apache.maven.scm.provider.git.gitexe.GitExeScmProvider'...
fatal: '$GIT_DIR' too big
fatal: index-pack failed


FAILED:  org.apache.maven.wagon.providers.scm.ScmGitExeWagonTest.testWagon

Error Message:

  Unexpected method call TransferListener.transferError(TransferEvent[GET|ERROR|Repository[scm:git:file:///F:/jenkins/jenkins-slave/workspace/n-box_maven-wagon_WAGON-527-KWYDRBGRPK7Q2YVCYHYJDNDOSEOHGQPJHV5AHJB4GNG66RKBHCBA/m/wagon-providers/wagon-scm/target/test-classes/test-repo-git-test/]|null|test-resource[len = 18; mod = 1539194210646]]):
    TransferListener.transferCompleted(TransferEvent[PUT|COMPLETED|Repository[scm:git:file:///F:/jenkins/jenkins-slave/workspace/n-box_maven-wagon_WAGON-527-KWYDRBGRPK7Q2YVCYHYJDNDOSEOHGQPJHV5AHJB4GNG66RKBHCBA/m/wagon-providers/wagon-scm/target/test-classes/test-repo-git-test/]|F:\jenkins\jenkins-slave\workspace\n-box_maven-wagon_WAGON-527-KWYDRBGRPK7Q2YVCYHYJDNDOSEOHGQPJHV5AHJB4GNG66RKBHCBA\m\wagon-providers\wagon-scm\target\test-output\test-resource|test-resource[len = 18; mod = 1539194210646]]): expected: 1, actual: 0

Stack Trace:
java.lang.AssertionError:

  Unexpected method call TransferListener.transferError(TransferEvent[GET|ERROR|Repository[scm:git:file:///F:/jenkins/jenkins-slave/workspace/n-box_maven-wagon_WAGON-527-KWYDRBGRPK7Q2YVCYHYJDNDOSEOHGQPJHV5AHJB4GNG66RKBHCBA/m/wagon-providers/wagon-scm/target/test-classes/test-repo-git-test/]|null|test-resource[len = 18; mod = 1539194210646]]):
    TransferListener.transferCompleted(TransferEvent[PUT|COMPLETED|Repository[scm:git:file:///F:/jenkins/jenkins-slave/workspace/n-box_maven-wagon_WAGON-527-KWYDRBGRPK7Q2YVCYHYJDNDOSEOHGQPJHV5AHJB4GNG66RKBHCBA/m/wagon-providers/wagon-scm/target/test-classes/test-repo-git-test/]|F:\jenkins\jenkins-slave\workspace\n-box_maven-wagon_WAGON-527-KWYDRBGRPK7Q2YVCYHYJDNDOSEOHGQPJHV5AHJB4GNG66RKBHCBA\m\wagon-providers\wagon-scm\target\test-output\test-resource|test-resource[len = 18; mod = 1539194210646]]): expected: 1, actual: 0


FAILED:  org.apache.maven.wagon.providers.scm.ScmGitExeWagonTest.testWagonPutDirectoryForDot

Error Message:
Error checking out: command failed: Cloning into 'F:\jenkins\jenkins-slave\workspace\n-box_maven-wagon_WAGON-527-KWYDRBGRPK7Q2YVCYHYJDNDOSEOHGQPJHV5AHJB4GNG66RKBHCBA\m\wagon-providers\wagon-scm\target\test-output\checkout-org.apache.maven.scm.provider.git.gitexe.GitExeScmProvider'...
fatal: '$GIT_DIR' too big
fatal: index-pack failed

Stack Trace:
org.apache.maven.wagon.TransferFailedException:
Error checking out: command failed: Cloning into 'F:\jenkins\jenkins-slave\workspace\n-box_maven-wagon_WAGON-527-KWYDRBGRPK7Q2YVCYHYJDNDOSEOHGQPJHV5AHJB4GNG66RKBHCBA\m\wagon-providers\wagon-scm\target\test-output\checkout-org.apache.maven.scm.provider.git.gitexe.GitExeScmProvider'...
fatal: '$GIT_DIR' too big
fatal: index-pack failed
Caused by: org.apache.maven.scm.ScmException:
command failed: Cloning into 'F:\jenkins\jenkins-slave\workspace\n-box_maven-wagon_WAGON-527-KWYDRBGRPK7Q2YVCYHYJDNDOSEOHGQPJHV5AHJB4GNG66RKBHCBA\m\wagon-providers\wagon-scm\target\test-output\checkout-org.apache.maven.scm.provider.git.gitexe.GitExeScmProvider'...
fatal: '$GIT_DIR' too big
fatal: index-pack failed


FAILED:  org.apache.maven.wagon.providers.scm.ScmGitExeWagonTest.testFailedGet

Error Message:
Error getting file from SCM

Stack Trace:
org.apache.maven.wagon.TransferFailedException: Error getting file from SCM
Caused by: org.apache.maven.scm.ScmException:
command failed: Cloning into 'F:\jenkins\jenkins-slave\workspace\n-box_maven-wagon_WAGON-527-KWYDRBGRPK7Q2YVCYHYJDNDOSEOHGQPJHV5AHJB4GNG66RKBHCBA\m\wagon-providers\wagon-scm\target\test-output\checkout-org.apache.maven.scm.provider.git.gitexe.GitExeScmProvider'...
fatal: '$GIT_DIR' too big
fatal: index-pack failed


FAILED:  org.apache.maven.wagon.providers.scm.ScmGitExeWagonTest.testWagonPutDirectoryWhenDirectoryAlreadyExists

Error Message:
Error checking out: command failed: Cloning into 'F:\jenkins\jenkins-slave\workspace\n-box_maven-wagon_WAGON-527-KWYDRBGRPK7Q2YVCYHYJDNDOSEOHGQPJHV5AHJB4GNG66RKBHCBA\m\wagon-providers\wagon-scm\target\test-output\checkout-org.apache.maven.scm.provider.git.gitexe.GitExeScmProvider'...
fatal: '$GIT_DIR' too big
fatal: index-pack failed

Stack Trace:
org.apache.maven.wagon.TransferFailedException:
Error checking out: command failed: Cloning into 'F:\jenkins\jenkins-slave\workspace\n-box_maven-wagon_WAGON-527-KWYDRBGRPK7Q2YVCYHYJDNDOSEOHGQPJHV5AHJB4GNG66RKBHCBA\m\wagon-providers\wagon-scm\target\test-output\checkout-org.apache.maven.scm.provider.git.gitexe.GitExeScmProvider'...
fatal: '$GIT_DIR' too big
fatal: index-pack failed
Caused by: org.apache.maven.scm.ScmException:
command failed: Cloning into 'F:\jenkins\jenkins-slave\workspace\n-box_maven-wagon_WAGON-527-KWYDRBGRPK7Q2YVCYHYJDNDOSEOHGQPJHV5AHJB4GNG66RKBHCBA\m\wagon-providers\wagon-scm\target\test-output\checkout-org.apache.maven.scm.provider.git.gitexe.GitExeScmProvider'...
fatal: '$GIT_DIR' too big
fatal: index-pack failed




Build log:
[...truncated 3.36 MB...]
[windows-jdk9] [INFO]
[windows-jdk9] [INFO] --- maven-enforcer-plugin:1.4.1:enforce (default) @ wagon-ssh ---
[windows-jdk9] [INFO]
[windows-jdk9] [INFO] --- apache-rat-plugin:0.12:check (rat-check) @ wagon-ssh ---
[windows-jdk9] [INFO] Enabled default license matchers.
[windows-jdk9] [INFO] Will parse SCM ignores for exclusions...
[windows-jdk9] [INFO] Finished adding exclusions from SCM ignore files.
[windows-jdk9] [INFO] 61 implicit excludes (use -debug for more details).
[windows-jdk9] [INFO] Exclude: .checkstyle
[windows-jdk9] [INFO] Exclude: **/*.odg
[windows-jdk9] [INFO] Exclude: src/test/resources/**
[windows-jdk9] [INFO] Exclude: src/main/resources/default-server-root/**
[windows-jdk9] [INFO] Exclude: src/main/resources/ssh-keys/**
[windows-jdk9] [INFO] Exclude: src/test/ssh-keys/**
[windows-jdk9] [INFO] Exclude: .repository/**
[windows-jdk9] [INFO] Exclude: out/**
[windows-jdk9] [INFO] Exclude: .repository/**
[windows-jdk9] [INFO] Exclude: .maven/spy.log
[windows-jdk9] [INFO] Exclude: dependency-reduced-pom.xml
[windows-jdk9] [INFO] Exclude: .java-version
[windows-jdk9] [INFO] 19 resources included (use -debug for more details)
[windows-jdk9] [INFO] Rat check: Summary over all files. Unapproved: 0, unknown: 0, generated: 0, approved: 19 licenses.
[windows-jdk9] [INFO]
[windows-jdk9] [INFO] --- maven-remote-resources-plugin:1.5:process (process-resource-bundles) @ wagon-ssh ---
[windows-jdk9] [INFO]
[windows-jdk9] [INFO] --- maven-resources-plugin:3.0.2:resources (default-resources) @ wagon-ssh ---
[windows-jdk9] [INFO] Using 'UTF-8' encoding to copy filtered resources.
[windows-jdk9] [INFO] skip non existing resourceDirectory F:\jenkins\jenkins-slave\workspace\n-box_maven-wagon_WAGON-527-KWYDRBGRPK7Q2YVCYHYJDNDOSEOHGQPJHV5AHJB4GNG66RKBHCBA\m\wagon-providers\wagon-ssh\src\main\resources
[windows-jdk9] [INFO] Copying 3 resources
[windows-jdk9] [INFO]
[windows-jdk9] [INFO] --- maven-compiler-plugin:3.7.0:compile (default-compile) @ wagon-ssh ---
[windows-jdk9] [INFO] Changes detected - recompiling the module!
[windows-jdk9] [INFO] Compiling 7 source files to F:\jenkins\jenkins-slave\workspace\n-box_maven-wagon_WAGON-527-KWYDRBGRPK7Q2YVCYHYJDNDOSEOHGQPJHV5AHJB4GNG66RKBHCBA\m\wagon-providers\wagon-ssh\target\classes
[windows-jdk9] [INFO]
[windows-jdk9] [INFO] --- plexus-component-metadata:1.7.1:generate-metadata (generate) @ wagon-ssh ---
[windows-jdk9] [INFO] Discovered 4 component descriptors(s)
[windows-jdk9] [INFO]
[windows-jdk9] [INFO] --- animal-sniffer-maven-plugin:1.15:check (check-java-1.7-compat) @ wagon-ssh ---
[windows-jdk9] [INFO] Checking unresolved references to org.codehaus.mojo.signature:java17:1.0
[windows-jdk9] [INFO]
[windows-jdk9] [INFO] --- maven-resources-plugin:3.0.2:testResources (default-testResources) @ wagon-ssh ---
[windows-jdk9] [INFO] Using 'UTF-8' encoding to copy filtered resources.
[windows-jdk9] [INFO] Copying 6 resources
[windows-jdk9] [INFO] Copying 3 resources
[windows-jdk9] [INFO]
[windows-jdk9] [INFO] --- maven-compiler-plugin:3.7.0:testCompile (default-testCompile) @ wagon-ssh ---
[windows-jdk9] [INFO] Changes detected - recompiling the module!
[windows-jdk9] [INFO] Compiling 8 source files to F:\jenkins\jenkins-slave\workspace\n-box_maven-wagon_WAGON-527-KWYDRBGRPK7Q2YVCYHYJDNDOSEOHGQPJHV5AHJB4GNG66RKBHCBA\m\wagon-providers\wagon-ssh\target\test-classes
[windows-jdk9] [INFO] /F:/jenkins/jenkins-slave/workspace/n-box_maven-wagon_WAGON-527-KWYDRBGRPK7Q2YVCYHYJDNDOSEOHGQPJHV5AHJB4GNG66RKBHCBA/m/wagon-providers/wagon-ssh/src/test/java/org/apache/maven/wagon/providers/ssh/jsch/ScpWagonWithSshPrivateKeySearchTest.java: F:\jenkins\jenkins-slave\workspace\n-box_maven-wagon_WAGON-527-KWYDRBGRPK7Q2YVCYHYJDNDOSEOHGQPJHV5AHJB4GNG66RKBHCBA\m\wagon-providers\wagon-ssh\src\test\java\org\apache\maven\wagon\providers\ssh\jsch\ScpWagonWithSshPrivateKeySearchTest.java uses or overrides a deprecated API.
[windows-jdk9] [INFO] /F:/jenkins/jenkins-slave/workspace/n-box_maven-wagon_WAGON-527-KWYDRBGRPK7Q2YVCYHYJDNDOSEOHGQPJHV5AHJB4GNG66RKBHCBA/m/wagon-providers/wagon-ssh/src/test/java/org/apache/maven/wagon/providers/ssh/jsch/ScpWagonWithSshPrivateKeySearchTest.java: Recompile with -Xlint:deprecation for details.
[windows-jdk9] [INFO]
[windows-jdk9] [INFO] --- maven-surefire-plugin:2.20:test (default-test) @ wagon-ssh ---
[windows-jdk9] [INFO]
[windows-jdk9] [INFO] --- maven-jar-plugin:3.0.2:jar (default-jar) @ wagon-ssh ---
[windows-jdk9] [INFO] Building jar: F:\jenkins\jenkins-slave\workspace\n-box_maven-wagon_WAGON-527-KWYDRBGRPK7Q2YVCYHYJDNDOSEOHGQPJHV5AHJB4GNG66RKBHCBA\m\wagon-providers\wagon-ssh\target\wagon-ssh-3.1.1-SNAPSHOT.jar
[windows-jdk9] [INFO]
[windows-jdk9] [INFO] --- maven-site-plugin:3.7:attach-descriptor (attach-descriptor) @ wagon-ssh ---
[windows-jdk9] [INFO] Skipping because packaging 'jar' is not pom.
[windows-jdk9] [INFO]
[windows-jdk9] [INFO] --- maven-checkstyle-plugin:3.0.0:check (checkstyle-check) @ wagon-ssh ---
[windows-jdk9] [INFO] There is 1 error reported by Checkstyle 6.18 with config/maven_checks.xml ruleset.
[windows-jdk9] [INFO] Ignored 1 error, 0 violation remaining.
[windows-jdk9] [INFO]
[windows-jdk9] [INFO] ------------------------------------------------------------------------
[windows-jdk9] [INFO] Building Apache Maven Wagon :: Providers :: WebDAV Provider 3.1.1-SNAPSHOT
[windows-jdk9] [INFO] ------------------------------------------------------------------------
[windows-jdk9] [INFO] Downloading from central: https://repo.maven.apache.org/maven2/org/apache/jackrabbit/jackrabbit-webdav/2.14.4/jackrabbit-webdav-2.14.4.pom
[windows-jdk9] [INFO] Downloaded from central: https://repo.maven.apache.org/maven2/org/apache/jackrabbit/jackrabbit-webdav/2.14.4/jackrabbit-webdav-2.14.4.pom (4.0 kB at 86 kB/s)
[windows-jdk9] [INFO] Downloading from central: https://repo.maven.apache.org/maven2/org/apache/jackrabbit/jackrabbit-parent/2.14.4/jackrabbit-parent-2.14.4.pom
[windows-jdk9] [INFO] Downloaded from central: https://repo.maven.apache.org/maven2/org/apache/jackrabbit/jackrabbit-parent/2.14.4/jackrabbit-parent-2.14.4.pom (35 kB at 1.3 MB/s)
[windows-jdk9] [INFO] Downloading from central: https://repo.maven.apache.org/maven2/it/could/webdav/0.4/webdav-0.4.pom
[windows-jdk9] [INFO] Downloaded from central: https://repo.maven.apache.org/maven2/it/could/webdav/0.4/webdav-0.4.pom (1.1 kB at 40 kB/s)
[windows-jdk9] [INFO] Downloading from central: https://repo.maven.apache.org/maven2/biz/aQute/bnd/1.50.0/bnd-1.50.0.pom
[windows-jdk9] [INFO] Downloaded from central: https://repo.maven.apache.org/maven2/biz/aQute/bnd/1.50.0/bnd-1.50.0.pom (1.3 kB at 35 kB/s)
[windows-jdk9] [INFO] Downloading from central: https://repo.maven.apache.org/maven2/biz/aQute/bnd/1.50.0/bnd-1.50.0.jar
[windows-jdk9] [INFO] Downloading from central: https://repo.maven.apache.org/maven2/org/apache/jackrabbit/jackrabbit-webdav/2.14.4/jackrabbit-webdav-2.14.4.jar
[windows-jdk9] [INFO] Downloading from central: https://repo.maven.apache.org/maven2/javax/servlet/servlet-api/2.3/servlet-api-2.3.jar
[windows-jdk9] [INFO] Downloading from central: https://repo.maven.apache.org/maven2/it/could/webdav/0.4/webdav-0.4.jar
[windows-jdk9] [INFO] Downloaded from central: https://repo.maven.apache.org/maven2/it/could/webdav/0.4/webdav-0.4.jar (103 kB at 1.4 MB/s)
[windows-jdk9] [INFO] Downloaded from central: https://repo.maven.apache.org/maven2/biz/aQute/bnd/1.50.0/bnd-1.50.0.jar (828 kB at 11 MB/s)
[windows-jdk9] [INFO] Downloaded from central: https://repo.maven.apache.org/maven2/javax/servlet/servlet-api/2.3/servlet-api-2.3.jar (78 kB at 975 kB/s)
[windows-jdk9] [INFO] Downloaded from central: https://repo.maven.apache.org/maven2/org/apache/jackrabbit/jackrabbit-webdav/2.14.4/jackrabbit-webdav-2.14.4.jar (365 kB at 4.6 MB/s)
[windows-jdk9] [INFO]
[windows-jdk9] [INFO] --- maven-clean-plugin:3.0.0:clean (default-clean) @ wagon-webdav-jackrabbit ---
[windows-jdk9] [INFO]
[windows-jdk9] [INFO] --- maven-enforcer-plugin:1.4.1:enforce (enforce-maven-version) @ wagon-webdav-jackrabbit ---
[windows-jdk9] [INFO]
[windows-jdk9] [INFO] --- maven-enforcer-plugin:1.4.1:enforce (enforce-bytecode-version) @ wagon-webdav-jackrabbit ---
[windows-jdk9] [INFO]
[windows-jdk9] [INFO] --- maven-enforcer-plugin:1.4.1:enforce (ban-known-bad-maven-versions) @ wagon-webdav-jackrabbit ---
[windows-jdk9] [INFO]
[windows-jdk9] [INFO] --- maven-enforcer-plugin:1.4.1:enforce (default) @ wagon-webdav-jackrabbit ---
[windows-jdk9] [INFO]
[windows-jdk9] [INFO] --- apache-rat-plugin:0.12:check (rat-check) @ wagon-webdav-jackrabbit ---
[windows-jdk9] [INFO] Enabled default license matchers.
[windows-jdk9] [INFO] Will parse SCM ignores for exclusions...
[windows-jdk9] [INFO] Finished adding exclusions from SCM ignore files.
[windows-jdk9] [INFO] 61 implicit excludes (use -debug for more details).
[windows-jdk9] [INFO] Exclude: .checkstyle
[windows-jdk9] [INFO] Exclude: **/*.odg
[windows-jdk9] [INFO] Exclude: src/test/resources/**
[windows-jdk9] [INFO] Exclude: src/main/resources/default-server-root/**
[windows-jdk9] [INFO] Exclude: src/main/resources/ssh-keys/**
[windows-jdk9] [INFO] Exclude: src/test/ssh-keys/**
[windows-jdk9] [INFO] Exclude: .repository/**
[windows-jdk9] [INFO] Exclude: out/**
[windows-jdk9] [INFO] Exclude: .repository/**
[windows-jdk9] [INFO] Exclude: .maven/spy.log
[windows-jdk9] [INFO] Exclude: dependency-reduced-pom.xml
[windows-jdk9] [INFO] Exclude: .java-version
[windows-jdk9] [INFO] 12 resources included (use -debug for more details)
[windows-jdk9] [INFO] Rat check: Summary over all files. Unapproved: 0, unknown: 0, generated: 0, approved: 12 licenses.
[windows-jdk9] [INFO]
[windows-jdk9] [INFO] --- maven-remote-resources-plugin:1.5:process (process-resource-bundles) @ wagon-webdav-jackrabbit ---
[windows-jdk9] [INFO]
[windows-jdk9] [INFO] --- maven-resources-plugin:3.0.2:resources (default-resources) @ wagon-webdav-jackrabbit ---
[windows-jdk9] [INFO] Using 'UTF-8' encoding to copy filtered resources.
[windows-jdk9] [INFO] Copying 1 resource
[windows-jdk9] [INFO] Copying 3 resources
[windows-jdk9] [INFO]
[windows-jdk9] [INFO] --- maven-compiler-plugin:3.7.0:compile (default-compile) @ wagon-webdav-jackrabbit ---
[windows-jdk9] [INFO] Changes detected - recompiling the module!
[windows-jdk9] [INFO] Compiling 4 source files to F:\jenkins\jenkins-slave\workspace\n-box_maven-wagon_WAGON-527-KWYDRBGRPK7Q2YVCYHYJDNDOSEOHGQPJHV5AHJB4GNG66RKBHCBA\m\wagon-providers\wagon-webdav-jackrabbit\target\classes
[windows-jdk9] [INFO] /F:/jenkins/jenkins-slave/workspace/n-box_maven-wagon_WAGON-527-KWYDRBGRPK7Q2YVCYHYJDNDOSEOHGQPJHV5AHJB4GNG66RKBHCBA/m/wagon-providers/wagon-webdav-jackrabbit/src/main/java/org/apache/maven/wagon/providers/webdav/WebDavWagon.java: F:\jenkins\jenkins-slave\workspace\n-box_maven-wagon_WAGON-527-KWYDRBGRPK7Q2YVCYHYJDNDOSEOHGQPJHV5AHJB4GNG66RKBHCBA\m\wagon-providers\wagon-webdav-jackrabbit\src\main\java\org\apache\maven\wagon\providers\webdav\WebDavWagon.java uses or overrides a deprecated API.
[windows-jdk9] [INFO] /F:/jenkins/jenkins-slave/workspace/n-box_maven-wagon_WAGON-527-KWYDRBGRPK7Q2YVCYHYJDNDOSEOHGQPJHV5AHJB4GNG66RKBHCBA/m/wagon-providers/wagon-webdav-jackrabbit/src/main/java/org/apache/maven/wagon/providers/webdav/WebDavWagon.java: Recompile with -Xlint:deprecation for details.
[windows-jdk9] [INFO]
[windows-jdk9] [INFO] --- plexus-component-metadata:1.7.1:generate-metadata (generate) @ wagon-webdav-jackrabbit ---
[windows-jdk9] [INFO] Discovered 1 component descriptors(s)
[windows-jdk9] [INFO]
[windows-jdk9] [INFO] --- animal-sniffer-maven-plugin:1.15:check (check-java-1.7-compat) @ wagon-webdav-jackrabbit ---
[windows-jdk9] [INFO] Checking unresolved references to org.codehaus.mojo.signature:java17:1.0
[windows-jdk9] [INFO]
[windows-jdk9] [INFO] --- maven-resources-plugin:3.0.2:testResources (default-testResources) @ wagon-webdav-jackrabbit ---
[windows-jdk9] [INFO] Using 'UTF-8' encoding to copy filtered resources.
[windows-jdk9] [INFO] Copying 2 resources
[windows-jdk9] [INFO] Copying 3 resources
[windows-jdk9] [INFO]
[windows-jdk9] [INFO] --- maven-compiler-plugin:3.7.0:testCompile (default-testCompile) @ wagon-webdav-jackrabbit ---
[windows-jdk9] [INFO] Changes detected - recompiling the module!
[windows-jdk9] [INFO] Compiling 4 source files to F:\jenkins\jenkins-slave\workspace\n-box_maven-wagon_WAGON-527-KWYDRBGRPK7Q2YVCYHYJDNDOSEOHGQPJHV5AHJB4GNG66RKBHCBA\m\wagon-providers\wagon-webdav-jackrabbit\target\test-classes
[windows-jdk9] [INFO] /F:/jenkins/jenkins-slave/workspace/n-box_maven-wagon_WAGON-527-KWYDRBGRPK7Q2YVCYHYJDNDOSEOHGQPJHV5AHJB4GNG66RKBHCBA/m/wagon-providers/wagon-webdav-jackrabbit/src/test/java/org/apache/maven/wagon/providers/webdav/HttpClientWagonTest.java: F:\jenkins\jenkins-slave\workspace\n-box_maven-wagon_WAGON-527-KWYDRBGRPK7Q2YVCYHYJDNDOSEOHGQPJHV5AHJB4GNG66RKBHCBA\m\wagon-providers\wagon-webdav-jackrabbit\src\test\java\org\apache\maven\wagon\providers\webdav\HttpClientWagonTest.java uses or overrides a deprecated API.
[windows-jdk9] [INFO] /F:/jenkins/jenkins-slave/workspace/n-box_maven-wagon_WAGON-527-KWYDRBGRPK7Q2YVCYHYJDNDOSEOHGQPJHV5AHJB4GNG66RKBHCBA/m/wagon-providers/wagon-webdav-jackrabbit/src/test/java/org/apache/maven/wagon/providers/webdav/HttpClientWagonTest.java: Recompile with -Xlint:deprecation for details.
[windows-jdk9] [INFO]
[windows-jdk9] [INFO] --- maven-surefire-plugin:2.20:test (default-test) @ wagon-webdav-jackrabbit ---
[windows-jdk9] [INFO]
[windows-jdk9] [INFO] -------------------------------------------------------
[windows-jdk9] [INFO]  T E S T S
[windows-jdk9] [INFO] -------------------------------------------------------
[windows-jdk9] [INFO] Running org.apache.maven.wagon.providers.webdav.HttpClientWagonTest
[windows-jdk9] [INFO] Tests run: 6, Failures: 0, Errors: 0, Skipped: 0, Time elapsed: 1.128 s - in org.apache.maven.wagon.providers.webdav.HttpClientWagonTest
[windows-jdk9] [INFO] Running org.apache.maven.wagon.providers.webdav.PathNavigatorTest
[windows-jdk9] [INFO] Tests run: 1, Failures: 0, Errors: 0, Skipped: 0, Time elapsed: 0 s - in org.apache.maven.wagon.providers.webdav.PathNavigatorTest
[windows-jdk9] [INFO] Running org.apache.maven.wagon.providers.webdav.WebDavsWagonTest
[windows-jdk9] [INFO] Tests run: 69, Failures: 0, Errors: 0, Skipped: 0, Time elapsed: 34.104 s - in org.apache.maven.wagon.providers.webdav.WebDavsWagonTest
[windows-jdk9] [INFO] Running org.apache.maven.wagon.providers.webdav.WebDavWagonTest
[windows-jdk9] [INFO] Tests run: 69, Failures: 0, Errors: 0, Skipped: 0, Time elapsed: 27.164 s - in org.apache.maven.wagon.providers.webdav.WebDavWagonTest
[windows-jdk9] [INFO]
[windows-jdk9] [INFO] Results:
[windows-jdk9] [INFO]
[windows-jdk9] [INFO] Tests run: 145, Failures: 0, Errors: 0, Skipped: 0
[windows-jdk9] [INFO]
[windows-jdk9] [INFO]
[windows-jdk9] [INFO] --- maven-jar-plugin:3.0.2:jar (default-jar) @ wagon-webdav-jackrabbit ---
[windows-jdk9] [INFO] Building jar: F:\jenkins\jenkins-slave\workspace\n-box_maven-wagon_WAGON-527-KWYDRBGRPK7Q2YVCYHYJDNDOSEOHGQPJHV5AHJB4GNG66RKBHCBA\m\wagon-providers\wagon-webdav-jackrabbit\target\wagon-webdav-jackrabbit-3.1.1-SNAPSHOT.jar
[windows-jdk9] [INFO]
[windows-jdk9] [INFO] --- maven-site-plugin:3.7:attach-descriptor (attach-descriptor) @ wagon-webdav-jackrabbit ---
[windows-jdk9] [INFO] Skipping because packaging 'jar' is not pom.
[windows-jdk9] [INFO]
[windows-jdk9] [INFO] --- maven-checkstyle-plugin:3.0.0:check (checkstyle-check) @ wagon-webdav-jackrabbit ---
[windows-jdk9] [INFO] ------------------------------------------------------------------------
[windows-jdk9] [INFO] Reactor Summary:
[windows-jdk9] [INFO]
[windows-jdk9] [INFO] Apache Maven Wagon ................................. SUCCESS [ 53.439 s]
[windows-jdk9] [INFO] Apache Maven Wagon :: API .......................... SUCCESS [ 17.093 s]
[windows-jdk9] [INFO] Apache Maven Wagon :: Provider Test ................ SUCCESS [  5.770 s]
[windows-jdk9] [INFO] Apache Maven Wagon :: Providers .................... SUCCESS [  1.785 s]
[windows-jdk9] [INFO] Apache Maven Wagon :: Providers :: File Provider ... SUCCESS [  6.964 s]
[windows-jdk9] [INFO] Apache Maven Wagon :: Providers :: FTP Provider .... SUCCESS [ 11.280 s]
[windows-jdk9] [INFO] Apache Maven Wagon :: Providers :: HTTP Shared Library SUCCESS [  8.566 s]
[windows-jdk9] [INFO] Apache Maven Wagon :: Test Compatibility Kits ...... SUCCESS [  1.480 s]
[windows-jdk9] [INFO] Apache Maven Wagon :: HTTP Test Compatibility Kit .. SUCCESS [  4.161 s]
[windows-jdk9] [INFO] Apache Maven Wagon :: Providers :: HTTP Provider ... SUCCESS [05:20 min]
[windows-jdk9] [INFO] Apache Maven Wagon :: Providers :: Lightweight HTTP Provider SUCCESS [02:16 min]
[windows-jdk9] [INFO] Apache Maven Wagon :: Providers :: SCM Provider .... SUCCESS [ 44.715 s]
[windows-jdk9] [INFO] Apache Maven Wagon :: Providers :: SSH Common Library SUCCESS [  4.738 s]
[windows-jdk9] [INFO] Apache Maven Wagon :: Providers :: SSH Common Tests  SUCCESS [  4.023 s]
[windows-jdk9] [INFO] Apache Maven Wagon :: Providers :: SSH External Provider SUCCESS [  2.596 s]
[windows-jdk9] [INFO] Apache Maven Wagon :: Providers :: SSH Provider .... SUCCESS [  4.948 s]
[windows-jdk9] [INFO] Apache Maven Wagon :: Providers :: WebDAV Provider . SUCCESS [01:07 min]
[windows-jdk9] [INFO] ------------------------------------------------------------------------
[windows-jdk9] [INFO] BUILD SUCCESS
[windows-jdk9] [INFO] ------------------------------------------------------------------------
[windows-jdk9] [INFO] Total time: 11:38 min
[windows-jdk9] [INFO] Finished at: 2018-10-10T10:58:52-07:00
[windows-jdk9] [INFO] Final Memory: 45M/152M
[windows-jdk9] [INFO] ------------------------------------------------------------------------
[windows-jdk9] [WARNING] The requested profile "run-its" could not be activated because it does not exist.
[windows-jdk9] [INFO] [jenkins-event-spy] Generated F:\jenkins\jenkins-slave\workspace\n-box_maven-wagon_WAGON-527-KWYDRBGRPK7Q2YVCYHYJDNDOSEOHGQPJHV5AHJB4GNG66RKBHCBA@tmp\withMaven0ad7349d\maven-spy-20181010-104712-4169371401862058124397.log
[Pipeline] [windows-jdk9] }
[Pipeline] [windows-jdk9] // dir
[Pipeline] [windows-jdk9] }
[windows-jdk9] [withMaven] junitPublisher - Archive test results for Maven artifact org.apache.maven.wagon:wagon-provider-api:3.1.1-SNAPSHOT generated by maven-surefire-plugin:test (default-test): m\wagon-provider-api\target\surefire-reports\*.xml
[windows-jdk9] Recording test results
[windows-jdk9] [withMaven] junitPublisher - Archive test results for Maven artifact org.apache.maven.wagon:wagon-provider-test:3.1.1-SNAPSHOT generated by maven-surefire-plugin:test (default-test): m\wagon-provider-test\target\surefire-reports\*.xml
[windows-jdk9] Recording test results
[windows-jdk9] None of the test reports contained any result
[windows-jdk9] [withMaven] junitPublisher - Archive test results for Maven artifact org.apache.maven.wagon:wagon-file:3.1.1-SNAPSHOT generated by maven-surefire-plugin:test (default-test): m\wagon-providers\wagon-file\target\surefire-reports\*.xml
[windows-jdk9] Recording test results
[windows-jdk9] [withMaven] junitPublisher - Archive test results for Maven artifact org.apache.maven.wagon:wagon-ftp:3.1.1-SNAPSHOT generated by maven-surefire-plugin:test (default-test): m\wagon-providers\wagon-ftp\target\surefire-reports\*.xml
[windows-jdk9] Recording test results
[windows-jdk9] [withMaven] junitPublisher - Archive test results for Maven artifact org.apache.maven.wagon:wagon-http-shared:3.1.1-SNAPSHOT generated by maven-surefire-plugin:test (default-test): m\wagon-providers\wagon-http-shared\target\surefire-reports\*.xml
[windows-jdk9] Recording test results
[windows-jdk9] [withMaven] junitPublisher - Archive test results for Maven artifact org.apache.maven.wagon:wagon-tck-http:3.1.1-SNAPSHOT generated by maven-surefire-plugin:test (default-test): m\wagon-tcks\wagon-tck-http\target\surefire-reports\*.xml
[windows-jdk9] Recording test results
[windows-jdk9] None of the test reports contained any result
[windows-jdk9] [withMaven] junitPublisher - Archive test results for Maven artifact org.apache.maven.wagon:wagon-http:3.1.1-SNAPSHOT generated by maven-surefire-plugin:test (default-test): m\wagon-providers\wagon-http\target\surefire-reports\*.xml
[windows-jdk9] Recording test results
[windows-jdk9] [withMaven] junitPublisher - Archive test results for Maven artifact org.apache.maven.wagon:wagon-http-lightweight:3.1.1-SNAPSHOT generated by maven-surefire-plugin:test (default-test): m\wagon-providers\wagon-http-lightweight\target\surefire-reports\*.xml
[windows-jdk9] Recording test results
[windows-jdk9] [withMaven] junitPublisher - Archive test results for Maven artifact org.apache.maven.wagon:wagon-scm:3.1.1-SNAPSHOT generated by maven-surefire-plugin:test (default-test): m\wagon-providers\wagon-scm\target\surefire-reports\*.xml
[windows-jdk9] Recording test results
[windows-jdk9] [withMaven] junitPublisher - Archive test results for Maven artifact org.apache.maven.wagon:wagon-ssh-common:3.1.1-SNAPSHOT generated by maven-surefire-plugin:test (default-test): m\wagon-providers\wagon-ssh-common\target\surefire-reports\*.xml
[windows-jdk9] Recording test results
[windows-jdk9] [withMaven] junitPublisher - Archive test results for Maven artifact org.apache.maven.wagon:wagon-ssh-common-test:3.1.1-SNAPSHOT generated by maven-surefire-plugin:test (default-test): m\wagon-providers\wagon-ssh-common-test\target\surefire-reports\*.xml
[windows-jdk9] Recording test results
[windows-jdk9] None of the test reports contained any result
[windows-jdk9] [withMaven] junitPublisher - Archive test results for Maven artifact org.apache.maven.wagon:wagon-ssh-external:3.1.1-SNAPSHOT generated by maven-surefire-plugin:test (default-test): m\wagon-providers\wagon-ssh-external\target\surefire-reports\*.xml
[windows-jdk9] Recording test results
[windows-jdk9] None of the test reports contained any result
[windows-jdk9] [withMaven] junitPublisher - Archive test results for Maven artifact org.apache.maven.wagon:wagon-ssh:3.1.1-SNAPSHOT generated by maven-surefire-plugin:test (default-test): m\wagon-providers\wagon-ssh\target\surefire-reports\*.xml
[windows-jdk9] Recording test results
[windows-jdk9] None of the test reports contained any result
[windows-jdk9] [withMaven] junitPublisher - Archive test results for Maven artifact org.apache.maven.wagon:wagon-webdav-jackrabbit:3.1.1-SNAPSHOT generated by maven-surefire-plugin:test (default-test): m\wagon-providers\wagon-webdav-jackrabbit\target\surefire-reports\*.xml
[windows-jdk9] Recording test results
[Pipeline] [windows-jdk9] // withMaven
[Pipeline] [windows-jdk9] cleanWs
[windows-jdk9] [WS-CLEANUP] Deleting project workspace...[WS-CLEANUP] done
[Pipeline] [windows-jdk9] }
[Pipeline] [windows-jdk9] // stage
[Pipeline] [windows-jdk9] }
[Pipeline] [windows-jdk9] // node
[Pipeline] [windows-jdk9] }
[Pipeline] // parallel
[Pipeline] stage
[Pipeline] { (Notifications)
[Pipeline] echo
Build result: FAILURE
[Pipeline] jiraIssueSelector
[Pipeline] emailext