Build failed in Jenkins: Maven TLP » maven-wagon » WAGON-526 #3

classic Classic list List threaded Threaded
3 messages Options
Reply | Threaded
Open this post in threaded view
|

Build failed in Jenkins: Maven TLP » maven-wagon » WAGON-526 #3

Apache Jenkins Server-2
See https://builds.apache.org/job/maven-box/job/maven-wagon/job/WAGON-526/3/

No changes.

111 tests failed.
FAILED:  org.apache.maven.wagon.providers.ftp.FtpWagonTest.testDefaultUserName

Error Message:
Cannot login to remote system

Stack Trace:
org.apache.maven.wagon.ConnectionException: Cannot login to remote system
        at org.apache.maven.wagon.providers.ftp.FtpWagonTest.testDefaultUserName(FtpWagonTest.java:178)
Caused by: org.apache.commons.net.ftp.FTPConnectionClosedException: Connection closed without indication.
        at org.apache.maven.wagon.providers.ftp.FtpWagonTest.testDefaultUserName(FtpWagonTest.java:178)


FAILED:  org.apache.maven.wagon.providers.ftp.FtpWagonTest.testFailedGetToStream

Error Message:
Failed to bind to address 0.0.0.0/0.0.0.0:10023, check configuration

Stack Trace:
org.apache.ftpserver.FtpServerConfigurationException: Failed to bind to address 0.0.0.0/0.0.0.0:10023, check configuration
        at org.apache.maven.wagon.providers.ftp.FtpWagonTest.setupWagonTestingFixtures(FtpWagonTest.java:106)
Caused by: java.net.BindException: Address already in use: bind


FAILED:  org.apache.maven.wagon.providers.ftp.FtpWagonTest.testFailedGetIfNewerToStream

Error Message:
Could not connect to server.

Stack Trace:
org.apache.maven.wagon.authentication.AuthenticationException: Could not connect to server.
Caused by: java.net.ConnectException: Connection refused: connect


FAILED:  org.apache.maven.wagon.providers.ftp.FtpWagonTest.testWagonGetIfNewerToStreamIsNewer

Error Message:
Could not connect to server.

Stack Trace:
org.apache.maven.wagon.authentication.AuthenticationException: Could not connect to server.
Caused by: java.net.ConnectException: Connection refused: connect


FAILED:  org.apache.maven.wagon.providers.ftp.FtpWagonTest.testWagonGetIfNewerToStreamIsOlder

Error Message:
Could not connect to server.

Stack Trace:
org.apache.maven.wagon.authentication.AuthenticationException: Could not connect to server.
Caused by: java.net.ConnectException: Connection refused: connect


FAILED:  org.apache.maven.wagon.providers.ftp.FtpWagonTest.testStreamingWagon

Error Message:
Could not connect to server.

Stack Trace:
org.apache.maven.wagon.authentication.AuthenticationException: Could not connect to server.
Caused by: java.net.ConnectException: Connection refused: connect


FAILED:  org.apache.maven.wagon.providers.ftp.FtpWagonTest.testWagonGetIfNewerToStreamIsSame

Error Message:
Could not connect to server.

Stack Trace:
org.apache.maven.wagon.authentication.AuthenticationException: Could not connect to server.
Caused by: java.net.ConnectException: Connection refused: connect


FAILED:  org.apache.maven.wagon.providers.ftp.FtpWagonTest.testWagonPutDirectoryDeepDestination

Error Message:
Could not connect to server.

Stack Trace:
org.apache.maven.wagon.authentication.AuthenticationException: Could not connect to server.
Caused by: java.net.ConnectException: Connection refused: connect


FAILED:  org.apache.maven.wagon.providers.ftp.FtpWagonTest.testWagonGetFileListWhenDirectoryDoesNotExist

Error Message:
Could not connect to server.

Stack Trace:
org.apache.maven.wagon.authentication.AuthenticationException: Could not connect to server.
Caused by: java.net.ConnectException: Connection refused: connect


FAILED:  org.apache.maven.wagon.providers.ftp.FtpWagonTest.testWagon

Error Message:
Could not connect to server.

Stack Trace:
org.apache.maven.wagon.authentication.AuthenticationException: Could not connect to server.
Caused by: java.net.ConnectException: Connection refused: connect


FAILED:  org.apache.maven.wagon.providers.ftp.FtpWagonTest.testWagonPutDirectoryForDot

Error Message:
Could not connect to server.

Stack Trace:
org.apache.maven.wagon.authentication.AuthenticationException: Could not connect to server.
Caused by: java.net.ConnectException: Connection refused: connect


FAILED:  org.apache.maven.wagon.providers.ftp.FtpWagonTest.testWagonGetIfNewerIsNewer

Error Message:
Could not connect to server.

Stack Trace:
org.apache.maven.wagon.authentication.AuthenticationException: Could not connect to server.
Caused by: java.net.ConnectException: Connection refused: connect


FAILED:  org.apache.maven.wagon.providers.ftp.FtpWagonTest.testWagonGetIfNewerIsOlder

Error Message:
Could not connect to server.

Stack Trace:
org.apache.maven.wagon.authentication.AuthenticationException: Could not connect to server.
Caused by: java.net.ConnectException: Connection refused: connect


FAILED:  org.apache.maven.wagon.providers.ftp.FtpWagonTest.testWagonGetFileList

Error Message:
Could not connect to server.

Stack Trace:
org.apache.maven.wagon.authentication.AuthenticationException: Could not connect to server.
Caused by: java.net.ConnectException: Connection refused: connect


FAILED:  org.apache.maven.wagon.providers.ftp.FtpWagonTest.testFailedGet

Error Message:
Could not connect to server.

Stack Trace:
org.apache.maven.wagon.authentication.AuthenticationException: Could not connect to server.
Caused by: java.net.ConnectException: Connection refused: connect


FAILED:  org.apache.maven.wagon.providers.ftp.FtpWagonTest.testWagonPutDirectoryWhenDirectoryAlreadyExists

Error Message:
Could not connect to server.

Stack Trace:
org.apache.maven.wagon.authentication.AuthenticationException: Could not connect to server.
Caused by: java.net.ConnectException: Connection refused: connect


FAILED:  org.apache.maven.wagon.providers.ftp.FtpWagonTest.testWagonResourceExists

Error Message:
Could not connect to server.

Stack Trace:
org.apache.maven.wagon.authentication.AuthenticationException: Could not connect to server.
Caused by: java.net.ConnectException: Connection refused: connect


FAILED:  org.apache.maven.wagon.providers.ftp.FtpWagonTest.testFailedGetIfNewer

Error Message:
Could not connect to server.

Stack Trace:
org.apache.maven.wagon.authentication.AuthenticationException: Could not connect to server.
Caused by: java.net.ConnectException: Connection refused: connect


FAILED:  org.apache.maven.wagon.providers.ftp.FtpWagonTest.testWagonResourceNotExists

Error Message:
Could not connect to server.

Stack Trace:
org.apache.maven.wagon.authentication.AuthenticationException: Could not connect to server.
Caused by: java.net.ConnectException: Connection refused: connect


FAILED:  org.apache.maven.wagon.providers.ftp.FtpWagonTest.testWagonPutDirectory

Error Message:
Could not connect to server.

Stack Trace:
org.apache.maven.wagon.authentication.AuthenticationException: Could not connect to server.
Caused by: java.net.ConnectException: Connection refused: connect


FAILED:  org.apache.maven.wagon.providers.ftp.FtpWagonTest.testWagonGetIfNewerIsSame

Error Message:
Could not connect to server.

Stack Trace:
org.apache.maven.wagon.authentication.AuthenticationException: Could not connect to server.
Caused by: java.net.ConnectException: Connection refused: connect


FAILED:  org.apache.maven.wagon.providers.ftp.FtpWagonTest.testDefaultUserName

Error Message:
Cannot login to remote system

Stack Trace:
org.apache.maven.wagon.ConnectionException: Cannot login to remote system
        at org.apache.maven.wagon.providers.ftp.FtpWagonTest.testDefaultUserName(FtpWagonTest.java:178)
Caused by: org.apache.commons.net.ftp.FTPConnectionClosedException: Connection closed without indication.
        at org.apache.maven.wagon.providers.ftp.FtpWagonTest.testDefaultUserName(FtpWagonTest.java:178)


FAILED:  org.apache.maven.wagon.providers.ftp.FtpWagonTest.testWagonGetIfNewerToStreamIsOlder

Error Message:
Failed to bind to address 0.0.0.0/0.0.0.0:10023, check configuration

Stack Trace:
org.apache.ftpserver.FtpServerConfigurationException: Failed to bind to address 0.0.0.0/0.0.0.0:10023, check configuration
        at org.apache.maven.wagon.providers.ftp.FtpWagonTest.setupWagonTestingFixtures(FtpWagonTest.java:106)
Caused by: java.net.BindException: Address already in use: bind


FAILED:  org.apache.maven.wagon.providers.ftp.FtpWagonTest.testStreamingWagon

Error Message:

  Unexpected method call TransferListener.transferStarted(TransferEvent[GET|STARTED|Repository[ftp://localhost:10023]|null|test-resource[len = 18; mod = 1536773700000]]):
    TransferListener.transferStarted(TransferEvent[GET|STARTED|Repository[ftp://localhost:10023]|null|test-resource[len = 18; mod = 0]]): expected: 1, actual: 0
    TransferListener.transferCompleted(TransferEvent[GET|COMPLETED|Repository[ftp://localhost:10023]|F:\jenkins\jenkins-slave\workspace\n-box_maven-wagon_WAGON-526-MVYPB7RAMW5VZ4RA4NSMECE376IR6WO6PB7AIWCZTHT5KJGFZFHQ\m\wagon-providers\wagon-ftp\target\test-output\testStreamingWagon\testStreamingWagon|test-resource[len = 18; mod = 0]]): expected: 1, actual: 0

Stack Trace:
java.lang.AssertionError:

  Unexpected method call TransferListener.transferStarted(TransferEvent[GET|STARTED|Repository[ftp://localhost:10023]|null|test-resource[len = 18; mod = 1536773700000]]):
    TransferListener.transferStarted(TransferEvent[GET|STARTED|Repository[ftp://localhost:10023]|null|test-resource[len = 18; mod = 0]]): expected: 1, actual: 0
    TransferListener.transferCompleted(TransferEvent[GET|COMPLETED|Repository[ftp://localhost:10023]|F:\jenkins\jenkins-slave\workspace\n-box_maven-wagon_WAGON-526-MVYPB7RAMW5VZ4RA4NSMECE376IR6WO6PB7AIWCZTHT5KJGFZFHQ\m\wagon-providers\wagon-ftp\target\test-output\testStreamingWagon\testStreamingWagon|test-resource[len = 18; mod = 0]]): expected: 1, actual: 0


FAILED:  org.apache.maven.wagon.providers.ftp.FtpWagonTest.testWagonGetIfNewerToStreamIsSame

Error Message:

  Unexpected method call TransferListener.transferStarted(TransferEvent[GET|STARTED|Repository[ftp://localhost:10023]|null|test-resource[len = 18; mod = 1536773700000]]):

Stack Trace:
java.lang.AssertionError:

  Unexpected method call TransferListener.transferStarted(TransferEvent[GET|STARTED|Repository[ftp://localhost:10023]|null|test-resource[len = 18; mod = 1536773700000]]):


FAILED:  org.apache.maven.wagon.providers.ftp.FtpWagonTest.testWagonPutDirectoryDeepDestination

Error Message:
IOException caught while attempting to upload F:\jenkins\jenkins-slave\workspace\n-box_maven-wagon_WAGON-526-MVYPB7RAMW5VZ4RA4NSMECE376IR6WO6PB7AIWCZTHT5KJGFZFHQ\m\wagon-providers\wagon-ftp\target\test-output\deep0\deep1\deep2\a\b\test-resource-3.txt

Stack Trace:
org.apache.maven.wagon.TransferFailedException: IOException caught while attempting to upload F:\jenkins\jenkins-slave\workspace\n-box_maven-wagon_WAGON-526-MVYPB7RAMW5VZ4RA4NSMECE376IR6WO6PB7AIWCZTHT5KJGFZFHQ\m\wagon-providers\wagon-ftp\target\test-output\deep0\deep1\deep2\a\b\test-resource-3.txt
Caused by: org.apache.commons.net.ftp.FTPConnectionClosedException: Connection closed without indication.


FAILED:  org.apache.maven.wagon.providers.ftp.FtpWagonTest.testWagonGetFileListWhenDirectoryDoesNotExist

Error Message:
Could not connect to server.

Stack Trace:
org.apache.maven.wagon.authentication.AuthenticationException: Could not connect to server.
Caused by: java.net.ConnectException: Connection refused: connect


FAILED:  org.apache.maven.wagon.providers.ftp.FtpWagonTest.testWagon

Error Message:
Could not connect to server.

Stack Trace:
org.apache.maven.wagon.authentication.AuthenticationException: Could not connect to server.
Caused by: java.net.ConnectException: Connection refused: connect


FAILED:  org.apache.maven.wagon.providers.ftp.FtpWagonTest.testWagonPutDirectoryForDot

Error Message:
Could not connect to server.

Stack Trace:
org.apache.maven.wagon.authentication.AuthenticationException: Could not connect to server.
Caused by: java.net.ConnectException: Connection refused: connect


FAILED:  org.apache.maven.wagon.providers.ftp.FtpWagonTest.testWagonGetIfNewerIsNewer

Error Message:
Could not connect to server.

Stack Trace:
org.apache.maven.wagon.authentication.AuthenticationException: Could not connect to server.
Caused by: java.net.ConnectException: Connection refused: connect


FAILED:  org.apache.maven.wagon.providers.ftp.FtpWagonTest.testWagonGetIfNewerIsOlder

Error Message:
Could not connect to server.

Stack Trace:
org.apache.maven.wagon.authentication.AuthenticationException: Could not connect to server.
Caused by: java.net.ConnectException: Connection refused: connect


FAILED:  org.apache.maven.wagon.providers.ftp.FtpWagonTest.testWagonGetFileList

Error Message:
Could not connect to server.

Stack Trace:
org.apache.maven.wagon.authentication.AuthenticationException: Could not connect to server.
Caused by: java.net.ConnectException: Connection refused: connect


FAILED:  org.apache.maven.wagon.providers.ftp.FtpWagonTest.testFailedGet

Error Message:
Could not connect to server.

Stack Trace:
org.apache.maven.wagon.authentication.AuthenticationException: Could not connect to server.
Caused by: java.net.ConnectException: Connection refused: connect


FAILED:  org.apache.maven.wagon.providers.ftp.FtpWagonTest.testWagonPutDirectoryWhenDirectoryAlreadyExists

Error Message:
Could not connect to server.

Stack Trace:
org.apache.maven.wagon.authentication.AuthenticationException: Could not connect to server.
Caused by: java.net.ConnectException: Connection refused: connect


FAILED:  org.apache.maven.wagon.providers.ftp.FtpWagonTest.testWagonResourceExists

Error Message:
Could not connect to server.

Stack Trace:
org.apache.maven.wagon.authentication.AuthenticationException: Could not connect to server.
Caused by: java.net.ConnectException: Connection refused: connect


FAILED:  org.apache.maven.wagon.providers.ftp.FtpWagonTest.testFailedGetIfNewer

Error Message:
Could not connect to server.

Stack Trace:
org.apache.maven.wagon.authentication.AuthenticationException: Could not connect to server.
Caused by: java.net.ConnectException: Connection refused: connect


FAILED:  org.apache.maven.wagon.providers.ftp.FtpWagonTest.testWagonResourceNotExists

Error Message:
Could not connect to server.

Stack Trace:
org.apache.maven.wagon.authentication.AuthenticationException: Could not connect to server.
Caused by: java.net.ConnectException: Connection refused: connect


FAILED:  org.apache.maven.wagon.providers.ftp.FtpWagonTest.testWagonPutDirectory

Error Message:
Could not connect to server.

Stack Trace:
org.apache.maven.wagon.authentication.AuthenticationException: Could not connect to server.
Caused by: java.net.ConnectException: Connection refused: connect


FAILED:  org.apache.maven.wagon.providers.ftp.FtpWagonTest.testWagonGetIfNewerIsSame

Error Message:
Could not connect to server.

Stack Trace:
org.apache.maven.wagon.authentication.AuthenticationException: Could not connect to server.
Caused by: java.net.ConnectException: Connection refused: connect


FAILED:  org.apache.maven.wagon.providers.ftp.FtpWagonTest.testPutDirectoryCreation

Error Message:
Failed to bind to address 0.0.0.0/0.0.0.0:10023, check configuration

Stack Trace:
org.apache.ftpserver.FtpServerConfigurationException: Failed to bind to address 0.0.0.0/0.0.0.0:10023, check configuration
        at org.apache.maven.wagon.providers.ftp.FtpWagonTest.setupWagonTestingFixtures(FtpWagonTest.java:106)
        at org.apache.maven.wagon.providers.ftp.FtpWagonTest.testPutDirectoryCreation(FtpWagonTest.java:195)
Caused by: java.net.BindException: Address already in use


FAILED:  org.apache.maven.wagon.providers.ftp.FtpWagonTest.testDefaultUserName

Error Message:
Cannot login to remote system

Stack Trace:
org.apache.maven.wagon.ConnectionException: Cannot login to remote system
        at org.apache.maven.wagon.providers.ftp.FtpWagonTest.testDefaultUserName(FtpWagonTest.java:178)
Caused by: org.apache.commons.net.ftp.FTPConnectionClosedException: Connection closed without indication.
        at org.apache.maven.wagon.providers.ftp.FtpWagonTest.testDefaultUserName(FtpWagonTest.java:178)


FAILED:  org.apache.maven.wagon.providers.ftp.FtpWagonTest.testFailedGetToStream

Error Message:
Could not connect to server.

Stack Trace:
org.apache.maven.wagon.authentication.AuthenticationException: Could not connect to server.
Caused by: java.net.ConnectException: Connection refused (Connection refused)


FAILED:  org.apache.maven.wagon.providers.ftp.FtpWagonTest.testFailedGetIfNewerToStream

Error Message:
Could not connect to server.

Stack Trace:
org.apache.maven.wagon.authentication.AuthenticationException: Could not connect to server.
Caused by: java.net.ConnectException: Connection refused (Connection refused)


FAILED:  org.apache.maven.wagon.providers.ftp.FtpWagonTest.testWagonGetIfNewerToStreamIsNewer

Error Message:
Could not connect to server.

Stack Trace:
org.apache.maven.wagon.authentication.AuthenticationException: Could not connect to server.
Caused by: java.net.ConnectException: Connection refused (Connection refused)


FAILED:  org.apache.maven.wagon.providers.ftp.FtpWagonTest.testWagonGetIfNewerToStreamIsOlder

Error Message:
Could not connect to server.

Stack Trace:
org.apache.maven.wagon.authentication.AuthenticationException: Could not connect to server.
Caused by: java.net.ConnectException: Connection refused (Connection refused)


FAILED:  org.apache.maven.wagon.providers.ftp.FtpWagonTest.testStreamingWagon

Error Message:
Could not connect to server.

Stack Trace:
org.apache.maven.wagon.authentication.AuthenticationException: Could not connect to server.
Caused by: java.net.ConnectException: Connection refused (Connection refused)


FAILED:  org.apache.maven.wagon.providers.ftp.FtpWagonTest.testWagonGetIfNewerToStreamIsSame

Error Message:

  Unexpected method call TransferListener.transferError(TransferEvent[GET|ERROR|Repository[ftp://localhost:10023]|null|test-resource[len = 18; mod = 1536773640000]]):

Stack Trace:
java.lang.AssertionError:

  Unexpected method call TransferListener.transferError(TransferEvent[GET|ERROR|Repository[ftp://localhost:10023]|null|test-resource[len = 18; mod = 1536773640000]]):


FAILED:  org.apache.maven.wagon.providers.ftp.FtpWagonTest.testWagonPutDirectoryDeepDestination

Error Message:
Could not connect to server.

Stack Trace:
org.apache.maven.wagon.authentication.AuthenticationException: Could not connect to server.
Caused by: java.net.ConnectException: Connection refused (Connection refused)


FAILED:  org.apache.maven.wagon.providers.ftp.FtpWagonTest.testWagonGetFileListWhenDirectoryDoesNotExist

Error Message:
Could not connect to server.

Stack Trace:
org.apache.maven.wagon.authentication.AuthenticationException: Could not connect to server.
Caused by: java.net.ConnectException: Connection refused (Connection refused)


FAILED:  org.apache.maven.wagon.providers.ftp.FtpWagonTest.testWagon

Error Message:
Could not connect to server.

Stack Trace:
org.apache.maven.wagon.authentication.AuthenticationException: Could not connect to server.
Caused by: java.net.ConnectException: Connection refused (Connection refused)


FAILED:  org.apache.maven.wagon.providers.ftp.FtpWagonTest.testWagonPutDirectoryForDot

Error Message:
Could not connect to server.

Stack Trace:
org.apache.maven.wagon.authentication.AuthenticationException: Could not connect to server.
Caused by: java.net.ConnectException: Connection refused (Connection refused)


FAILED:  org.apache.maven.wagon.providers.ftp.FtpWagonTest.testWagonGetIfNewerIsNewer

Error Message:
Could not connect to server.

Stack Trace:
org.apache.maven.wagon.authentication.AuthenticationException: Could not connect to server.
Caused by: java.net.ConnectException: Connection refused (Connection refused)


FAILED:  org.apache.maven.wagon.providers.ftp.FtpWagonTest.testWagonGetIfNewerIsOlder

Error Message:
Could not connect to server.

Stack Trace:
org.apache.maven.wagon.authentication.AuthenticationException: Could not connect to server.
Caused by: java.net.ConnectException: Connection refused (Connection refused)


FAILED:  org.apache.maven.wagon.providers.ftp.FtpWagonTest.testWagonGetFileList

Error Message:
Could not connect to server.

Stack Trace:
org.apache.maven.wagon.authentication.AuthenticationException: Could not connect to server.
Caused by: java.net.ConnectException: Connection refused (Connection refused)


FAILED:  org.apache.maven.wagon.providers.ftp.FtpWagonTest.testFailedGet

Error Message:
Could not connect to server.

Stack Trace:
org.apache.maven.wagon.authentication.AuthenticationException: Could not connect to server.
Caused by: java.net.ConnectException: Connection refused (Connection refused)


FAILED:  org.apache.maven.wagon.providers.ftp.FtpWagonTest.testWagonPutDirectoryWhenDirectoryAlreadyExists

Error Message:
Could not connect to server.

Stack Trace:
org.apache.maven.wagon.authentication.AuthenticationException: Could not connect to server.
Caused by: java.net.ConnectException: Connection refused (Connection refused)


FAILED:  org.apache.maven.wagon.providers.ftp.FtpWagonTest.testWagonResourceExists

Error Message:
Could not connect to server.

Stack Trace:
org.apache.maven.wagon.authentication.AuthenticationException: Could not connect to server.
Caused by: java.net.ConnectException: Connection refused (Connection refused)


FAILED:  org.apache.maven.wagon.providers.ftp.FtpWagonTest.testFailedGetIfNewer

Error Message:
Could not connect to server.

Stack Trace:
org.apache.maven.wagon.authentication.AuthenticationException: Could not connect to server.
Caused by: java.net.ConnectException: Connection refused (Connection refused)


FAILED:  org.apache.maven.wagon.providers.ftp.FtpWagonTest.testWagonResourceNotExists

Error Message:
Could not connect to server.

Stack Trace:
org.apache.maven.wagon.authentication.AuthenticationException: Could not connect to server.
Caused by: java.net.ConnectException: Connection refused (Connection refused)


FAILED:  org.apache.maven.wagon.providers.ftp.FtpWagonTest.testWagonPutDirectory

Error Message:
Could not connect to server.

Stack Trace:
org.apache.maven.wagon.authentication.AuthenticationException: Could not connect to server.
Caused by: java.net.ConnectException: Connection refused (Connection refused)


FAILED:  org.apache.maven.wagon.providers.ftp.FtpWagonTest.testWagonGetIfNewerIsSame

Error Message:
Could not connect to server.

Stack Trace:
org.apache.maven.wagon.authentication.AuthenticationException: Could not connect to server.
Caused by: java.net.ConnectException: Connection refused (Connection refused)


FAILED:  org.apache.maven.wagon.providers.http.HttpWagonTimeoutTest.testPutTimeout

Error Message:
Address already in use: bind

Stack Trace:
java.net.BindException: Address already in use: bind
        at org.apache.maven.wagon.providers.http.HttpWagonTimeoutTest.setUp(HttpWagonTimeoutTest.java:45)


FAILED:  org.apache.maven.wagon.providers.http.HttpWagonTimeoutTest.testResourceExits

Error Message:
Address already in use: bind

Stack Trace:
java.net.BindException: Address already in use: bind
        at org.apache.maven.wagon.providers.http.HttpWagonTimeoutTest.setUp(HttpWagonTimeoutTest.java:45)


FAILED:  org.apache.maven.wagon.providers.http.HttpWagonTimeoutTest.testGetTimeout

Error Message:
Address already in use: bind

Stack Trace:
java.net.BindException: Address already in use: bind
        at org.apache.maven.wagon.providers.http.HttpWagonTimeoutTest.setUp(HttpWagonTimeoutTest.java:45)


FAILED:  org.apache.maven.wagon.providers.http.HttpWagonTimeoutTest.testConnectionTimeout

Error Message:
Address already in use: bind

Stack Trace:
java.net.BindException: Address already in use: bind
        at org.apache.maven.wagon.providers.http.HttpWagonTimeoutTest.setUp(HttpWagonTimeoutTest.java:45)


FAILED:  org.apache.maven.wagon.providers.http.HttpWagonTimeoutTest.testGetFileList

Error Message:
Address already in use: bind

Stack Trace:
java.net.BindException: Address already in use: bind
        at org.apache.maven.wagon.providers.http.HttpWagonTimeoutTest.setUp(HttpWagonTimeoutTest.java:45)


FAILED:  org.apache.maven.wagon.providers.http.HttpWagonTimeoutTest.testGetTimeout

Error Message:
Address already in use

Stack Trace:
java.net.BindException: Address already in use
        at org.apache.maven.wagon.providers.http.HttpWagonTimeoutTest.setUp(HttpWagonTimeoutTest.java:45)


FAILED:  org.apache.maven.wagon.providers.http.HttpWagonTimeoutTest.testConnectionTimeout

Error Message:
Address already in use

Stack Trace:
java.net.BindException: Address already in use
        at org.apache.maven.wagon.providers.http.HttpWagonTimeoutTest.setUp(HttpWagonTimeoutTest.java:45)


FAILED:  org.apache.maven.wagon.providers.http.HttpWagonTimeoutTest.testGetFileList

Error Message:
Address already in use

Stack Trace:
java.net.BindException: Address already in use
        at org.apache.maven.wagon.providers.http.HttpWagonTimeoutTest.setUp(HttpWagonTimeoutTest.java:45)


FAILED:  org.apache.maven.wagon.providers.scm.ScmSvnExeWagonTest.testWagonPutDirectory

Error Message:
Error checking out: command failed: svn: E170013: Unable to connect to a repository at URL 'file://2/m/wagon-providers/wagon-scm/target/test-classes/test-repo-svn-test'
svn: E170000: Local URL 'file://2/m/wagon-providers/wagon-scm/target/test-classes/test-repo-svn-test' contains unsupported hostname

Stack Trace:
org.apache.maven.wagon.TransferFailedException:
Error checking out: command failed: svn: E170013: Unable to connect to a repository at URL 'file://2/m/wagon-providers/wagon-scm/target/test-classes/test-repo-svn-test'
svn: E170000: Local URL 'file://2/m/wagon-providers/wagon-scm/target/test-classes/test-repo-svn-test' contains unsupported hostname
Caused by: org.apache.maven.scm.ScmException:
command failed: svn: E170013: Unable to connect to a repository at URL 'file://2/m/wagon-providers/wagon-scm/target/test-classes/test-repo-svn-test'
svn: E170000: Local URL 'file://2/m/wagon-providers/wagon-scm/target/test-classes/test-repo-svn-test' contains unsupported hostname


FAILED:  org.apache.maven.wagon.providers.scm.ScmSvnExeWagonTest.testWagonPutDirectoryDeepDestination

Error Message:
Error checking out: command failed: svn: E170013: Unable to connect to a repository at URL 'file://2/m/wagon-providers/wagon-scm/target/test-classes/test-repo-svn-test'
svn: E170000: Local URL 'file://2/m/wagon-providers/wagon-scm/target/test-classes/test-repo-svn-test' contains unsupported hostname

Stack Trace:
org.apache.maven.wagon.TransferFailedException:
Error checking out: command failed: svn: E170013: Unable to connect to a repository at URL 'file://2/m/wagon-providers/wagon-scm/target/test-classes/test-repo-svn-test'
svn: E170000: Local URL 'file://2/m/wagon-providers/wagon-scm/target/test-classes/test-repo-svn-test' contains unsupported hostname
Caused by: org.apache.maven.scm.ScmException:
command failed: svn: E170013: Unable to connect to a repository at URL 'file://2/m/wagon-providers/wagon-scm/target/test-classes/test-repo-svn-test'
svn: E170000: Local URL 'file://2/m/wagon-providers/wagon-scm/target/test-classes/test-repo-svn-test' contains unsupported hostname


FAILED:  org.apache.maven.wagon.providers.scm.ScmSvnExeWagonTest.testWagon

Error Message:

  Unexpected method call TransferListener.transferError(TransferEvent[GET|ERROR|Repository[scm:svn:file://2/m/wagon-providers/wagon-scm/target/test-classes/test-repo-svn-test]|null|test-resource[len = 18; mod = 1536774204000]]):
    TransferListener.transferCompleted(TransferEvent[PUT|COMPLETED|Repository[scm:svn:file://2/m/wagon-providers/wagon-scm/target/test-classes/test-repo-svn-test]|/home/jenkins/jenkins-slave/workspace/n-box_maven-wagon_WAGON-526-MVYPB7RAMW5VZ4RA4NSMECE376IR6WO6PB7AIWCZTHT5KJGFZFHQ@2/m/wagon-providers/wagon-scm/target/test-output/test-resource|test-resource[len = 18; mod = 1536774204000]]): expected: 1, actual: 0

Stack Trace:
java.lang.AssertionError:

  Unexpected method call TransferListener.transferError(TransferEvent[GET|ERROR|Repository[scm:svn:file://2/m/wagon-providers/wagon-scm/target/test-classes/test-repo-svn-test]|null|test-resource[len = 18; mod = 1536774204000]]):
    TransferListener.transferCompleted(TransferEvent[PUT|COMPLETED|Repository[scm:svn:file://2/m/wagon-providers/wagon-scm/target/test-classes/test-repo-svn-test]|/home/jenkins/jenkins-slave/workspace/n-box_maven-wagon_WAGON-526-MVYPB7RAMW5VZ4RA4NSMECE376IR6WO6PB7AIWCZTHT5KJGFZFHQ@2/m/wagon-providers/wagon-scm/target/test-output/test-resource|test-resource[len = 18; mod = 1536774204000]]): expected: 1, actual: 0


FAILED:  org.apache.maven.wagon.providers.scm.ScmSvnExeWagonTest.testWagonPutDirectoryForDot

Error Message:
Error checking out: command failed: svn: E170013: Unable to connect to a repository at URL 'file://2/m/wagon-providers/wagon-scm/target/test-classes/test-repo-svn-test'
svn: E170000: Local URL 'file://2/m/wagon-providers/wagon-scm/target/test-classes/test-repo-svn-test' contains unsupported hostname

Stack Trace:
org.apache.maven.wagon.TransferFailedException:
Error checking out: command failed: svn: E170013: Unable to connect to a repository at URL 'file://2/m/wagon-providers/wagon-scm/target/test-classes/test-repo-svn-test'
svn: E170000: Local URL 'file://2/m/wagon-providers/wagon-scm/target/test-classes/test-repo-svn-test' contains unsupported hostname
Caused by: org.apache.maven.scm.ScmException:
command failed: svn: E170013: Unable to connect to a repository at URL 'file://2/m/wagon-providers/wagon-scm/target/test-classes/test-repo-svn-test'
svn: E170000: Local URL 'file://2/m/wagon-providers/wagon-scm/target/test-classes/test-repo-svn-test' contains unsupported hostname


FAILED:  org.apache.maven.wagon.providers.scm.ScmSvnExeWagonTest.testWagonGetFileList

Error Message:

  Unexpected method call TransferListener.transferError(TransferEvent[GET|ERROR|Repository[scm:svn:file://2/m/wagon-providers/wagon-scm/target/test-classes/test-repo-svn-test]|null|file-list/test-resource.txt[len = 18; mod = 1536774204000]]):
    TransferListener.transferCompleted(TransferEvent[PUT|COMPLETED|Repository[scm:svn:file://2/m/wagon-providers/wagon-scm/target/test-classes/test-repo-svn-test]|/home/jenkins/jenkins-slave/workspace/n-box_maven-wagon_WAGON-526-MVYPB7RAMW5VZ4RA4NSMECE376IR6WO6PB7AIWCZTHT5KJGFZFHQ@2/m/wagon-providers/wagon-scm/target/test-output/file-list/test-resource.txt|file-list/test-resource.txt[len = 18; mod = 1536774204000]]): expected: 1, actual: 0

Stack Trace:
java.lang.AssertionError:

  Unexpected method call TransferListener.transferError(TransferEvent[GET|ERROR|Repository[scm:svn:file://2/m/wagon-providers/wagon-scm/target/test-classes/test-repo-svn-test]|null|file-list/test-resource.txt[len = 18; mod = 1536774204000]]):
    TransferListener.transferCompleted(TransferEvent[PUT|COMPLETED|Repository[scm:svn:file://2/m/wagon-providers/wagon-scm/target/test-classes/test-repo-svn-test]|/home/jenkins/jenkins-slave/workspace/n-box_maven-wagon_WAGON-526-MVYPB7RAMW5VZ4RA4NSMECE376IR6WO6PB7AIWCZTHT5KJGFZFHQ@2/m/wagon-providers/wagon-scm/target/test-output/file-list/test-resource.txt|file-list/test-resource.txt[len = 18; mod = 1536774204000]]): expected: 1, actual: 0


FAILED:  org.apache.maven.wagon.providers.scm.ScmSvnExeWagonTest.testFailedGet

Error Message:
Error getting file from SCM

Stack Trace:
org.apache.maven.wagon.TransferFailedException: Error getting file from SCM
Caused by: org.apache.maven.scm.ScmException:
command failed: svn: E170013: Unable to connect to a repository at URL 'file://2/m/wagon-providers/wagon-scm/target/test-classes/test-repo-svn-test'
svn: E170000: Local URL 'file://2/m/wagon-providers/wagon-scm/target/test-classes/test-repo-svn-test' contains unsupported hostname


FAILED:  org.apache.maven.wagon.providers.scm.ScmSvnExeWagonTest.testWagonPutDirectoryWhenDirectoryAlreadyExists

Error Message:
Error checking out: command failed: svn: E170013: Unable to connect to a repository at URL 'file://2/m/wagon-providers/wagon-scm/target/test-classes/test-repo-svn-test'
svn: E170000: Local URL 'file://2/m/wagon-providers/wagon-scm/target/test-classes/test-repo-svn-test' contains unsupported hostname

Stack Trace:
org.apache.maven.wagon.TransferFailedException:
Error checking out: command failed: svn: E170013: Unable to connect to a repository at URL 'file://2/m/wagon-providers/wagon-scm/target/test-classes/test-repo-svn-test'
svn: E170000: Local URL 'file://2/m/wagon-providers/wagon-scm/target/test-classes/test-repo-svn-test' contains unsupported hostname
Caused by: org.apache.maven.scm.ScmException:
command failed: svn: E170013: Unable to connect to a repository at URL 'file://2/m/wagon-providers/wagon-scm/target/test-classes/test-repo-svn-test'
svn: E170000: Local URL 'file://2/m/wagon-providers/wagon-scm/target/test-classes/test-repo-svn-test' contains unsupported hostname


FAILED:  org.apache.maven.wagon.providers.scm.ScmSvnExeWagonTest.testWagonResourceExists

Error Message:

  Unexpected method call TransferListener.transferError(TransferEvent[GET|ERROR|Repository[scm:svn:file://2/m/wagon-providers/wagon-scm/target/test-classes/test-repo-svn-test]|null|test-resource[len = 18; mod = 1536774204000]]):
    TransferListener.transferCompleted(TransferEvent[PUT|COMPLETED|Repository[scm:svn:file://2/m/wagon-providers/wagon-scm/target/test-classes/test-repo-svn-test]|/home/jenkins/jenkins-slave/workspace/n-box_maven-wagon_WAGON-526-MVYPB7RAMW5VZ4RA4NSMECE376IR6WO6PB7AIWCZTHT5KJGFZFHQ@2/m/wagon-providers/wagon-scm/target/test-output/test-resource|test-resource[len = 18; mod = 1536774204000]]): expected: 1, actual: 0

Stack Trace:
java.lang.AssertionError:

  Unexpected method call TransferListener.transferError(TransferEvent[GET|ERROR|Repository[scm:svn:file://2/m/wagon-providers/wagon-scm/target/test-classes/test-repo-svn-test]|null|test-resource[len = 18; mod = 1536774204000]]):
    TransferListener.transferCompleted(TransferEvent[PUT|COMPLETED|Repository[scm:svn:file://2/m/wagon-providers/wagon-scm/target/test-classes/test-repo-svn-test]|/home/jenkins/jenkins-slave/workspace/n-box_maven-wagon_WAGON-526-MVYPB7RAMW5VZ4RA4NSMECE376IR6WO6PB7AIWCZTHT5KJGFZFHQ@2/m/wagon-providers/wagon-scm/target/test-output/test-resource|test-resource[len = 18; mod = 1536774204000]]): expected: 1, actual: 0


FAILED:  org.apache.maven.wagon.providers.scm.ScmGitExeWagonTest.testWagonPutDirectory

Error Message:
Error checking out: command failed: 'git' is not recognized as an internal or external command,
operable program or batch file.

Stack Trace:
org.apache.maven.wagon.TransferFailedException:
Error checking out: command failed: 'git' is not recognized as an internal or external command,
operable program or batch file.
Caused by: org.apache.maven.scm.ScmException:
command failed: 'git' is not recognized as an internal or external command,
operable program or batch file.


FAILED:  org.apache.maven.wagon.providers.scm.ScmGitExeWagonTest.testWagonPutDirectoryDeepDestination

Error Message:
Error checking out: command failed: 'git' is not recognized as an internal or external command,
operable program or batch file.

Stack Trace:
org.apache.maven.wagon.TransferFailedException:
Error checking out: command failed: 'git' is not recognized as an internal or external command,
operable program or batch file.
Caused by: org.apache.maven.scm.ScmException:
command failed: 'git' is not recognized as an internal or external command,
operable program or batch file.


FAILED:  org.apache.maven.wagon.providers.scm.ScmGitExeWagonTest.testWagon

Error Message:

  Unexpected method call TransferListener.transferError(TransferEvent[GET|ERROR|Repository[scm:git:file:///F:/jenkins/jenkins-slave/workspace/n-box_maven-wagon_WAGON-526-MVYPB7RAMW5VZ4RA4NSMECE376IR6WO6PB7AIWCZTHT5KJGFZFHQ/m/wagon-providers/wagon-scm/target/test-classes/test-repo-git-test/]|null|test-resource[len = 18; mod = 1536774132862]]):
    TransferListener.transferCompleted(TransferEvent[PUT|COMPLETED|Repository[scm:git:file:///F:/jenkins/jenkins-slave/workspace/n-box_maven-wagon_WAGON-526-MVYPB7RAMW5VZ4RA4NSMECE376IR6WO6PB7AIWCZTHT5KJGFZFHQ/m/wagon-providers/wagon-scm/target/test-classes/test-repo-git-test/]|F:\jenkins\jenkins-slave\workspace\n-box_maven-wagon_WAGON-526-MVYPB7RAMW5VZ4RA4NSMECE376IR6WO6PB7AIWCZTHT5KJGFZFHQ\m\wagon-providers\wagon-scm\target\test-output\test-resource|test-resource[len = 18; mod = 1536774132862]]): expected: 1, actual: 0

Stack Trace:
java.lang.AssertionError:

  Unexpected method call TransferListener.transferError(TransferEvent[GET|ERROR|Repository[scm:git:file:///F:/jenkins/jenkins-slave/workspace/n-box_maven-wagon_WAGON-526-MVYPB7RAMW5VZ4RA4NSMECE376IR6WO6PB7AIWCZTHT5KJGFZFHQ/m/wagon-providers/wagon-scm/target/test-classes/test-repo-git-test/]|null|test-resource[len = 18; mod = 1536774132862]]):
    TransferListener.transferCompleted(TransferEvent[PUT|COMPLETED|Repository[scm:git:file:///F:/jenkins/jenkins-slave/workspace/n-box_maven-wagon_WAGON-526-MVYPB7RAMW5VZ4RA4NSMECE376IR6WO6PB7AIWCZTHT5KJGFZFHQ/m/wagon-providers/wagon-scm/target/test-classes/test-repo-git-test/]|F:\jenkins\jenkins-slave\workspace\n-box_maven-wagon_WAGON-526-MVYPB7RAMW5VZ4RA4NSMECE376IR6WO6PB7AIWCZTHT5KJGFZFHQ\m\wagon-providers\wagon-scm\target\test-output\test-resource|test-resource[len = 18; mod = 1536774132862]]): expected: 1, actual: 0


FAILED:  org.apache.maven.wagon.providers.scm.ScmGitExeWagonTest.testWagonPutDirectoryForDot

Error Message:
Error checking out: command failed: 'git' is not recognized as an internal or external command,
operable program or batch file.

Stack Trace:
org.apache.maven.wagon.TransferFailedException:
Error checking out: command failed: 'git' is not recognized as an internal or external command,
operable program or batch file.
Caused by: org.apache.maven.scm.ScmException:
command failed: 'git' is not recognized as an internal or external command,
operable program or batch file.


FAILED:  org.apache.maven.wagon.providers.scm.ScmGitExeWagonTest.testFailedGet

Error Message:
Error getting file from SCM

Stack Trace:
org.apache.maven.wagon.TransferFailedException: Error getting file from SCM
Caused by: org.apache.maven.scm.ScmException:
command failed: 'git' is not recognized as an internal or external command,
operable program or batch file.


FAILED:  org.apache.maven.wagon.providers.scm.ScmGitExeWagonTest.testWagonPutDirectoryWhenDirectoryAlreadyExists

Error Message:
Error checking out: command failed: 'git' is not recognized as an internal or external command,
operable program or batch file.

Stack Trace:
org.apache.maven.wagon.TransferFailedException:
Error checking out: command failed: 'git' is not recognized as an internal or external command,
operable program or batch file.
Caused by: org.apache.maven.scm.ScmException:
command failed: 'git' is not recognized as an internal or external command,
operable program or batch file.


FAILED:  org.apache.maven.wagon.providers.scm.ScmGitExeWagonTest.testWagonPutDirectory

Error Message:
Error checking out: command failed: Cloning into '/home/jenkins/jenkins-slave/workspace/n-box_maven-wagon_WAGON-526-MVYPB7RAMW5VZ4RA4NSMECE376IR6WO6PB7AIWCZTHT5KJGFZFHQ@2/m/wagon-providers/wagon-scm/target/test-output/checkout-org.apache.maven.scm.provider.git.gitexe.GitExeScmProvider'...
fatal: '/m/wagon-providers/wagon-scm/target/test-classes/test-repo-git-test/' does not appear to be a git repository
fatal: Could not read from remote repository.

Please make sure you have the correct access rights
and the repository exists.

Stack Trace:
org.apache.maven.wagon.TransferFailedException:
Error checking out: command failed: Cloning into '/home/jenkins/jenkins-slave/workspace/n-box_maven-wagon_WAGON-526-MVYPB7RAMW5VZ4RA4NSMECE376IR6WO6PB7AIWCZTHT5KJGFZFHQ@2/m/wagon-providers/wagon-scm/target/test-output/checkout-org.apache.maven.scm.provider.git.gitexe.GitExeScmProvider'...
fatal: '/m/wagon-providers/wagon-scm/target/test-classes/test-repo-git-test/' does not appear to be a git repository
fatal: Could not read from remote repository.

Please make sure you have the correct access rights
and the repository exists.
Caused by: org.apache.maven.scm.ScmException:
command failed: Cloning into '/home/jenkins/jenkins-slave/workspace/n-box_maven-wagon_WAGON-526-MVYPB7RAMW5VZ4RA4NSMECE376IR6WO6PB7AIWCZTHT5KJGFZFHQ@2/m/wagon-providers/wagon-scm/target/test-output/checkout-org.apache.maven.scm.provider.git.gitexe.GitExeScmProvider'...
fatal: '/m/wagon-providers/wagon-scm/target/test-classes/test-repo-git-test/' does not appear to be a git repository
fatal: Could not read from remote repository.

Please make sure you have the correct access rights
and the repository exists.


FAILED:  org.apache.maven.wagon.providers.scm.ScmGitExeWagonTest.testWagonPutDirectoryDeepDestination

Error Message:
Error checking out: command failed: Cloning into '/home/jenkins/jenkins-slave/workspace/n-box_maven-wagon_WAGON-526-MVYPB7RAMW5VZ4RA4NSMECE376IR6WO6PB7AIWCZTHT5KJGFZFHQ@2/m/wagon-providers/wagon-scm/target/test-output/checkout-org.apache.maven.scm.provider.git.gitexe.GitExeScmProvider'...
fatal: '/m/wagon-providers/wagon-scm/target/test-classes/test-repo-git-test/' does not appear to be a git repository
fatal: Could not read from remote repository.

Please make sure you have the correct access rights
and the repository exists.

Stack Trace:
org.apache.maven.wagon.TransferFailedException:
Error checking out: command failed: Cloning into '/home/jenkins/jenkins-slave/workspace/n-box_maven-wagon_WAGON-526-MVYPB7RAMW5VZ4RA4NSMECE376IR6WO6PB7AIWCZTHT5KJGFZFHQ@2/m/wagon-providers/wagon-scm/target/test-output/checkout-org.apache.maven.scm.provider.git.gitexe.GitExeScmProvider'...
fatal: '/m/wagon-providers/wagon-scm/target/test-classes/test-repo-git-test/' does not appear to be a git repository
fatal: Could not read from remote repository.

Please make sure you have the correct access rights
and the repository exists.
Caused by: org.apache.maven.scm.ScmException:
command failed: Cloning into '/home/jenkins/jenkins-slave/workspace/n-box_maven-wagon_WAGON-526-MVYPB7RAMW5VZ4RA4NSMECE376IR6WO6PB7AIWCZTHT5KJGFZFHQ@2/m/wagon-providers/wagon-scm/target/test-output/checkout-org.apache.maven.scm.provider.git.gitexe.GitExeScmProvider'...
fatal: '/m/wagon-providers/wagon-scm/target/test-classes/test-repo-git-test/' does not appear to be a git repository
fatal: Could not read from remote repository.

Please make sure you have the correct access rights
and the repository exists.


FAILED:  org.apache.maven.wagon.providers.scm.ScmGitExeWagonTest.testWagon

Error Message:

  Unexpected method call TransferListener.transferError(TransferEvent[GET|ERROR|Repository[scm:git:file://2/m/wagon-providers/wagon-scm/target/test-classes/test-repo-git-test/]|null|test-resource[len = 18; mod = 1536774204000]]):
    TransferListener.transferCompleted(TransferEvent[PUT|COMPLETED|Repository[scm:git:file://2/m/wagon-providers/wagon-scm/target/test-classes/test-repo-git-test/]|/home/jenkins/jenkins-slave/workspace/n-box_maven-wagon_WAGON-526-MVYPB7RAMW5VZ4RA4NSMECE376IR6WO6PB7AIWCZTHT5KJGFZFHQ@2/m/wagon-providers/wagon-scm/target/test-output/test-resource|test-resource[len = 18; mod = 1536774204000]]): expected: 1, actual: 0

Stack Trace:
java.lang.AssertionError:

  Unexpected method call TransferListener.transferError(TransferEvent[GET|ERROR|Repository[scm:git:file://2/m/wagon-providers/wagon-scm/target/test-classes/test-repo-git-test/]|null|test-resource[len = 18; mod = 1536774204000]]):
    TransferListener.transferCompleted(TransferEvent[PUT|COMPLETED|Repository[scm:git:file://2/m/wagon-providers/wagon-scm/target/test-classes/test-repo-git-test/]|/home/jenkins/jenkins-slave/workspace/n-box_maven-wagon_WAGON-526-MVYPB7RAMW5VZ4RA4NSMECE376IR6WO6PB7AIWCZTHT5KJGFZFHQ@2/m/wagon-providers/wagon-scm/target/test-output/test-resource|test-resource[len = 18; mod = 1536774204000]]): expected: 1, actual: 0


FAILED:  org.apache.maven.wagon.providers.scm.ScmGitExeWagonTest.testWagonPutDirectoryForDot

Error Message:
Error checking out: command failed: Cloning into '/home/jenkins/jenkins-slave/workspace/n-box_maven-wagon_WAGON-526-MVYPB7RAMW5VZ4RA4NSMECE376IR6WO6PB7AIWCZTHT5KJGFZFHQ@2/m/wagon-providers/wagon-scm/target/test-output/checkout-org.apache.maven.scm.provider.git.gitexe.GitExeScmProvider'...
fatal: '/m/wagon-providers/wagon-scm/target/test-classes/test-repo-git-test/' does not appear to be a git repository
fatal: Could not read from remote repository.

Please make sure you have the correct access rights
and the repository exists.

Stack Trace:
org.apache.maven.wagon.TransferFailedException:
Error checking out: command failed: Cloning into '/home/jenkins/jenkins-slave/workspace/n-box_maven-wagon_WAGON-526-MVYPB7RAMW5VZ4RA4NSMECE376IR6WO6PB7AIWCZTHT5KJGFZFHQ@2/m/wagon-providers/wagon-scm/target/test-output/checkout-org.apache.maven.scm.provider.git.gitexe.GitExeScmProvider'...
fatal: '/m/wagon-providers/wagon-scm/target/test-classes/test-repo-git-test/' does not appear to be a git repository
fatal: Could not read from remote repository.

Please make sure you have the correct access rights
and the repository exists.
Caused by: org.apache.maven.scm.ScmException:
command failed: Cloning into '/home/jenkins/jenkins-slave/workspace/n-box_maven-wagon_WAGON-526-MVYPB7RAMW5VZ4RA4NSMECE376IR6WO6PB7AIWCZTHT5KJGFZFHQ@2/m/wagon-providers/wagon-scm/target/test-output/checkout-org.apache.maven.scm.provider.git.gitexe.GitExeScmProvider'...
fatal: '/m/wagon-providers/wagon-scm/target/test-classes/test-repo-git-test/' does not appear to be a git repository
fatal: Could not read from remote repository.

Please make sure you have the correct access rights
and the repository exists.


FAILED:  org.apache.maven.wagon.providers.scm.ScmGitExeWagonTest.testFailedGet

Error Message:
Error getting file from SCM

Stack Trace:
org.apache.maven.wagon.TransferFailedException: Error getting file from SCM
Caused by: org.apache.maven.scm.ScmException:
command failed: Cloning into '/home/jenkins/jenkins-slave/workspace/n-box_maven-wagon_WAGON-526-MVYPB7RAMW5VZ4RA4NSMECE376IR6WO6PB7AIWCZTHT5KJGFZFHQ@2/m/wagon-providers/wagon-scm/target/test-output/checkout-org.apache.maven.scm.provider.git.gitexe.GitExeScmProvider'...
fatal: '/m/wagon-providers/wagon-scm/target/test-classes/test-repo-git-test/' does not appear to be a git repository
fatal: Could not read from remote repository.

Please make sure you have the correct access rights
and the repository exists.


FAILED:  org.apache.maven.wagon.providers.scm.ScmGitExeWagonTest.testWagonPutDirectoryWhenDirectoryAlreadyExists

Error Message:
Error checking out: command failed: Cloning into '/home/jenkins/jenkins-slave/workspace/n-box_maven-wagon_WAGON-526-MVYPB7RAMW5VZ4RA4NSMECE376IR6WO6PB7AIWCZTHT5KJGFZFHQ@2/m/wagon-providers/wagon-scm/target/test-output/checkout-org.apache.maven.scm.provider.git.gitexe.GitExeScmProvider'...
fatal: '/m/wagon-providers/wagon-scm/target/test-classes/test-repo-git-test/' does not appear to be a git repository
fatal: Could not read from remote repository.

Please make sure you have the correct access rights
and the repository exists.

Stack Trace:
org.apache.maven.wagon.TransferFailedException:
Error checking out: command failed: Cloning into '/home/jenkins/jenkins-slave/workspace/n-box_maven-wagon_WAGON-526-MVYPB7RAMW5VZ4RA4NSMECE376IR6WO6PB7AIWCZTHT5KJGFZFHQ@2/m/wagon-providers/wagon-scm/target/test-output/checkout-org.apache.maven.scm.provider.git.gitexe.GitExeScmProvider'...
fatal: '/m/wagon-providers/wagon-scm/target/test-classes/test-repo-git-test/' does not appear to be a git repository
fatal: Could not read from remote repository.

Please make sure you have the correct access rights
and the repository exists.
Caused by: org.apache.maven.scm.ScmException:
command failed: Cloning into '/home/jenkins/jenkins-slave/workspace/n-box_maven-wagon_WAGON-526-MVYPB7RAMW5VZ4RA4NSMECE376IR6WO6PB7AIWCZTHT5KJGFZFHQ@2/m/wagon-providers/wagon-scm/target/test-output/checkout-org.apache.maven.scm.provider.git.gitexe.GitExeScmProvider'...
fatal: '/m/wagon-providers/wagon-scm/target/test-classes/test-repo-git-test/' does not appear to be a git repository
fatal: Could not read from remote repository.

Please make sure you have the correct access rights
and the repository exists.


FAILED:  org.apache.maven.wagon.providers.scm.ScmGitExeWagonTest.testWagonPutDirectory

Error Message:
Error checking out: command failed: 'git' is not recognized as an internal or external command,
operable program or batch file.

Stack Trace:
org.apache.maven.wagon.TransferFailedException:
Error checking out: command failed: 'git' is not recognized as an internal or external command,
operable program or batch file.
Caused by: org.apache.maven.scm.ScmException:
command failed: 'git' is not recognized as an internal or external command,
operable program or batch file.


FAILED:  org.apache.maven.wagon.providers.scm.ScmGitExeWagonTest.testWagonPutDirectoryDeepDestination

Error Message:
Error checking out: command failed: 'git' is not recognized as an internal or external command,
operable program or batch file.

Stack Trace:
org.apache.maven.wagon.TransferFailedException:
Error checking out: command failed: 'git' is not recognized as an internal or external command,
operable program or batch file.
Caused by: org.apache.maven.scm.ScmException:
command failed: 'git' is not recognized as an internal or external command,
operable program or batch file.


FAILED:  org.apache.maven.wagon.providers.scm.ScmGitExeWagonTest.testWagon

Error Message:

  Unexpected method call TransferListener.transferError(TransferEvent[GET|ERROR|Repository[scm:git:file:///F:/jenkins/jenkins-slave/workspace/n-box_maven-wagon_WAGON-526-MVYPB7RAMW5VZ4RA4NSMECE376IR6WO6PB7AIWCZTHT5KJGFZFHQ/m/wagon-providers/wagon-scm/target/test-classes/test-repo-git-test/]|null|test-resource[len = 18; mod = 1536774181103]]):
    TransferListener.transferCompleted(TransferEvent[PUT|COMPLETED|Repository[scm:git:file:///F:/jenkins/jenkins-slave/workspace/n-box_maven-wagon_WAGON-526-MVYPB7RAMW5VZ4RA4NSMECE376IR6WO6PB7AIWCZTHT5KJGFZFHQ/m/wagon-providers/wagon-scm/target/test-classes/test-repo-git-test/]|F:\jenkins\jenkins-slave\workspace\n-box_maven-wagon_WAGON-526-MVYPB7RAMW5VZ4RA4NSMECE376IR6WO6PB7AIWCZTHT5KJGFZFHQ\m\wagon-providers\wagon-scm\target\test-output\test-resource|test-resource[len = 18; mod = 1536774181103]]): expected: 1, actual: 0

Stack Trace:
java.lang.AssertionError:

  Unexpected method call TransferListener.transferError(TransferEvent[GET|ERROR|Repository[scm:git:file:///F:/jenkins/jenkins-slave/workspace/n-box_maven-wagon_WAGON-526-MVYPB7RAMW5VZ4RA4NSMECE376IR6WO6PB7AIWCZTHT5KJGFZFHQ/m/wagon-providers/wagon-scm/target/test-classes/test-repo-git-test/]|null|test-resource[len = 18; mod = 1536774181103]]):
    TransferListener.transferCompleted(TransferEvent[PUT|COMPLETED|Repository[scm:git:file:///F:/jenkins/jenkins-slave/workspace/n-box_maven-wagon_WAGON-526-MVYPB7RAMW5VZ4RA4NSMECE376IR6WO6PB7AIWCZTHT5KJGFZFHQ/m/wagon-providers/wagon-scm/target/test-classes/test-repo-git-test/]|F:\jenkins\jenkins-slave\workspace\n-box_maven-wagon_WAGON-526-MVYPB7RAMW5VZ4RA4NSMECE376IR6WO6PB7AIWCZTHT5KJGFZFHQ\m\wagon-providers\wagon-scm\target\test-output\test-resource|test-resource[len = 18; mod = 1536774181103]]): expected: 1, actual: 0


FAILED:  org.apache.maven.wagon.providers.scm.ScmGitExeWagonTest.testWagonPutDirectoryForDot

Error Message:
Error checking out: command failed: 'git' is not recognized as an internal or external command,
operable program or batch file.

Stack Trace:
org.apache.maven.wagon.TransferFailedException:
Error checking out: command failed: 'git' is not recognized as an internal or external command,
operable program or batch file.
Caused by: org.apache.maven.scm.ScmException:
command failed: 'git' is not recognized as an internal or external command,
operable program or batch file.


FAILED:  org.apache.maven.wagon.providers.scm.ScmGitExeWagonTest.testFailedGet

Error Message:
Error getting file from SCM

Stack Trace:
org.apache.maven.wagon.TransferFailedException: Error getting file from SCM
Caused by: org.apache.maven.scm.ScmException:
command failed: 'git' is not recognized as an internal or external command,
operable program or batch file.


FAILED:  org.apache.maven.wagon.providers.scm.ScmGitExeWagonTest.testWagonPutDirectoryWhenDirectoryAlreadyExists

Error Message:
Error checking out: command failed: 'git' is not recognized as an internal or external command,
operable program or batch file.

Stack Trace:
org.apache.maven.wagon.TransferFailedException:
Error checking out: command failed: 'git' is not recognized as an internal or external command,
operable program or batch file.
Caused by: org.apache.maven.scm.ScmException:
command failed: 'git' is not recognized as an internal or external command,
operable program or batch file.


FAILED:  org.apache.maven.wagon.providers.scm.ScmGitExeWagonTest.testWagonPutDirectory

Error Message:
Error interacting with SCM: Unable to commit file. The git-commit command failed.
*** Please tell me who you are.

Run

  git config --global user.email "[hidden email]"
  git config --global user.name "Your Name"

to set your account's default identity.
Omit --global to set the identity only in this repository.

fatal:********@asf924.gq1.ygridcore.net>) not allowed


Stack Trace:
org.apache.maven.wagon.TransferFailedException:
Error interacting with SCM: Unable to commit file. The git-commit command failed.
*** Please tell me who you are.

Run

  git config --global user.email "[hidden email]"
  git config --global user.name "Your Name"

to set your account's default identity.
Omit --global to set the identity only in this repository.

fatal:********@asf924.gq1.ygridcore.net>) not allowed

Caused by: org.apache.maven.scm.ScmException:
Unable to commit file. The git-commit command failed.
*** Please tell me who you are.

Run

  git config --global user.email "[hidden email]"
  git config --global user.name "Your Name"

to set your account's default identity.
Omit --global to set the identity only in this repository.

fatal:********@asf924.gq1.ygridcore.net>) not allowed



FAILED:  org.apache.maven.wagon.providers.scm.ScmGitExeWagonTest.testWagonPutDirectoryDeepDestination

Error Message:
Error interacting with SCM: Unable to commit file. The git-commit command failed.
*** Please tell me who you are.

Run

  git config --global user.email "[hidden email]"
  git config --global user.name "Your Name"

to set your account's default identity.
Omit --global to set the identity only in this repository.

fatal:********@asf924.gq1.ygridcore.net>) not allowed


Stack Trace:
org.apache.maven.wagon.TransferFailedException:
Error interacting with SCM: Unable to commit file. The git-commit command failed.
*** Please tell me who you are.

Run

  git config --global user.email "[hidden email]"
  git config --global user.name "Your Name"

to set your account's default identity.
Omit --global to set the identity only in this repository.

fatal:********@asf924.gq1.ygridcore.net>) not allowed

Caused by: org.apache.maven.scm.ScmException:
Unable to commit file. The git-commit command failed.
*** Please tell me who you are.

Run

  git config --global user.email "[hidden email]"
  git config --global user.name "Your Name"

to set your account's default identity.
Omit --global to set the identity only in this repository.

fatal:********@asf924.gq1.ygridcore.net>) not allowed



FAILED:  org.apache.maven.wagon.providers.scm.ScmGitExeWagonTest.testWagon

Error Message:

  Unexpected method call TransferListener.transferError(TransferEvent[PUT|ERROR|Repository[scm:git:file:///home/jenkins/jenkins-slave/workspace/n-box_maven-wagon_WAGON-526-MVYPB7RAMW5VZ4RA4NSMECE376IR6WO6PB7AIWCZTHT5KJGFZFHQ/m/wagon-providers/wagon-scm/target/test-classes/test-repo-git-test/]|null|test-resource[len = 18; mod = 1536774243000]]):
    TransferListener.transferCompleted(TransferEvent[PUT|COMPLETED|Repository[scm:git:file:///home/jenkins/jenkins-slave/workspace/n-box_maven-wagon_WAGON-526-MVYPB7RAMW5VZ4RA4NSMECE376IR6WO6PB7AIWCZTHT5KJGFZFHQ/m/wagon-providers/wagon-scm/target/test-classes/test-repo-git-test/]|/home/jenkins/jenkins-slave/workspace/n-box_maven-wagon_WAGON-526-MVYPB7RAMW5VZ4RA4NSMECE376IR6WO6PB7AIWCZTHT5KJGFZFHQ/m/wagon-providers/wagon-scm/target/test-output/test-resource|test-resource[len = 18; mod = 1536774243000]]): expected: 1, actual: 0

Stack Trace:
java.lang.AssertionError:

  Unexpected method call TransferListener.transferError(TransferEvent[PUT|ERROR|Repository[scm:git:file:///home/jenkins/jenkins-slave/workspace/n-box_maven-wagon_WAGON-526-MVYPB7RAMW5VZ4RA4NSMECE376IR6WO6PB7AIWCZTHT5KJGFZFHQ/m/wagon-providers/wagon-scm/target/test-classes/test-repo-git-test/]|null|test-resource[len = 18; mod = 1536774243000]]):
    TransferListener.transferCompleted(TransferEvent[PUT|COMPLETED|Repository[scm:git:file:///home/jenkins/jenkins-slave/workspace/n-box_maven-wagon_WAGON-526-MVYPB7RAMW5VZ4RA4NSMECE376IR6WO6PB7AIWCZTHT5KJGFZFHQ/m/wagon-providers/wagon-scm/target/test-classes/test-repo-git-test/]|/home/jenkins/jenkins-slave/workspace/n-box_maven-wagon_WAGON-526-MVYPB7RAMW5VZ4RA4NSMECE376IR6WO6PB7AIWCZTHT5KJGFZFHQ/m/wagon-providers/wagon-scm/target/test-output/test-resource|test-resource[len = 18; mod = 1536774243000]]): expected: 1, actual: 0


FAILED:  org.apache.maven.wagon.providers.scm.ScmGitExeWagonTest.testWagonPutDirectoryForDot

Error Message:
Error interacting with SCM: Unable to commit file. The git-commit command failed.
*** Please tell me who you are.

Run

  git config --global user.email "[hidden email]"
  git config --global user.name "Your Name"

to set your account's default identity.
Omit --global to set the identity only in this repository.

fatal:********@asf924.gq1.ygridcore.net>) not allowed


Stack Trace:
org.apache.maven.wagon.TransferFailedException:
Error interacting with SCM: Unable to commit file. The git-commit command failed.
*** Please tell me who you are.

Run

  git config --global user.email "[hidden email]"
  git config --global user.name "Your Name"

to set your account's default identity.
Omit --global to set the identity only in this repository.

fatal:********@asf924.gq1.ygridcore.net>) not allowed

Caused by: org.apache.maven.scm.ScmException:
Unable to commit file. The git-commit command failed.
*** Please tell me who you are.

Run

  git config --global user.email "[hidden email]"
  git config --global user.name "Your Name"

to set your account's default identity.
Omit --global to set the identity only in this repository.

fatal:********@asf924.gq1.ygridcore.net>) not allowed



FAILED:  org.apache.maven.wagon.providers.scm.ScmGitExeWagonTest.testWagonPutDirectoryWhenDirectoryAlreadyExists

Error Message:
Error interacting with SCM: Unable to commit file. The git-commit command failed.
*** Please tell me who you are.

Run

  git config --global user.email "[hidden email]"
  git config --global user.name "Your Name"

to set your account's default identity.
Omit --global to set the identity only in this repository.

fatal:********@asf924.gq1.ygridcore.net>) not allowed


Stack Trace:
org.apache.maven.wagon.TransferFailedException:
Error interacting with SCM: Unable to commit file. The git-commit command failed.
*** Please tell me who you are.

Run

  git config --global user.email "[hidden email]"
  git config --global user.name "Your Name"

to set your account's default identity.
Omit --global to set the identity only in this repository.

fatal:********@asf924.gq1.ygridcore.net>) not allowed

Caused by: org.apache.maven.scm.ScmException:
Unable to commit file. The git-commit command failed.
*** Please tell me who you are.

Run

  git config --global user.email "[hidden email]"
  git config --global user.name "Your Name"

to set your account's default identity.
Omit --global to set the identity only in this repository.

fatal:********@asf924.gq1.ygridcore.net>) not allowed



FAILED:  org.apache.maven.wagon.providers.scm.ScmGitExeWagonTest.testWagonPutDirectory

Error Message:
Error interacting with SCM: Unable to commit file. The git-commit command failed.
*** Please tell me who you are.

Run

  git config --global user.email "[hidden email]"
  git config --global user.name "Your Name"

to set your account's default identity.
Omit --global to set the identity only in this repository.

fatal:********@asf925.gq1.ygridcore.net>) not allowed


Stack Trace:
org.apache.maven.wagon.TransferFailedException:
Error interacting with SCM: Unable to commit file. The git-commit command failed.
*** Please tell me who you are.

Run

  git config --global user.email "[hidden email]"
  git config --global user.name "Your Name"

to set your account's default identity.
Omit --global to set the identity only in this repository.

fatal:********@asf925.gq1.ygridcore.net>) not allowed

Caused by: org.apache.maven.scm.ScmException:
Unable to commit file. The git-commit command failed.
*** Please tell me who you are.

Run

  git config --global user.email "[hidden email]"
  git config --global user.name "Your Name"

to set your account's default identity.
Omit --global to set the identity only in this repository.

fatal:********@asf925.gq1.ygridcore.net>) not allowed



FAILED:  org.apache.maven.wagon.providers.scm.ScmGitExeWagonTest.testWagonPutDirectoryDeepDestination

Error Message:
Error interacting with SCM: Unable to commit file. The git-commit command failed.
*** Please tell me who you are.

Run

  git config --global user.email "[hidden email]"
  git config --global user.name "Your Name"

to set your account's default identity.
Omit --global to set the identity only in this repository.

fatal:********@asf925.gq1.ygridcore.net>) not allowed


Stack Trace:
org.apache.maven.wagon.TransferFailedException:
Error interacting with SCM: Unable to commit file. The git-commit command failed.
*** Please tell me who you are.

Run

  git config --global user.email "[hidden email]"
  git config --global user.name "Your Name"

to set your account's default identity.
Omit --global to set the identity only in this repository.

fatal:********@asf925.gq1.ygridcore.net>) not allowed

Caused by: org.apache.maven.scm.ScmException:
Unable to commit file. The git-commit command failed.
*** Please tell me who you are.

Run

  git config --global user.email "[hidden email]"
  git config --global user.name "Your Name"

to set your account's default identity.
Omit --global to set the identity only in this repository.

fatal:********@asf925.gq1.ygridcore.net>) not allowed



FAILED:  org.apache.maven.wagon.providers.scm.ScmGitExeWagonTest.testWagon

Error Message:

  Unexpected method call TransferListener.transferError(TransferEvent[PUT|ERROR|Repository[scm:git:file:///home/jenkins/jenkins-slave/workspace/n-box_maven-wagon_WAGON-526-MVYPB7RAMW5VZ4RA4NSMECE376IR6WO6PB7AIWCZTHT5KJGFZFHQ/m/wagon-providers/wagon-scm/target/test-classes/test-repo-git-test/]|null|test-resource[len = 18; mod = 1536774251000]]):
    TransferListener.transferCompleted(TransferEvent[PUT|COMPLETED|Repository[scm:git:file:///home/jenkins/jenkins-slave/workspace/n-box_maven-wagon_WAGON-526-MVYPB7RAMW5VZ4RA4NSMECE376IR6WO6PB7AIWCZTHT5KJGFZFHQ/m/wagon-providers/wagon-scm/target/test-classes/test-repo-git-test/]|/home/jenkins/jenkins-slave/workspace/n-box_maven-wagon_WAGON-526-MVYPB7RAMW5VZ4RA4NSMECE376IR6WO6PB7AIWCZTHT5KJGFZFHQ/m/wagon-providers/wagon-scm/target/test-output/test-resource|test-resource[len = 18; mod = 1536774251000]]): expected: 1, actual: 0

Stack Trace:
java.lang.AssertionError:

  Unexpected method call TransferListener.transferError(TransferEvent[PUT|ERROR|Repository[scm:git:file:///home/jenkins/jenkins-slave/workspace/n-box_maven-wagon_WAGON-526-MVYPB7RAMW5VZ4RA4NSMECE376IR6WO6PB7AIWCZTHT5KJGFZFHQ/m/wagon-providers/wagon-scm/target/test-classes/test-repo-git-test/]|null|test-resource[len = 18; mod = 1536774251000]]):
    TransferListener.transferCompleted(TransferEvent[PUT|COMPLETED|Repository[scm:git:file:///home/jenkins/jenkins-slave/workspace/n-box_maven-wagon_WAGON-526-MVYPB7RAMW5VZ4RA4NSMECE376IR6WO6PB7AIWCZTHT5KJGFZFHQ/m/wagon-providers/wagon-scm/target/test-classes/test-repo-git-test/]|/home/jenkins/jenkins-slave/workspace/n-box_maven-wagon_WAGON-526-MVYPB7RAMW5VZ4RA4NSMECE376IR6WO6PB7AIWCZTHT5KJGFZFHQ/m/wagon-providers/wagon-scm/target/test-output/test-resource|test-resource[len = 18; mod = 1536774251000]]): expected: 1, actual: 0


FAILED:  org.apache.maven.wagon.providers.scm.ScmGitExeWagonTest.testWagonPutDirectoryForDot

Error Message:
Error interacting with SCM: Unable to commit file. The git-commit command failed.
*** Please tell me who you are.

Run

  git config --global user.email "[hidden email]"
  git config --global user.name "Your Name"

to set your account's default identity.
Omit --global to set the identity only in this repository.

fatal:********@asf925.gq1.ygridcore.net>) not allowed


Stack Trace:
org.apache.maven.wagon.TransferFailedException:
Error interacting with SCM: Unable to commit file. The git-commit command failed.
*** Please tell me who you are.

Run

  git config --global user.email "[hidden email]"
  git config --global user.name "Your Name"

to set your account's default identity.
Omit --global to set the identity only in this repository.

fatal:********@asf925.gq1.ygridcore.net>) not allowed

Caused by: org.apache.maven.scm.ScmException:
Unable to commit file. The git-commit command failed.
*** Please tell me who you are.

Run

  git config --global user.email "[hidden email]"
  git config --global user.name "Your Name"

to set your account's default identity.
Omit --global to set the identity only in this repository.

fatal:********@asf925.gq1.ygridcore.net>) not allowed



FAILED:  org.apache.maven.wagon.providers.scm.ScmGitExeWagonTest.testWagonPutDirectoryWhenDirectoryAlreadyExists

Error Message:
Error interacting with SCM: Unable to commit file. The git-commit command failed.
*** Please tell me who you are.

Run

  git config --global user.email "[hidden email]"
  git config --global user.name "Your Name"

to set your account's default identity.
Omit --global to set the identity only in this repository.

fatal:********@asf925.gq1.ygridcore.net>) not allowed


Stack Trace:
org.apache.maven.wagon.TransferFailedException:
Error interacting with SCM: Unable to commit file. The git-commit command failed.
*** Please tell me who you are.

Run

  git config --global user.email "[hidden email]"
  git config --global user.name "Your Name"

to set your account's default identity.
Omit --global to set the identity only in this repository.

fatal:********@asf925.gq1.ygridcore.net>) not allowed

Caused by: org.apache.maven.scm.ScmException:
Unable to commit file. The git-commit command failed.
*** Please tell me who you are.

Run

  git config --global user.email "[hidden email]"
  git config --global user.name "Your Name"

to set your account's default identity.
Omit --global to set the identity only in this repository.

fatal:********@asf925.gq1.ygridcore.net>) not allowed



FAILED:  org.apache.maven.wagon.providers.scm.ScmGitExeWagonTest.testWagonPutDirectory

Error Message:
Error checking out: command failed: 'git' is not recognized as an internal or external command,
operable program or batch file.

Stack Trace:
org.apache.maven.wagon.TransferFailedException:
Error checking out: command failed: 'git' is not recognized as an internal or external command,
operable program or batch file.
Caused by: org.apache.maven.scm.ScmException:
command failed: 'git' is not recognized as an internal or external command,
operable program or batch file.


FAILED:  org.apache.maven.wagon.providers.scm.ScmGitExeWagonTest.testWagonPutDirectoryDeepDestination

Error Message:
Error checking out: command failed: 'git' is not recognized as an internal or external command,
operable program or batch file.

Stack Trace:
org.apache.maven.wagon.TransferFailedException:
Error checking out: command failed: 'git' is not recognized as an internal or external command,
operable program or batch file.
Caused by: org.apache.maven.scm.ScmException:
command failed: 'git' is not recognized as an internal or external command,
operable program or batch file.


FAILED:  org.apache.maven.wagon.providers.scm.ScmGitExeWagonTest.testWagon

Error Message:

  Unexpected method call TransferListener.transferError(TransferEvent[GET|ERROR|Repository[scm:git:file:///F:/jenkins/jenkins-slave/workspace/n-box_maven-wagon_WAGON-526-MVYPB7RAMW5VZ4RA4NSMECE376IR6WO6PB7AIWCZTHT5KJGFZFHQ/m/wagon-providers/wagon-scm/target/test-classes/test-repo-git-test/]|null|test-resource[len = 18; mod = 1536774763733]]):
    TransferListener.transferCompleted(TransferEvent[PUT|COMPLETED|Repository[scm:git:file:///F:/jenkins/jenkins-slave/workspace/n-box_maven-wagon_WAGON-526-MVYPB7RAMW5VZ4RA4NSMECE376IR6WO6PB7AIWCZTHT5KJGFZFHQ/m/wagon-providers/wagon-scm/target/test-classes/test-repo-git-test/]|F:\jenkins\jenkins-slave\workspace\n-box_maven-wagon_WAGON-526-MVYPB7RAMW5VZ4RA4NSMECE376IR6WO6PB7AIWCZTHT5KJGFZFHQ\m\wagon-providers\wagon-scm\target\test-output\test-resource|test-resource[len = 18; mod = 1536774763733]]): expected: 1, actual: 0

Stack Trace:
java.lang.AssertionError:

  Unexpected method call TransferListener.transferError(TransferEvent[GET|ERROR|Repository[scm:git:file:///F:/jenkins/jenkins-slave/workspace/n-box_maven-wagon_WAGON-526-MVYPB7RAMW5VZ4RA4NSMECE376IR6WO6PB7AIWCZTHT5KJGFZFHQ/m/wagon-providers/wagon-scm/target/test-classes/test-repo-git-test/]|null|test-resource[len = 18; mod = 1536774763733]]):
    TransferListener.transferCompleted(TransferEvent[PUT|COMPLETED|Repository[scm:git:file:///F:/jenkins/jenkins-slave/workspace/n-box_maven-wagon_WAGON-526-MVYPB7RAMW5VZ4RA4NSMECE376IR6WO6PB7AIWCZTHT5KJGFZFHQ/m/wagon-providers/wagon-scm/target/test-classes/test-repo-git-test/]|F:\jenkins\jenkins-slave\workspace\n-box_maven-wagon_WAGON-526-MVYPB7RAMW5VZ4RA4NSMECE376IR6WO6PB7AIWCZTHT5KJGFZFHQ\m\wagon-providers\wagon-scm\target\test-output\test-resource|test-resource[len = 18; mod = 1536774763733]]): expected: 1, actual: 0


FAILED:  org.apache.maven.wagon.providers.scm.ScmGitExeWagonTest.testWagonPutDirectoryForDot

Error Message:
Error checking out: command failed: 'git' is not recognized as an internal or external command,
operable program or batch file.

Stack Trace:
org.apache.maven.wagon.TransferFailedException:
Error checking out: command failed: 'git' is not recognized as an internal or external command,
operable program or batch file.
Caused by: org.apache.maven.scm.ScmException:
command failed: 'git' is not recognized as an internal or external command,
operable program or batch file.


FAILED:  org.apache.maven.wagon.providers.scm.ScmGitExeWagonTest.testFailedGet

Error Message:
Error getting file from SCM

Stack Trace:
org.apache.maven.wagon.TransferFailedException: Error getting file from SCM
Caused by: org.apache.maven.scm.ScmException:
command failed: 'git' is not recognized as an internal or external command,
operable program or batch file.


FAILED:  org.apache.maven.wagon.providers.scm.ScmGitExeWagonTest.testWagonPutDirectoryWhenDirectoryAlreadyExists

Error Message:
Error checking out: command failed: 'git' is not recognized as an internal or external command,
operable program or batch file.

Stack Trace:
org.apache.maven.wagon.TransferFailedException:
Error checking out: command failed: 'git' is not recognized as an internal or external command,
operable program or batch file.
Caused by: org.apache.maven.scm.ScmException:
command failed: 'git' is not recognized as an internal or external command,
operable program or batch file.




Build log:
[...truncated 3.44 MB...]
[windows-jdk9] [INFO]
[windows-jdk9] [INFO] --- maven-enforcer-plugin:1.4.1:enforce (default) @ wagon-ssh ---
[windows-jdk9] [INFO]
[windows-jdk9] [INFO] --- apache-rat-plugin:0.12:check (rat-check) @ wagon-ssh ---
[windows-jdk9] [INFO] Enabled default license matchers.
[windows-jdk9] [INFO] Will parse SCM ignores for exclusions...
[windows-jdk9] [INFO] Finished adding exclusions from SCM ignore files.
[windows-jdk9] [INFO] 61 implicit excludes (use -debug for more details).
[windows-jdk9] [INFO] Exclude: .checkstyle
[windows-jdk9] [INFO] Exclude: **/*.odg
[windows-jdk9] [INFO] Exclude: src/test/resources/**
[windows-jdk9] [INFO] Exclude: src/main/resources/default-server-root/**
[windows-jdk9] [INFO] Exclude: src/main/resources/ssh-keys/**
[windows-jdk9] [INFO] Exclude: src/test/ssh-keys/**
[windows-jdk9] [INFO] Exclude: .repository/**
[windows-jdk9] [INFO] Exclude: out/**
[windows-jdk9] [INFO] Exclude: .repository/**
[windows-jdk9] [INFO] Exclude: .maven/spy.log
[windows-jdk9] [INFO] Exclude: dependency-reduced-pom.xml
[windows-jdk9] [INFO] Exclude: .java-version
[windows-jdk9] [INFO] 19 resources included (use -debug for more details)
[windows-jdk9] [INFO] Rat check: Summary over all files. Unapproved: 0, unknown: 0, generated: 0, approved: 19 licenses.
[windows-jdk9] [INFO]
[windows-jdk9] [INFO] --- maven-remote-resources-plugin:1.5:process (process-resource-bundles) @ wagon-ssh ---
[windows-jdk9] [INFO]
[windows-jdk9] [INFO] --- maven-resources-plugin:3.0.2:resources (default-resources) @ wagon-ssh ---
[windows-jdk9] [INFO] Using 'UTF-8' encoding to copy filtered resources.
[windows-jdk9] [INFO] skip non existing resourceDirectory F:\jenkins\jenkins-slave\workspace\n-box_maven-wagon_WAGON-526-MVYPB7RAMW5VZ4RA4NSMECE376IR6WO6PB7AIWCZTHT5KJGFZFHQ\m\wagon-providers\wagon-ssh\src\main\resources
[windows-jdk9] [INFO] Copying 3 resources
[windows-jdk9] [INFO]
[windows-jdk9] [INFO] --- maven-compiler-plugin:3.7.0:compile (default-compile) @ wagon-ssh ---
[windows-jdk9] [INFO] Changes detected - recompiling the module!
[windows-jdk9] [INFO] Compiling 7 source files to F:\jenkins\jenkins-slave\workspace\n-box_maven-wagon_WAGON-526-MVYPB7RAMW5VZ4RA4NSMECE376IR6WO6PB7AIWCZTHT5KJGFZFHQ\m\wagon-providers\wagon-ssh\target\classes
[windows-jdk9] [INFO]
[windows-jdk9] [INFO] --- plexus-component-metadata:1.7.1:generate-metadata (generate) @ wagon-ssh ---
[windows-jdk9] [INFO] Discovered 4 component descriptors(s)
[windows-jdk9] [INFO]
[windows-jdk9] [INFO] --- animal-sniffer-maven-plugin:1.15:check (check-java-1.7-compat) @ wagon-ssh ---
[windows-jdk9] [INFO] Checking unresolved references to org.codehaus.mojo.signature:java17:1.0
[windows-jdk9] [INFO]
[windows-jdk9] [INFO] --- maven-resources-plugin:3.0.2:testResources (default-testResources) @ wagon-ssh ---
[windows-jdk9] [INFO] Using 'UTF-8' encoding to copy filtered resources.
[windows-jdk9] [INFO] Copying 6 resources
[windows-jdk9] [INFO] Copying 3 resources
[windows-jdk9] [INFO]
[windows-jdk9] [INFO] --- maven-compiler-plugin:3.7.0:testCompile (default-testCompile) @ wagon-ssh ---
[windows-jdk9] [INFO] Changes detected - recompiling the module!
[windows-jdk9] [INFO] Compiling 8 source files to F:\jenkins\jenkins-slave\workspace\n-box_maven-wagon_WAGON-526-MVYPB7RAMW5VZ4RA4NSMECE376IR6WO6PB7AIWCZTHT5KJGFZFHQ\m\wagon-providers\wagon-ssh\target\test-classes
[windows-jdk9] [INFO] /F:/jenkins/jenkins-slave/workspace/n-box_maven-wagon_WAGON-526-MVYPB7RAMW5VZ4RA4NSMECE376IR6WO6PB7AIWCZTHT5KJGFZFHQ/m/wagon-providers/wagon-ssh/src/test/java/org/apache/maven/wagon/providers/ssh/jsch/ScpWagonWithSshPrivateKeySearchTest.java: F:\jenkins\jenkins-slave\workspace\n-box_maven-wagon_WAGON-526-MVYPB7RAMW5VZ4RA4NSMECE376IR6WO6PB7AIWCZTHT5KJGFZFHQ\m\wagon-providers\wagon-ssh\src\test\java\org\apache\maven\wagon\providers\ssh\jsch\ScpWagonWithSshPrivateKeySearchTest.java uses or overrides a deprecated API.
[windows-jdk9] [INFO] /F:/jenkins/jenkins-slave/workspace/n-box_maven-wagon_WAGON-526-MVYPB7RAMW5VZ4RA4NSMECE376IR6WO6PB7AIWCZTHT5KJGFZFHQ/m/wagon-providers/wagon-ssh/src/test/java/org/apache/maven/wagon/providers/ssh/jsch/ScpWagonWithSshPrivateKeySearchTest.java: Recompile with -Xlint:deprecation for details.
[windows-jdk9] [INFO]
[windows-jdk9] [INFO] --- maven-surefire-plugin:2.20:test (default-test) @ wagon-ssh ---
[windows-jdk9] [INFO]
[windows-jdk9] [INFO] --- maven-jar-plugin:3.0.2:jar (default-jar) @ wagon-ssh ---
[windows-jdk9] [INFO] Building jar: F:\jenkins\jenkins-slave\workspace\n-box_maven-wagon_WAGON-526-MVYPB7RAMW5VZ4RA4NSMECE376IR6WO6PB7AIWCZTHT5KJGFZFHQ\m\wagon-providers\wagon-ssh\target\wagon-ssh-3.1.1-SNAPSHOT.jar
[windows-jdk9] [INFO]
[windows-jdk9] [INFO] --- maven-site-plugin:3.7:attach-descriptor (attach-descriptor) @ wagon-ssh ---
[windows-jdk9] [INFO] Skipping because packaging 'jar' is not pom.
[windows-jdk9] [INFO]
[windows-jdk9] [INFO] --- maven-checkstyle-plugin:3.0.0:check (checkstyle-check) @ wagon-ssh ---
[windows-jdk9] [INFO] There is 1 error reported by Checkstyle 6.18 with config/maven_checks.xml ruleset.
[windows-jdk9] [INFO] Ignored 1 error, 0 violation remaining.
[windows-jdk9] [INFO]
[windows-jdk9] [INFO] ------------------------------------------------------------------------
[windows-jdk9] [INFO] Building Apache Maven Wagon :: Providers :: WebDAV Provider 3.1.1-SNAPSHOT
[windows-jdk9] [INFO] ------------------------------------------------------------------------
[windows-jdk9] [INFO] Downloading from central: https://repo.maven.apache.org/maven2/org/apache/jackrabbit/jackrabbit-webdav/2.14.4/jackrabbit-webdav-2.14.4.pom
[windows-jdk9] [INFO] Downloaded from central: https://repo.maven.apache.org/maven2/org/apache/jackrabbit/jackrabbit-webdav/2.14.4/jackrabbit-webdav-2.14.4.pom (4.0 kB at 141 kB/s)
[windows-jdk9] [INFO] Downloading from central: https://repo.maven.apache.org/maven2/org/apache/jackrabbit/jackrabbit-parent/2.14.4/jackrabbit-parent-2.14.4.pom
[windows-jdk9] [INFO] Downloaded from central: https://repo.maven.apache.org/maven2/org/apache/jackrabbit/jackrabbit-parent/2.14.4/jackrabbit-parent-2.14.4.pom (35 kB at 1.3 MB/s)
[windows-jdk9] [INFO] Downloading from central: https://repo.maven.apache.org/maven2/it/could/webdav/0.4/webdav-0.4.pom
[windows-jdk9] [INFO] Downloaded from central: https://repo.maven.apache.org/maven2/it/could/webdav/0.4/webdav-0.4.pom (1.1 kB at 28 kB/s)
[windows-jdk9] [INFO] Downloading from central: https://repo.maven.apache.org/maven2/biz/aQute/bnd/1.50.0/bnd-1.50.0.pom
[windows-jdk9] [INFO] Downloaded from central: https://repo.maven.apache.org/maven2/biz/aQute/bnd/1.50.0/bnd-1.50.0.pom (1.3 kB at 43 kB/s)
[windows-jdk9] [INFO] Downloading from central: https://repo.maven.apache.org/maven2/biz/aQute/bnd/1.50.0/bnd-1.50.0.jar
[windows-jdk9] [INFO] Downloading from central: https://repo.maven.apache.org/maven2/it/could/webdav/0.4/webdav-0.4.jar
[windows-jdk9] [INFO] Downloading from central: https://repo.maven.apache.org/maven2/javax/servlet/servlet-api/2.3/servlet-api-2.3.jar
[windows-jdk9] [INFO] Downloading from central: https://repo.maven.apache.org/maven2/org/apache/jackrabbit/jackrabbit-webdav/2.14.4/jackrabbit-webdav-2.14.4.jar
[windows-jdk9] [INFO] Downloaded from central: https://repo.maven.apache.org/maven2/it/could/webdav/0.4/webdav-0.4.jar (103 kB at 2.6 MB/s)
[windows-jdk9] [INFO] Downloaded from central: https://repo.maven.apache.org/maven2/javax/servlet/servlet-api/2.3/servlet-api-2.3.jar (78 kB at 1.8 MB/s)
[windows-jdk9] [INFO] Downloaded from central: https://repo.maven.apache.org/maven2/org/apache/jackrabbit/jackrabbit-webdav/2.14.4/jackrabbit-webdav-2.14.4.jar (365 kB at 6.9 MB/s)
[windows-jdk9] [INFO] Downloaded from central: https://repo.maven.apache.org/maven2/biz/aQute/bnd/1.50.0/bnd-1.50.0.jar (828 kB at 14 MB/s)
[windows-jdk9] [INFO]
[windows-jdk9] [INFO] --- maven-clean-plugin:3.0.0:clean (default-clean) @ wagon-webdav-jackrabbit ---
[windows-jdk9] [INFO]
[windows-jdk9] [INFO] --- maven-enforcer-plugin:1.4.1:enforce (enforce-maven-version) @ wagon-webdav-jackrabbit ---
[windows-jdk9] [INFO]
[windows-jdk9] [INFO] --- maven-enforcer-plugin:1.4.1:enforce (enforce-bytecode-version) @ wagon-webdav-jackrabbit ---
[windows-jdk9] [INFO]
[windows-jdk9] [INFO] --- maven-enforcer-plugin:1.4.1:enforce (ban-known-bad-maven-versions) @ wagon-webdav-jackrabbit ---
[windows-jdk9] [INFO]
[windows-jdk9] [INFO] --- maven-enforcer-plugin:1.4.1:enforce (default) @ wagon-webdav-jackrabbit ---
[windows-jdk9] [INFO]
[windows-jdk9] [INFO] --- apache-rat-plugin:0.12:check (rat-check) @ wagon-webdav-jackrabbit ---
[windows-jdk9] [INFO] Enabled default license matchers.
[windows-jdk9] [INFO] Will parse SCM ignores for exclusions...
[windows-jdk9] [INFO] Finished adding exclusions from SCM ignore files.
[windows-jdk9] [INFO] 61 implicit excludes (use -debug for more details).
[windows-jdk9] [INFO] Exclude: .checkstyle
[windows-jdk9] [INFO] Exclude: **/*.odg
[windows-jdk9] [INFO] Exclude: src/test/resources/**
[windows-jdk9] [INFO] Exclude: src/main/resources/default-server-root/**
[windows-jdk9] [INFO] Exclude: src/main/resources/ssh-keys/**
[windows-jdk9] [INFO] Exclude: src/test/ssh-keys/**
[windows-jdk9] [INFO] Exclude: .repository/**
[windows-jdk9] [INFO] Exclude: out/**
[windows-jdk9] [INFO] Exclude: .repository/**
[windows-jdk9] [INFO] Exclude: .maven/spy.log
[windows-jdk9] [INFO] Exclude: dependency-reduced-pom.xml
[windows-jdk9] [INFO] Exclude: .java-version
[windows-jdk9] [INFO] 12 resources included (use -debug for more details)
[windows-jdk9] [INFO] Rat check: Summary over all files. Unapproved: 0, unknown: 0, generated: 0, approved: 12 licenses.
[windows-jdk9] [INFO]
[windows-jdk9] [INFO] --- maven-remote-resources-plugin:1.5:process (process-resource-bundles) @ wagon-webdav-jackrabbit ---
[windows-jdk9] [INFO]
[windows-jdk9] [INFO] --- maven-resources-plugin:3.0.2:resources (default-resources) @ wagon-webdav-jackrabbit ---
[windows-jdk9] [INFO] Using 'UTF-8' encoding to copy filtered resources.
[windows-jdk9] [INFO] Copying 1 resource
[windows-jdk9] [INFO] Copying 3 resources
[windows-jdk9] [INFO]
[windows-jdk9] [INFO] --- maven-compiler-plugin:3.7.0:compile (default-compile) @ wagon-webdav-jackrabbit ---
[windows-jdk9] [INFO] Changes detected - recompiling the module!
[windows-jdk9] [INFO] Compiling 4 source files to F:\jenkins\jenkins-slave\workspace\n-box_maven-wagon_WAGON-526-MVYPB7RAMW5VZ4RA4NSMECE376IR6WO6PB7AIWCZTHT5KJGFZFHQ\m\wagon-providers\wagon-webdav-jackrabbit\target\classes
[windows-jdk9] [INFO] /F:/jenkins/jenkins-slave/workspace/n-box_maven-wagon_WAGON-526-MVYPB7RAMW5VZ4RA4NSMECE376IR6WO6PB7AIWCZTHT5KJGFZFHQ/m/wagon-providers/wagon-webdav-jackrabbit/src/main/java/org/apache/maven/wagon/providers/webdav/WebDavWagon.java: F:\jenkins\jenkins-slave\workspace\n-box_maven-wagon_WAGON-526-MVYPB7RAMW5VZ4RA4NSMECE376IR6WO6PB7AIWCZTHT5KJGFZFHQ\m\wagon-providers\wagon-webdav-jackrabbit\src\main\java\org\apache\maven\wagon\providers\webdav\WebDavWagon.java uses or overrides a deprecated API.
[windows-jdk9] [INFO] /F:/jenkins/jenkins-slave/workspace/n-box_maven-wagon_WAGON-526-MVYPB7RAMW5VZ4RA4NSMECE376IR6WO6PB7AIWCZTHT5KJGFZFHQ/m/wagon-providers/wagon-webdav-jackrabbit/src/main/java/org/apache/maven/wagon/providers/webdav/WebDavWagon.java: Recompile with -Xlint:deprecation for details.
[windows-jdk9] [INFO]
[windows-jdk9] [INFO] --- plexus-component-metadata:1.7.1:generate-metadata (generate) @ wagon-webdav-jackrabbit ---
[windows-jdk9] [INFO] Discovered 1 component descriptors(s)
[windows-jdk9] [INFO]
[windows-jdk9] [INFO] --- animal-sniffer-maven-plugin:1.15:check (check-java-1.7-compat) @ wagon-webdav-jackrabbit ---
[windows-jdk9] [INFO] Checking unresolved references to org.codehaus.mojo.signature:java17:1.0
[windows-jdk9] [INFO]
[windows-jdk9] [INFO] --- maven-resources-plugin:3.0.2:testResources (default-testResources) @ wagon-webdav-jackrabbit ---
[windows-jdk9] [INFO] Using 'UTF-8' encoding to copy filtered resources.
[windows-jdk9] [INFO] Copying 2 resources
[windows-jdk9] [INFO] Copying 3 resources
[windows-jdk9] [INFO]
[windows-jdk9] [INFO] --- maven-compiler-plugin:3.7.0:testCompile (default-testCompile) @ wagon-webdav-jackrabbit ---
[windows-jdk9] [INFO] Changes detected - recompiling the module!
[windows-jdk9] [INFO] Compiling 4 source files to F:\jenkins\jenkins-slave\workspace\n-box_maven-wagon_WAGON-526-MVYPB7RAMW5VZ4RA4NSMECE376IR6WO6PB7AIWCZTHT5KJGFZFHQ\m\wagon-providers\wagon-webdav-jackrabbit\target\test-classes
[windows-jdk9] [INFO] /F:/jenkins/jenkins-slave/workspace/n-box_maven-wagon_WAGON-526-MVYPB7RAMW5VZ4RA4NSMECE376IR6WO6PB7AIWCZTHT5KJGFZFHQ/m/wagon-providers/wagon-webdav-jackrabbit/src/test/java/org/apache/maven/wagon/providers/webdav/HttpClientWagonTest.java: F:\jenkins\jenkins-slave\workspace\n-box_maven-wagon_WAGON-526-MVYPB7RAMW5VZ4RA4NSMECE376IR6WO6PB7AIWCZTHT5KJGFZFHQ\m\wagon-providers\wagon-webdav-jackrabbit\src\test\java\org\apache\maven\wagon\providers\webdav\HttpClientWagonTest.java uses or overrides a deprecated API.
[windows-jdk9] [INFO] /F:/jenkins/jenkins-slave/workspace/n-box_maven-wagon_WAGON-526-MVYPB7RAMW5VZ4RA4NSMECE376IR6WO6PB7AIWCZTHT5KJGFZFHQ/m/wagon-providers/wagon-webdav-jackrabbit/src/test/java/org/apache/maven/wagon/providers/webdav/HttpClientWagonTest.java: Recompile with -Xlint:deprecation for details.
[windows-jdk9] [INFO]
[windows-jdk9] [INFO] --- maven-surefire-plugin:2.20:test (default-test) @ wagon-webdav-jackrabbit ---
[windows-jdk9] [INFO]
[windows-jdk9] [INFO] -------------------------------------------------------
[windows-jdk9] [INFO]  T E S T S
[windows-jdk9] [INFO] -------------------------------------------------------
[windows-jdk9] [INFO] Running org.apache.maven.wagon.providers.webdav.HttpClientWagonTest
[windows-jdk9] [INFO] Tests run: 6, Failures: 0, Errors: 0, Skipped: 0, Time elapsed: 0.672 s - in org.apache.maven.wagon.providers.webdav.HttpClientWagonTest
[windows-jdk9] [INFO] Running org.apache.maven.wagon.providers.webdav.PathNavigatorTest
[windows-jdk9] [INFO] Tests run: 1, Failures: 0, Errors: 0, Skipped: 0, Time elapsed: 0 s - in org.apache.maven.wagon.providers.webdav.PathNavigatorTest
[windows-jdk9] [INFO] Running org.apache.maven.wagon.providers.webdav.WebDavsWagonTest
[windows-jdk9] [INFO] Tests run: 69, Failures: 0, Errors: 0, Skipped: 0, Time elapsed: 30.468 s - in org.apache.maven.wagon.providers.webdav.WebDavsWagonTest
[windows-jdk9] [INFO] Running org.apache.maven.wagon.providers.webdav.WebDavWagonTest
[windows-jdk9] [INFO] Tests run: 69, Failures: 0, Errors: 0, Skipped: 0, Time elapsed: 26.365 s - in org.apache.maven.wagon.providers.webdav.WebDavWagonTest
[windows-jdk9] [INFO]
[windows-jdk9] [INFO] Results:
[windows-jdk9] [INFO]
[windows-jdk9] [INFO] Tests run: 145, Failures: 0, Errors: 0, Skipped: 0
[windows-jdk9] [INFO]
[windows-jdk9] [INFO]
[windows-jdk9] [INFO] --- maven-jar-plugin:3.0.2:jar (default-jar) @ wagon-webdav-jackrabbit ---
[windows-jdk9] [INFO] Building jar: F:\jenkins\jenkins-slave\workspace\n-box_maven-wagon_WAGON-526-MVYPB7RAMW5VZ4RA4NSMECE376IR6WO6PB7AIWCZTHT5KJGFZFHQ\m\wagon-providers\wagon-webdav-jackrabbit\target\wagon-webdav-jackrabbit-3.1.1-SNAPSHOT.jar
[windows-jdk9] [INFO]
[windows-jdk9] [INFO] --- maven-site-plugin:3.7:attach-descriptor (attach-descriptor) @ wagon-webdav-jackrabbit ---
[windows-jdk9] [INFO] Skipping because packaging 'jar' is not pom.
[windows-jdk9] [INFO]
[windows-jdk9] [INFO] --- maven-checkstyle-plugin:3.0.0:check (checkstyle-check) @ wagon-webdav-jackrabbit ---
[windows-jdk9] [INFO] ------------------------------------------------------------------------
[windows-jdk9] [INFO] Reactor Summary:
[windows-jdk9] [INFO]
[windows-jdk9] [INFO] Apache Maven Wagon ................................. SUCCESS [ 36.046 s]
[windows-jdk9] [INFO] Apache Maven Wagon :: API .......................... SUCCESS [ 13.129 s]
[windows-jdk9] [INFO] Apache Maven Wagon :: Provider Test ................ SUCCESS [  3.552 s]
[windows-jdk9] [INFO] Apache Maven Wagon :: Providers .................... SUCCESS [  1.038 s]
[windows-jdk9] [INFO] Apache Maven Wagon :: Providers :: File Provider ... SUCCESS [  3.793 s]
[windows-jdk9] [INFO] Apache Maven Wagon :: Providers :: FTP Provider .... SUCCESS [  7.119 s]
[windows-jdk9] [INFO] Apache Maven Wagon :: Providers :: HTTP Shared Library SUCCESS [  4.397 s]
[windows-jdk9] [INFO] Apache Maven Wagon :: Test Compatibility Kits ...... SUCCESS [  0.827 s]
[windows-jdk9] [INFO] Apache Maven Wagon :: HTTP Test Compatibility Kit .. SUCCESS [  2.331 s]
[windows-jdk9] [INFO] Apache Maven Wagon :: Providers :: HTTP Provider ... SUCCESS [04:36 min]
[windows-jdk9] [INFO] Apache Maven Wagon :: Providers :: Lightweight HTTP Provider SUCCESS [02:14 min]
[windows-jdk9] [INFO] Apache Maven Wagon :: Providers :: SCM Provider .... SUCCESS [ 31.024 s]
[windows-jdk9] [INFO] Apache Maven Wagon :: Providers :: SSH Common Library SUCCESS [  3.297 s]
[windows-jdk9] [INFO] Apache Maven Wagon :: Providers :: SSH Common Tests  SUCCESS [  2.941 s]
[windows-jdk9] [INFO] Apache Maven Wagon :: Providers :: SSH External Provider SUCCESS [  1.665 s]
[windows-jdk9] [INFO] Apache Maven Wagon :: Providers :: SSH Provider .... SUCCESS [  3.962 s]
[windows-jdk9] [INFO] Apache Maven Wagon :: Providers :: WebDAV Provider . SUCCESS [01:01 min]
[windows-jdk9] [INFO] ------------------------------------------------------------------------
[windows-jdk9] [INFO] BUILD SUCCESS
[windows-jdk9] [INFO] ------------------------------------------------------------------------
[windows-jdk9] [INFO] Total time: 09:51 min
[windows-jdk9] [INFO] Finished at: 2018-09-12T10:54:23-07:00
[windows-jdk9] [INFO] Final Memory: 47M/157M
[windows-jdk9] [INFO] ------------------------------------------------------------------------
[windows-jdk9] [WARNING] The requested profile "run-its" could not be activated because it does not exist.
[windows-jdk9] [INFO] [jenkins-event-spy] Generated F:\jenkins\jenkins-slave\workspace\n-box_maven-wagon_WAGON-526-MVYPB7RAMW5VZ4RA4NSMECE376IR6WO6PB7AIWCZTHT5KJGFZFHQ@tmp\withMaven008df7c3\maven-spy-20180912-104430-6221770851315739647189.log
[Pipeline] [windows-jdk9] }
[Pipeline] [windows-jdk9] // dir
[Pipeline] [windows-jdk9] }
[windows-jdk9] [withMaven] junitPublisher - Archive test results for Maven artifact org.apache.maven.wagon:wagon-provider-api:3.1.1-SNAPSHOT generated by maven-surefire-plugin:test (default-test): m\wagon-provider-api\target\surefire-reports\*.xml
[windows-jdk9] Recording test results
[windows-jdk9] [withMaven] junitPublisher - Archive test results for Maven artifact org.apache.maven.wagon:wagon-provider-test:3.1.1-SNAPSHOT generated by maven-surefire-plugin:test (default-test): m\wagon-provider-test\target\surefire-reports\*.xml
[windows-jdk9] Recording test results
[windows-jdk9] None of the test reports contained any result
[windows-jdk9] [withMaven] junitPublisher - Archive test results for Maven artifact org.apache.maven.wagon:wagon-file:3.1.1-SNAPSHOT generated by maven-surefire-plugin:test (default-test): m\wagon-providers\wagon-file\target\surefire-reports\*.xml
[windows-jdk9] Recording test results
[windows-jdk9] [withMaven] junitPublisher - Archive test results for Maven artifact org.apache.maven.wagon:wagon-ftp:3.1.1-SNAPSHOT generated by maven-surefire-plugin:test (default-test): m\wagon-providers\wagon-ftp\target\surefire-reports\*.xml
[windows-jdk9] Recording test results
[windows-jdk9] [withMaven] junitPublisher - Archive test results for Maven artifact org.apache.maven.wagon:wagon-http-shared:3.1.1-SNAPSHOT generated by maven-surefire-plugin:test (default-test): m\wagon-providers\wagon-http-shared\target\surefire-reports\*.xml
[windows-jdk9] Recording test results
[windows-jdk9] [withMaven] junitPublisher - Archive test results for Maven artifact org.apache.maven.wagon:wagon-tck-http:3.1.1-SNAPSHOT generated by maven-surefire-plugin:test (default-test): m\wagon-tcks\wagon-tck-http\target\surefire-reports\*.xml
[windows-jdk9] Recording test results
[windows-jdk9] None of the test reports contained any result
[windows-jdk9] [withMaven] junitPublisher - Archive test results for Maven artifact org.apache.maven.wagon:wagon-http:3.1.1-SNAPSHOT generated by maven-surefire-plugin:test (default-test): m\wagon-providers\wagon-http\target\surefire-reports\*.xml
[windows-jdk9] Recording test results
[windows-jdk9] [withMaven] junitPublisher - Archive test results for Maven artifact org.apache.maven.wagon:wagon-http-lightweight:3.1.1-SNAPSHOT generated by maven-surefire-plugin:test (default-test): m\wagon-providers\wagon-http-lightweight\target\surefire-reports\*.xml
[windows-jdk9] Recording test results
[windows-jdk9] [withMaven] junitPublisher - Archive test results for Maven artifact org.apache.maven.wagon:wagon-scm:3.1.1-SNAPSHOT generated by maven-surefire-plugin:test (default-test): m\wagon-providers\wagon-scm\target\surefire-reports\*.xml
[windows-jdk9] Recording test results
[windows-jdk9] [withMaven] junitPublisher - Archive test results for Maven artifact org.apache.maven.wagon:wagon-ssh-common:3.1.1-SNAPSHOT generated by maven-surefire-plugin:test (default-test): m\wagon-providers\wagon-ssh-common\target\surefire-reports\*.xml
[windows-jdk9] Recording test results
[windows-jdk9] [withMaven] junitPublisher - Archive test results for Maven artifact org.apache.maven.wagon:wagon-ssh-common-test:3.1.1-SNAPSHOT generated by maven-surefire-plugin:test (default-test): m\wagon-providers\wagon-ssh-common-test\target\surefire-reports\*.xml
[windows-jdk9] Recording test results
[windows-jdk9] None of the test reports contained any result
[windows-jdk9] [withMaven] junitPublisher - Archive test results for Maven artifact org.apache.maven.wagon:wagon-ssh-external:3.1.1-SNAPSHOT generated by maven-surefire-plugin:test (default-test): m\wagon-providers\wagon-ssh-external\target\surefire-reports\*.xml
[windows-jdk9] Recording test results
[windows-jdk9] None of the test reports contained any result
[windows-jdk9] [withMaven] junitPublisher - Archive test results for Maven artifact org.apache.maven.wagon:wagon-ssh:3.1.1-SNAPSHOT generated by maven-surefire-plugin:test (default-test): m\wagon-providers\wagon-ssh\target\surefire-reports\*.xml
[windows-jdk9] Recording test results
[windows-jdk9] None of the test reports contained any result
[windows-jdk9] [withMaven] junitPublisher - Archive test results for Maven artifact org.apache.maven.wagon:wagon-webdav-jackrabbit:3.1.1-SNAPSHOT generated by maven-surefire-plugin:test (default-test): m\wagon-providers\wagon-webdav-jackrabbit\target\surefire-reports\*.xml
[windows-jdk9] Recording test results
[Pipeline] [windows-jdk9] // withMaven
[Pipeline] [windows-jdk9] cleanWs
[windows-jdk9] [WS-CLEANUP] Deleting project workspace...[WS-CLEANUP] done
[Pipeline] [windows-jdk9] }
[Pipeline] [windows-jdk9] // stage
[Pipeline] [windows-jdk9] }
[Pipeline] [windows-jdk9] // node
[Pipeline] [windows-jdk9] }
[Pipeline] // parallel
[Pipeline] stage
[Pipeline] { (Notifications)
[Pipeline] echo
Build result: FAILURE
[Pipeline] jiraIssueSelector
[Pipeline] emailext
Reply | Threaded
Open this post in threaded view
|

Build failed in Jenkins: Maven TLP » maven-wagon » WAGON-526 #4

Apache Jenkins Server-2
See https://builds.apache.org/job/maven-box/job/maven-wagon/job/WAGON-526/4/

No changes.

28 tests failed.
FAILED:  org.apache.maven.wagon.providers.scm.ScmGitExeWagonTest.testWagonPutDirectory

Error Message:
Error interacting with SCM: Unable to commit file. The git-commit command failed.
*** Please tell me who you are.

Run

  git config --global user.email "[hidden email]"
  git config --global user.name "Your Name"

to set your account's default identity.
Omit --global to set the identity only in this repository.

fatal:********@base.apache.org>) not allowed


Stack Trace:
org.apache.maven.wagon.TransferFailedException:
Error interacting with SCM: Unable to commit file. The git-commit command failed.
*** Please tell me who you are.

Run

  git config --global user.email "[hidden email]"
  git config --global user.name "Your Name"

to set your account's default identity.
Omit --global to set the identity only in this repository.

fatal:********@base.apache.org>) not allowed

Caused by: org.apache.maven.scm.ScmException:
Unable to commit file. The git-commit command failed.
*** Please tell me who you are.

Run

  git config --global user.email "[hidden email]"
  git config --global user.name "Your Name"

to set your account's default identity.
Omit --global to set the identity only in this repository.

fatal:********@base.apache.org>) not allowed



FAILED:  org.apache.maven.wagon.providers.scm.ScmGitExeWagonTest.testWagonPutDirectoryDeepDestination

Error Message:
Error interacting with SCM: Unable to commit file. The git-commit command failed.
*** Please tell me who you are.

Run

  git config --global user.email "[hidden email]"
  git config --global user.name "Your Name"

to set your account's default identity.
Omit --global to set the identity only in this repository.

fatal:********@base.apache.org>) not allowed


Stack Trace:
org.apache.maven.wagon.TransferFailedException:
Error interacting with SCM: Unable to commit file. The git-commit command failed.
*** Please tell me who you are.

Run

  git config --global user.email "[hidden email]"
  git config --global user.name "Your Name"

to set your account's default identity.
Omit --global to set the identity only in this repository.

fatal:********@base.apache.org>) not allowed

Caused by: org.apache.maven.scm.ScmException:
Unable to commit file. The git-commit command failed.
*** Please tell me who you are.

Run

  git config --global user.email "[hidden email]"
  git config --global user.name "Your Name"

to set your account's default identity.
Omit --global to set the identity only in this repository.

fatal:********@base.apache.org>) not allowed



FAILED:  org.apache.maven.wagon.providers.scm.ScmGitExeWagonTest.testWagon

Error Message:

  Unexpected method call TransferListener.transferError(TransferEvent[PUT|ERROR|Repository[scm:git:file:///home/jenkins/jenkins-slave/workspace/n-box_maven-wagon_WAGON-526-MVYPB7RAMW5VZ4RA4NSMECE376IR6WO6PB7AIWCZTHT5KJGFZFHQ/m/wagon-providers/wagon-scm/target/test-classes/test-repo-git-test/]|null|test-resource[len = 18; mod = 1536861035000]]):
    TransferListener.transferCompleted(TransferEvent[PUT|COMPLETED|Repository[scm:git:file:///home/jenkins/jenkins-slave/workspace/n-box_maven-wagon_WAGON-526-MVYPB7RAMW5VZ4RA4NSMECE376IR6WO6PB7AIWCZTHT5KJGFZFHQ/m/wagon-providers/wagon-scm/target/test-classes/test-repo-git-test/]|/home/jenkins/jenkins-slave/workspace/n-box_maven-wagon_WAGON-526-MVYPB7RAMW5VZ4RA4NSMECE376IR6WO6PB7AIWCZTHT5KJGFZFHQ/m/wagon-providers/wagon-scm/target/test-output/test-resource|test-resource[len = 18; mod = 1536861035000]]): expected: 1, actual: 0

Stack Trace:
java.lang.AssertionError:

  Unexpected method call TransferListener.transferError(TransferEvent[PUT|ERROR|Repository[scm:git:file:///home/jenkins/jenkins-slave/workspace/n-box_maven-wagon_WAGON-526-MVYPB7RAMW5VZ4RA4NSMECE376IR6WO6PB7AIWCZTHT5KJGFZFHQ/m/wagon-providers/wagon-scm/target/test-classes/test-repo-git-test/]|null|test-resource[len = 18; mod = 1536861035000]]):
    TransferListener.transferCompleted(TransferEvent[PUT|COMPLETED|Repository[scm:git:file:///home/jenkins/jenkins-slave/workspace/n-box_maven-wagon_WAGON-526-MVYPB7RAMW5VZ4RA4NSMECE376IR6WO6PB7AIWCZTHT5KJGFZFHQ/m/wagon-providers/wagon-scm/target/test-classes/test-repo-git-test/]|/home/jenkins/jenkins-slave/workspace/n-box_maven-wagon_WAGON-526-MVYPB7RAMW5VZ4RA4NSMECE376IR6WO6PB7AIWCZTHT5KJGFZFHQ/m/wagon-providers/wagon-scm/target/test-output/test-resource|test-resource[len = 18; mod = 1536861035000]]): expected: 1, actual: 0


FAILED:  org.apache.maven.wagon.providers.scm.ScmGitExeWagonTest.testWagonPutDirectoryForDot

Error Message:
Error interacting with SCM: Unable to commit file. The git-commit command failed.
*** Please tell me who you are.

Run

  git config --global user.email "[hidden email]"
  git config --global user.name "Your Name"

to set your account's default identity.
Omit --global to set the identity only in this repository.

fatal:********@base.apache.org>) not allowed


Stack Trace:
org.apache.maven.wagon.TransferFailedException:
Error interacting with SCM: Unable to commit file. The git-commit command failed.
*** Please tell me who you are.

Run

  git config --global user.email "[hidden email]"
  git config --global user.name "Your Name"

to set your account's default identity.
Omit --global to set the identity only in this repository.

fatal:********@base.apache.org>) not allowed

Caused by: org.apache.maven.scm.ScmException:
Unable to commit file. The git-commit command failed.
*** Please tell me who you are.

Run

  git config --global user.email "[hidden email]"
  git config --global user.name "Your Name"

to set your account's default identity.
Omit --global to set the identity only in this repository.

fatal:********@base.apache.org>) not allowed



FAILED:  org.apache.maven.wagon.providers.scm.ScmGitExeWagonTest.testWagonPutDirectoryWhenDirectoryAlreadyExists

Error Message:
Error interacting with SCM: Unable to commit file. The git-commit command failed.
*** Please tell me who you are.

Run

  git config --global user.email "[hidden email]"
  git config --global user.name "Your Name"

to set your account's default identity.
Omit --global to set the identity only in this repository.

fatal:********@base.apache.org>) not allowed


Stack Trace:
org.apache.maven.wagon.TransferFailedException:
Error interacting with SCM: Unable to commit file. The git-commit command failed.
*** Please tell me who you are.

Run

  git config --global user.email "[hidden email]"
  git config --global user.name "Your Name"

to set your account's default identity.
Omit --global to set the identity only in this repository.

fatal:********@base.apache.org>) not allowed

Caused by: org.apache.maven.scm.ScmException:
Unable to commit file. The git-commit command failed.
*** Please tell me who you are.

Run

  git config --global user.email "[hidden email]"
  git config --global user.name "Your Name"

to set your account's default identity.
Omit --global to set the identity only in this repository.

fatal:********@base.apache.org>) not allowed



FAILED:  org.apache.maven.wagon.providers.scm.ScmGitExeWagonTest.testWagonPutDirectory

Error Message:
Error checking out: command failed: Cloning into 'F:\jenkins\jenkins-slave\workspace\n-box_maven-wagon_WAGON-526-MVYPB7RAMW5VZ4RA4NSMECE376IR6WO6PB7AIWCZTHT5KJGFZFHQ\m\wagon-providers\wagon-scm\target\test-output\checkout-org.apache.maven.scm.provider.git.gitexe.GitExeScmProvider'...
fatal: cannot stat 'F:/jenkins/jenkins-slave/workspace/n-box_maven-wagon_WAGON-526-MVYPB7RAMW5VZ4RA4NSMECE376IR6WO6PB7AIWCZTHT5KJGFZFHQ/m/wagon-providers/wagon-scm/target/test-output/checkout-org.apache.maven.scm.provider.git.gitexe.GitExeScmProvider/.git/hooks/applypatch-msg.sample': Filename too long

Stack Trace:
org.apache.maven.wagon.TransferFailedException:
Error checking out: command failed: Cloning into 'F:\jenkins\jenkins-slave\workspace\n-box_maven-wagon_WAGON-526-MVYPB7RAMW5VZ4RA4NSMECE376IR6WO6PB7AIWCZTHT5KJGFZFHQ\m\wagon-providers\wagon-scm\target\test-output\checkout-org.apache.maven.scm.provider.git.gitexe.GitExeScmProvider'...
fatal: cannot stat 'F:/jenkins/jenkins-slave/workspace/n-box_maven-wagon_WAGON-526-MVYPB7RAMW5VZ4RA4NSMECE376IR6WO6PB7AIWCZTHT5KJGFZFHQ/m/wagon-providers/wagon-scm/target/test-output/checkout-org.apache.maven.scm.provider.git.gitexe.GitExeScmProvider/.git/hooks/applypatch-msg.sample': Filename too long
Caused by: org.apache.maven.scm.ScmException:
command failed: Cloning into 'F:\jenkins\jenkins-slave\workspace\n-box_maven-wagon_WAGON-526-MVYPB7RAMW5VZ4RA4NSMECE376IR6WO6PB7AIWCZTHT5KJGFZFHQ\m\wagon-providers\wagon-scm\target\test-output\checkout-org.apache.maven.scm.provider.git.gitexe.GitExeScmProvider'...
fatal: cannot stat 'F:/jenkins/jenkins-slave/workspace/n-box_maven-wagon_WAGON-526-MVYPB7RAMW5VZ4RA4NSMECE376IR6WO6PB7AIWCZTHT5KJGFZFHQ/m/wagon-providers/wagon-scm/target/test-output/checkout-org.apache.maven.scm.provider.git.gitexe.GitExeScmProvider/.git/hooks/applypatch-msg.sample': Filename too long


FAILED:  org.apache.maven.wagon.providers.scm.ScmGitExeWagonTest.testWagonPutDirectoryDeepDestination

Error Message:
Error checking out: command failed: Cloning into 'F:\jenkins\jenkins-slave\workspace\n-box_maven-wagon_WAGON-526-MVYPB7RAMW5VZ4RA4NSMECE376IR6WO6PB7AIWCZTHT5KJGFZFHQ\m\wagon-providers\wagon-scm\target\test-output\checkout-org.apache.maven.scm.provider.git.gitexe.GitExeScmProvider'...
fatal: cannot stat 'F:/jenkins/jenkins-slave/workspace/n-box_maven-wagon_WAGON-526-MVYPB7RAMW5VZ4RA4NSMECE376IR6WO6PB7AIWCZTHT5KJGFZFHQ/m/wagon-providers/wagon-scm/target/test-output/checkout-org.apache.maven.scm.provider.git.gitexe.GitExeScmProvider/.git/hooks/applypatch-msg.sample': Filename too long

Stack Trace:
org.apache.maven.wagon.TransferFailedException:
Error checking out: command failed: Cloning into 'F:\jenkins\jenkins-slave\workspace\n-box_maven-wagon_WAGON-526-MVYPB7RAMW5VZ4RA4NSMECE376IR6WO6PB7AIWCZTHT5KJGFZFHQ\m\wagon-providers\wagon-scm\target\test-output\checkout-org.apache.maven.scm.provider.git.gitexe.GitExeScmProvider'...
fatal: cannot stat 'F:/jenkins/jenkins-slave/workspace/n-box_maven-wagon_WAGON-526-MVYPB7RAMW5VZ4RA4NSMECE376IR6WO6PB7AIWCZTHT5KJGFZFHQ/m/wagon-providers/wagon-scm/target/test-output/checkout-org.apache.maven.scm.provider.git.gitexe.GitExeScmProvider/.git/hooks/applypatch-msg.sample': Filename too long
Caused by: org.apache.maven.scm.ScmException:
command failed: Cloning into 'F:\jenkins\jenkins-slave\workspace\n-box_maven-wagon_WAGON-526-MVYPB7RAMW5VZ4RA4NSMECE376IR6WO6PB7AIWCZTHT5KJGFZFHQ\m\wagon-providers\wagon-scm\target\test-output\checkout-org.apache.maven.scm.provider.git.gitexe.GitExeScmProvider'...
fatal: cannot stat 'F:/jenkins/jenkins-slave/workspace/n-box_maven-wagon_WAGON-526-MVYPB7RAMW5VZ4RA4NSMECE376IR6WO6PB7AIWCZTHT5KJGFZFHQ/m/wagon-providers/wagon-scm/target/test-output/checkout-org.apache.maven.scm.provider.git.gitexe.GitExeScmProvider/.git/hooks/applypatch-msg.sample': Filename too long


FAILED:  org.apache.maven.wagon.providers.scm.ScmGitExeWagonTest.testWagon

Error Message:

  Unexpected method call TransferListener.transferError(TransferEvent[GET|ERROR|Repository[scm:git:file:///F:/jenkins/jenkins-slave/workspace/n-box_maven-wagon_WAGON-526-MVYPB7RAMW5VZ4RA4NSMECE376IR6WO6PB7AIWCZTHT5KJGFZFHQ/m/wagon-providers/wagon-scm/target/test-classes/test-repo-git-test/]|null|test-resource[len = 18; mod = 1536861164842]]):
    TransferListener.transferCompleted(TransferEvent[PUT|COMPLETED|Repository[scm:git:file:///F:/jenkins/jenkins-slave/workspace/n-box_maven-wagon_WAGON-526-MVYPB7RAMW5VZ4RA4NSMECE376IR6WO6PB7AIWCZTHT5KJGFZFHQ/m/wagon-providers/wagon-scm/target/test-classes/test-repo-git-test/]|F:\jenkins\jenkins-slave\workspace\n-box_maven-wagon_WAGON-526-MVYPB7RAMW5VZ4RA4NSMECE376IR6WO6PB7AIWCZTHT5KJGFZFHQ\m\wagon-providers\wagon-scm\target\test-output\test-resource|test-resource[len = 18; mod = 1536861164842]]): expected: 1, actual: 0

Stack Trace:
java.lang.AssertionError:

  Unexpected method call TransferListener.transferError(TransferEvent[GET|ERROR|Repository[scm:git:file:///F:/jenkins/jenkins-slave/workspace/n-box_maven-wagon_WAGON-526-MVYPB7RAMW5VZ4RA4NSMECE376IR6WO6PB7AIWCZTHT5KJGFZFHQ/m/wagon-providers/wagon-scm/target/test-classes/test-repo-git-test/]|null|test-resource[len = 18; mod = 1536861164842]]):
    TransferListener.transferCompleted(TransferEvent[PUT|COMPLETED|Repository[scm:git:file:///F:/jenkins/jenkins-slave/workspace/n-box_maven-wagon_WAGON-526-MVYPB7RAMW5VZ4RA4NSMECE376IR6WO6PB7AIWCZTHT5KJGFZFHQ/m/wagon-providers/wagon-scm/target/test-classes/test-repo-git-test/]|F:\jenkins\jenkins-slave\workspace\n-box_maven-wagon_WAGON-526-MVYPB7RAMW5VZ4RA4NSMECE376IR6WO6PB7AIWCZTHT5KJGFZFHQ\m\wagon-providers\wagon-scm\target\test-output\test-resource|test-resource[len = 18; mod = 1536861164842]]): expected: 1, actual: 0


FAILED:  org.apache.maven.wagon.providers.scm.ScmGitExeWagonTest.testWagonPutDirectoryForDot

Error Message:
Error checking out: command failed: Cloning into 'F:\jenkins\jenkins-slave\workspace\n-box_maven-wagon_WAGON-526-MVYPB7RAMW5VZ4RA4NSMECE376IR6WO6PB7AIWCZTHT5KJGFZFHQ\m\wagon-providers\wagon-scm\target\test-output\checkout-org.apache.maven.scm.provider.git.gitexe.GitExeScmProvider'...
fatal: cannot stat 'F:/jenkins/jenkins-slave/workspace/n-box_maven-wagon_WAGON-526-MVYPB7RAMW5VZ4RA4NSMECE376IR6WO6PB7AIWCZTHT5KJGFZFHQ/m/wagon-providers/wagon-scm/target/test-output/checkout-org.apache.maven.scm.provider.git.gitexe.GitExeScmProvider/.git/hooks/applypatch-msg.sample': Filename too long

Stack Trace:
org.apache.maven.wagon.TransferFailedException:
Error checking out: command failed: Cloning into 'F:\jenkins\jenkins-slave\workspace\n-box_maven-wagon_WAGON-526-MVYPB7RAMW5VZ4RA4NSMECE376IR6WO6PB7AIWCZTHT5KJGFZFHQ\m\wagon-providers\wagon-scm\target\test-output\checkout-org.apache.maven.scm.provider.git.gitexe.GitExeScmProvider'...
fatal: cannot stat 'F:/jenkins/jenkins-slave/workspace/n-box_maven-wagon_WAGON-526-MVYPB7RAMW5VZ4RA4NSMECE376IR6WO6PB7AIWCZTHT5KJGFZFHQ/m/wagon-providers/wagon-scm/target/test-output/checkout-org.apache.maven.scm.provider.git.gitexe.GitExeScmProvider/.git/hooks/applypatch-msg.sample': Filename too long
Caused by: org.apache.maven.scm.ScmException:
command failed: Cloning into 'F:\jenkins\jenkins-slave\workspace\n-box_maven-wagon_WAGON-526-MVYPB7RAMW5VZ4RA4NSMECE376IR6WO6PB7AIWCZTHT5KJGFZFHQ\m\wagon-providers\wagon-scm\target\test-output\checkout-org.apache.maven.scm.provider.git.gitexe.GitExeScmProvider'...
fatal: cannot stat 'F:/jenkins/jenkins-slave/workspace/n-box_maven-wagon_WAGON-526-MVYPB7RAMW5VZ4RA4NSMECE376IR6WO6PB7AIWCZTHT5KJGFZFHQ/m/wagon-providers/wagon-scm/target/test-output/checkout-org.apache.maven.scm.provider.git.gitexe.GitExeScmProvider/.git/hooks/applypatch-msg.sample': Filename too long


FAILED:  org.apache.maven.wagon.providers.scm.ScmGitExeWagonTest.testFailedGet

Error Message:
Error getting file from SCM

Stack Trace:
org.apache.maven.wagon.TransferFailedException: Error getting file from SCM
Caused by: org.apache.maven.scm.ScmException:
command failed: Cloning into 'F:\jenkins\jenkins-slave\workspace\n-box_maven-wagon_WAGON-526-MVYPB7RAMW5VZ4RA4NSMECE376IR6WO6PB7AIWCZTHT5KJGFZFHQ\m\wagon-providers\wagon-scm\target\test-output\checkout-org.apache.maven.scm.provider.git.gitexe.GitExeScmProvider'...
fatal: cannot stat 'F:/jenkins/jenkins-slave/workspace/n-box_maven-wagon_WAGON-526-MVYPB7RAMW5VZ4RA4NSMECE376IR6WO6PB7AIWCZTHT5KJGFZFHQ/m/wagon-providers/wagon-scm/target/test-output/checkout-org.apache.maven.scm.provider.git.gitexe.GitExeScmProvider/.git/hooks/applypatch-msg.sample': Filename too long


FAILED:  org.apache.maven.wagon.providers.scm.ScmGitExeWagonTest.testWagonPutDirectoryWhenDirectoryAlreadyExists

Error Message:
Error checking out: command failed: Cloning into 'F:\jenkins\jenkins-slave\workspace\n-box_maven-wagon_WAGON-526-MVYPB7RAMW5VZ4RA4NSMECE376IR6WO6PB7AIWCZTHT5KJGFZFHQ\m\wagon-providers\wagon-scm\target\test-output\checkout-org.apache.maven.scm.provider.git.gitexe.GitExeScmProvider'...
fatal: cannot stat 'F:/jenkins/jenkins-slave/workspace/n-box_maven-wagon_WAGON-526-MVYPB7RAMW5VZ4RA4NSMECE376IR6WO6PB7AIWCZTHT5KJGFZFHQ/m/wagon-providers/wagon-scm/target/test-output/checkout-org.apache.maven.scm.provider.git.gitexe.GitExeScmProvider/.git/hooks/applypatch-msg.sample': Filename too long

Stack Trace:
org.apache.maven.wagon.TransferFailedException:
Error checking out: command failed: Cloning into 'F:\jenkins\jenkins-slave\workspace\n-box_maven-wagon_WAGON-526-MVYPB7RAMW5VZ4RA4NSMECE376IR6WO6PB7AIWCZTHT5KJGFZFHQ\m\wagon-providers\wagon-scm\target\test-output\checkout-org.apache.maven.scm.provider.git.gitexe.GitExeScmProvider'...
fatal: cannot stat 'F:/jenkins/jenkins-slave/workspace/n-box_maven-wagon_WAGON-526-MVYPB7RAMW5VZ4RA4NSMECE376IR6WO6PB7AIWCZTHT5KJGFZFHQ/m/wagon-providers/wagon-scm/target/test-output/checkout-org.apache.maven.scm.provider.git.gitexe.GitExeScmProvider/.git/hooks/applypatch-msg.sample': Filename too long
Caused by: org.apache.maven.scm.ScmException:
command failed: Cloning into 'F:\jenkins\jenkins-slave\workspace\n-box_maven-wagon_WAGON-526-MVYPB7RAMW5VZ4RA4NSMECE376IR6WO6PB7AIWCZTHT5KJGFZFHQ\m\wagon-providers\wagon-scm\target\test-output\checkout-org.apache.maven.scm.provider.git.gitexe.GitExeScmProvider'...
fatal: cannot stat 'F:/jenkins/jenkins-slave/workspace/n-box_maven-wagon_WAGON-526-MVYPB7RAMW5VZ4RA4NSMECE376IR6WO6PB7AIWCZTHT5KJGFZFHQ/m/wagon-providers/wagon-scm/target/test-output/checkout-org.apache.maven.scm.provider.git.gitexe.GitExeScmProvider/.git/hooks/applypatch-msg.sample': Filename too long


FAILED:  org.apache.maven.wagon.providers.scm.ScmGitExeWagonTest.testWagonPutDirectory

Error Message:
Error interacting with SCM: Unable to commit file. The git-commit command failed.
*** Please tell me who you are.

Run

  git config --global user.email "[hidden email]"
  git config --global user.name "Your Name"

to set your account's default identity.
Omit --global to set the identity only in this repository.

fatal:********@asf924.gq1.ygridcore.net>) not allowed


Stack Trace:
org.apache.maven.wagon.TransferFailedException:
Error interacting with SCM: Unable to commit file. The git-commit command failed.
*** Please tell me who you are.

Run

  git config --global user.email "[hidden email]"
  git config --global user.name "Your Name"

to set your account's default identity.
Omit --global to set the identity only in this repository.

fatal:********@asf924.gq1.ygridcore.net>) not allowed

Caused by: org.apache.maven.scm.ScmException:
Unable to commit file. The git-commit command failed.
*** Please tell me who you are.

Run

  git config --global user.email "[hidden email]"
  git config --global user.name "Your Name"

to set your account's default identity.
Omit --global to set the identity only in this repository.

fatal:********@asf924.gq1.ygridcore.net>) not allowed



FAILED:  org.apache.maven.wagon.providers.scm.ScmGitExeWagonTest.testWagonPutDirectoryDeepDestination

Error Message:
Error interacting with SCM: Unable to commit file. The git-commit command failed.
*** Please tell me who you are.

Run

  git config --global user.email "[hidden email]"
  git config --global user.name "Your Name"

to set your account's default identity.
Omit --global to set the identity only in this repository.

fatal:********@asf924.gq1.ygridcore.net>) not allowed


Stack Trace:
org.apache.maven.wagon.TransferFailedException:
Error interacting with SCM: Unable to commit file. The git-commit command failed.
*** Please tell me who you are.

Run

  git config --global user.email "[hidden email]"
  git config --global user.name "Your Name"

to set your account's default identity.
Omit --global to set the identity only in this repository.

fatal:********@asf924.gq1.ygridcore.net>) not allowed

Caused by: org.apache.maven.scm.ScmException:
Unable to commit file. The git-commit command failed.
*** Please tell me who you are.

Run

  git config --global user.email "[hidden email]"
  git config --global user.name "Your Name"

to set your account's default identity.
Omit --global to set the identity only in this repository.

fatal:********@asf924.gq1.ygridcore.net>) not allowed



FAILED:  org.apache.maven.wagon.providers.scm.ScmGitExeWagonTest.testWagon

Error Message:

  Unexpected method call TransferListener.transferError(TransferEvent[PUT|ERROR|Repository[scm:git:file:///home/jenkins/jenkins-slave/workspace/n-box_maven-wagon_WAGON-526-MVYPB7RAMW5VZ4RA4NSMECE376IR6WO6PB7AIWCZTHT5KJGFZFHQ/m/wagon-providers/wagon-scm/target/test-classes/test-repo-git-test/]|null|test-resource[len = 18; mod = 1536861203000]]):
    TransferListener.transferCompleted(TransferEvent[PUT|COMPLETED|Repository[scm:git:file:///home/jenkins/jenkins-slave/workspace/n-box_maven-wagon_WAGON-526-MVYPB7RAMW5VZ4RA4NSMECE376IR6WO6PB7AIWCZTHT5KJGFZFHQ/m/wagon-providers/wagon-scm/target/test-classes/test-repo-git-test/]|/home/jenkins/jenkins-slave/workspace/n-box_maven-wagon_WAGON-526-MVYPB7RAMW5VZ4RA4NSMECE376IR6WO6PB7AIWCZTHT5KJGFZFHQ/m/wagon-providers/wagon-scm/target/test-output/test-resource|test-resource[len = 18; mod = 1536861203000]]): expected: 1, actual: 0

Stack Trace:
java.lang.AssertionError:

  Unexpected method call TransferListener.transferError(TransferEvent[PUT|ERROR|Repository[scm:git:file:///home/jenkins/jenkins-slave/workspace/n-box_maven-wagon_WAGON-526-MVYPB7RAMW5VZ4RA4NSMECE376IR6WO6PB7AIWCZTHT5KJGFZFHQ/m/wagon-providers/wagon-scm/target/test-classes/test-repo-git-test/]|null|test-resource[len = 18; mod = 1536861203000]]):
    TransferListener.transferCompleted(TransferEvent[PUT|COMPLETED|Repository[scm:git:file:///home/jenkins/jenkins-slave/workspace/n-box_maven-wagon_WAGON-526-MVYPB7RAMW5VZ4RA4NSMECE376IR6WO6PB7AIWCZTHT5KJGFZFHQ/m/wagon-providers/wagon-scm/target/test-classes/test-repo-git-test/]|/home/jenkins/jenkins-slave/workspace/n-box_maven-wagon_WAGON-526-MVYPB7RAMW5VZ4RA4NSMECE376IR6WO6PB7AIWCZTHT5KJGFZFHQ/m/wagon-providers/wagon-scm/target/test-output/test-resource|test-resource[len = 18; mod = 1536861203000]]): expected: 1, actual: 0


FAILED:  org.apache.maven.wagon.providers.scm.ScmGitExeWagonTest.testWagonPutDirectoryForDot

Error Message:
Error interacting with SCM: Unable to commit file. The git-commit command failed.
*** Please tell me who you are.

Run

  git config --global user.email "[hidden email]"
  git config --global user.name "Your Name"

to set your account's default identity.
Omit --global to set the identity only in this repository.

fatal:********@asf924.gq1.ygridcore.net>) not allowed


Stack Trace:
org.apache.maven.wagon.TransferFailedException:
Error interacting with SCM: Unable to commit file. The git-commit command failed.
*** Please tell me who you are.

Run

  git config --global user.email "[hidden email]"
  git config --global user.name "Your Name"

to set your account's default identity.
Omit --global to set the identity only in this repository.

fatal:********@asf924.gq1.ygridcore.net>) not allowed

Caused by: org.apache.maven.scm.ScmException:
Unable to commit file. The git-commit command failed.
*** Please tell me who you are.

Run

  git config --global user.email "[hidden email]"
  git config --global user.name "Your Name"

to set your account's default identity.
Omit --global to set the identity only in this repository.

fatal:********@asf924.gq1.ygridcore.net>) not allowed



FAILED:  org.apache.maven.wagon.providers.scm.ScmGitExeWagonTest.testWagonPutDirectoryWhenDirectoryAlreadyExists

Error Message:
Error interacting with SCM: Unable to commit file. The git-commit command failed.
*** Please tell me who you are.

Run

  git config --global user.email "[hidden email]"
  git config --global user.name "Your Name"

to set your account's default identity.
Omit --global to set the identity only in this repository.

fatal:********@asf924.gq1.ygridcore.net>) not allowed


Stack Trace:
org.apache.maven.wagon.TransferFailedException:
Error interacting with SCM: Unable to commit file. The git-commit command failed.
*** Please tell me who you are.

Run

  git config --global user.email "[hidden email]"
  git config --global user.name "Your Name"

to set your account's default identity.
Omit --global to set the identity only in this repository.

fatal:********@asf924.gq1.ygridcore.net>) not allowed

Caused by: org.apache.maven.scm.ScmException:
Unable to commit file. The git-commit command failed.
*** Please tell me who you are.

Run

  git config --global user.email "[hidden email]"
  git config --global user.name "Your Name"

to set your account's default identity.
Omit --global to set the identity only in this repository.

fatal:********@asf924.gq1.ygridcore.net>) not allowed



FAILED:  org.apache.maven.wagon.providers.scm.ScmGitExeWagonTest.testWagonPutDirectory

Error Message:
Error checking out: command failed: Cloning into 'F:\jenkins\jenkins-slave\workspace\n-box_maven-wagon_WAGON-526-MVYPB7RAMW5VZ4RA4NSMECE376IR6WO6PB7AIWCZTHT5KJGFZFHQ\m\wagon-providers\wagon-scm\target\test-output\checkout-org.apache.maven.scm.provider.git.gitexe.GitExeScmProvider'...
fatal: '$GIT_DIR' too big
fatal: index-pack failed

Stack Trace:
org.apache.maven.wagon.TransferFailedException:
Error checking out: command failed: Cloning into 'F:\jenkins\jenkins-slave\workspace\n-box_maven-wagon_WAGON-526-MVYPB7RAMW5VZ4RA4NSMECE376IR6WO6PB7AIWCZTHT5KJGFZFHQ\m\wagon-providers\wagon-scm\target\test-output\checkout-org.apache.maven.scm.provider.git.gitexe.GitExeScmProvider'...
fatal: '$GIT_DIR' too big
fatal: index-pack failed
Caused by: org.apache.maven.scm.ScmException:
command failed: Cloning into 'F:\jenkins\jenkins-slave\workspace\n-box_maven-wagon_WAGON-526-MVYPB7RAMW5VZ4RA4NSMECE376IR6WO6PB7AIWCZTHT5KJGFZFHQ\m\wagon-providers\wagon-scm\target\test-output\checkout-org.apache.maven.scm.provider.git.gitexe.GitExeScmProvider'...
fatal: '$GIT_DIR' too big
fatal: index-pack failed


FAILED:  org.apache.maven.wagon.providers.scm.ScmGitExeWagonTest.testWagonPutDirectoryDeepDestination

Error Message:
Error checking out: command failed: Cloning into 'F:\jenkins\jenkins-slave\workspace\n-box_maven-wagon_WAGON-526-MVYPB7RAMW5VZ4RA4NSMECE376IR6WO6PB7AIWCZTHT5KJGFZFHQ\m\wagon-providers\wagon-scm\target\test-output\checkout-org.apache.maven.scm.provider.git.gitexe.GitExeScmProvider'...
fatal: '$GIT_DIR' too big
fatal: index-pack failed

Stack Trace:
org.apache.maven.wagon.TransferFailedException:
Error checking out: command failed: Cloning into 'F:\jenkins\jenkins-slave\workspace\n-box_maven-wagon_WAGON-526-MVYPB7RAMW5VZ4RA4NSMECE376IR6WO6PB7AIWCZTHT5KJGFZFHQ\m\wagon-providers\wagon-scm\target\test-output\checkout-org.apache.maven.scm.provider.git.gitexe.GitExeScmProvider'...
fatal: '$GIT_DIR' too big
fatal: index-pack failed
Caused by: org.apache.maven.scm.ScmException:
command failed: Cloning into 'F:\jenkins\jenkins-slave\workspace\n-box_maven-wagon_WAGON-526-MVYPB7RAMW5VZ4RA4NSMECE376IR6WO6PB7AIWCZTHT5KJGFZFHQ\m\wagon-providers\wagon-scm\target\test-output\checkout-org.apache.maven.scm.provider.git.gitexe.GitExeScmProvider'...
fatal: '$GIT_DIR' too big
fatal: index-pack failed


FAILED:  org.apache.maven.wagon.providers.scm.ScmGitExeWagonTest.testWagon

Error Message:

  Unexpected method call TransferListener.transferError(TransferEvent[GET|ERROR|Repository[scm:git:file:///F:/jenkins/jenkins-slave/workspace/n-box_maven-wagon_WAGON-526-MVYPB7RAMW5VZ4RA4NSMECE376IR6WO6PB7AIWCZTHT5KJGFZFHQ/m/wagon-providers/wagon-scm/target/test-classes/test-repo-git-test/]|null|test-resource[len = 18; mod = 1536861182200]]):
    TransferListener.transferCompleted(TransferEvent[PUT|COMPLETED|Repository[scm:git:file:///F:/jenkins/jenkins-slave/workspace/n-box_maven-wagon_WAGON-526-MVYPB7RAMW5VZ4RA4NSMECE376IR6WO6PB7AIWCZTHT5KJGFZFHQ/m/wagon-providers/wagon-scm/target/test-classes/test-repo-git-test/]|F:\jenkins\jenkins-slave\workspace\n-box_maven-wagon_WAGON-526-MVYPB7RAMW5VZ4RA4NSMECE376IR6WO6PB7AIWCZTHT5KJGFZFHQ\m\wagon-providers\wagon-scm\target\test-output\test-resource|test-resource[len = 18; mod = 1536861182200]]): expected: 1, actual: 0

Stack Trace:
java.lang.AssertionError:

  Unexpected method call TransferListener.transferError(TransferEvent[GET|ERROR|Repository[scm:git:file:///F:/jenkins/jenkins-slave/workspace/n-box_maven-wagon_WAGON-526-MVYPB7RAMW5VZ4RA4NSMECE376IR6WO6PB7AIWCZTHT5KJGFZFHQ/m/wagon-providers/wagon-scm/target/test-classes/test-repo-git-test/]|null|test-resource[len = 18; mod = 1536861182200]]):
    TransferListener.transferCompleted(TransferEvent[PUT|COMPLETED|Repository[scm:git:file:///F:/jenkins/jenkins-slave/workspace/n-box_maven-wagon_WAGON-526-MVYPB7RAMW5VZ4RA4NSMECE376IR6WO6PB7AIWCZTHT5KJGFZFHQ/m/wagon-providers/wagon-scm/target/test-classes/test-repo-git-test/]|F:\jenkins\jenkins-slave\workspace\n-box_maven-wagon_WAGON-526-MVYPB7RAMW5VZ4RA4NSMECE376IR6WO6PB7AIWCZTHT5KJGFZFHQ\m\wagon-providers\wagon-scm\target\test-output\test-resource|test-resource[len = 18; mod = 1536861182200]]): expected: 1, actual: 0


FAILED:  org.apache.maven.wagon.providers.scm.ScmGitExeWagonTest.testWagonPutDirectoryForDot

Error Message:
Error checking out: command failed: Cloning into 'F:\jenkins\jenkins-slave\workspace\n-box_maven-wagon_WAGON-526-MVYPB7RAMW5VZ4RA4NSMECE376IR6WO6PB7AIWCZTHT5KJGFZFHQ\m\wagon-providers\wagon-scm\target\test-output\checkout-org.apache.maven.scm.provider.git.gitexe.GitExeScmProvider'...
fatal: '$GIT_DIR' too big
fatal: index-pack failed

Stack Trace:
org.apache.maven.wagon.TransferFailedException:
Error checking out: command failed: Cloning into 'F:\jenkins\jenkins-slave\workspace\n-box_maven-wagon_WAGON-526-MVYPB7RAMW5VZ4RA4NSMECE376IR6WO6PB7AIWCZTHT5KJGFZFHQ\m\wagon-providers\wagon-scm\target\test-output\checkout-org.apache.maven.scm.provider.git.gitexe.GitExeScmProvider'...
fatal: '$GIT_DIR' too big
fatal: index-pack failed
Caused by: org.apache.maven.scm.ScmException:
command failed: Cloning into 'F:\jenkins\jenkins-slave\workspace\n-box_maven-wagon_WAGON-526-MVYPB7RAMW5VZ4RA4NSMECE376IR6WO6PB7AIWCZTHT5KJGFZFHQ\m\wagon-providers\wagon-scm\target\test-output\checkout-org.apache.maven.scm.provider.git.gitexe.GitExeScmProvider'...
fatal: '$GIT_DIR' too big
fatal: index-pack failed


FAILED:  org.apache.maven.wagon.providers.scm.ScmGitExeWagonTest.testFailedGet

Error Message:
Error getting file from SCM

Stack Trace:
org.apache.maven.wagon.TransferFailedException: Error getting file from SCM
Caused by: org.apache.maven.scm.ScmException:
command failed: Cloning into 'F:\jenkins\jenkins-slave\workspace\n-box_maven-wagon_WAGON-526-MVYPB7RAMW5VZ4RA4NSMECE376IR6WO6PB7AIWCZTHT5KJGFZFHQ\m\wagon-providers\wagon-scm\target\test-output\checkout-org.apache.maven.scm.provider.git.gitexe.GitExeScmProvider'...
fatal: '$GIT_DIR' too big
fatal: index-pack failed


FAILED:  org.apache.maven.wagon.providers.scm.ScmGitExeWagonTest.testWagonPutDirectoryWhenDirectoryAlreadyExists

Error Message:
Error checking out: command failed: Cloning into 'F:\jenkins\jenkins-slave\workspace\n-box_maven-wagon_WAGON-526-MVYPB7RAMW5VZ4RA4NSMECE376IR6WO6PB7AIWCZTHT5KJGFZFHQ\m\wagon-providers\wagon-scm\target\test-output\checkout-org.apache.maven.scm.provider.git.gitexe.GitExeScmProvider'...
fatal: '$GIT_DIR' too big
fatal: index-pack failed

Stack Trace:
org.apache.maven.wagon.TransferFailedException:
Error checking out: command failed: Cloning into 'F:\jenkins\jenkins-slave\workspace\n-box_maven-wagon_WAGON-526-MVYPB7RAMW5VZ4RA4NSMECE376IR6WO6PB7AIWCZTHT5KJGFZFHQ\m\wagon-providers\wagon-scm\target\test-output\checkout-org.apache.maven.scm.provider.git.gitexe.GitExeScmProvider'...
fatal: '$GIT_DIR' too big
fatal: index-pack failed
Caused by: org.apache.maven.scm.ScmException:
command failed: Cloning into 'F:\jenkins\jenkins-slave\workspace\n-box_maven-wagon_WAGON-526-MVYPB7RAMW5VZ4RA4NSMECE376IR6WO6PB7AIWCZTHT5KJGFZFHQ\m\wagon-providers\wagon-scm\target\test-output\checkout-org.apache.maven.scm.provider.git.gitexe.GitExeScmProvider'...
fatal: '$GIT_DIR' too big
fatal: index-pack failed


FAILED:  org.apache.maven.wagon.providers.scm.ScmGitExeWagonTest.testWagonPutDirectory

Error Message:
Error checking out: command failed: Cloning into 'F:\jenkins\jenkins-slave\workspace\n-box_maven-wagon_WAGON-526-MVYPB7RAMW5VZ4RA4NSMECE376IR6WO6PB7AIWCZTHT5KJGFZFHQ\m\wagon-providers\wagon-scm\target\test-output\checkout-org.apache.maven.scm.provider.git.gitexe.GitExeScmProvider'...
fatal: '$GIT_DIR' too big
fatal: index-pack failed

Stack Trace:
org.apache.maven.wagon.TransferFailedException:
Error checking out: command failed: Cloning into 'F:\jenkins\jenkins-slave\workspace\n-box_maven-wagon_WAGON-526-MVYPB7RAMW5VZ4RA4NSMECE376IR6WO6PB7AIWCZTHT5KJGFZFHQ\m\wagon-providers\wagon-scm\target\test-output\checkout-org.apache.maven.scm.provider.git.gitexe.GitExeScmProvider'...
fatal: '$GIT_DIR' too big
fatal: index-pack failed
Caused by: org.apache.maven.scm.ScmException:
command failed: Cloning into 'F:\jenkins\jenkins-slave\workspace\n-box_maven-wagon_WAGON-526-MVYPB7RAMW5VZ4RA4NSMECE376IR6WO6PB7AIWCZTHT5KJGFZFHQ\m\wagon-providers\wagon-scm\target\test-output\checkout-org.apache.maven.scm.provider.git.gitexe.GitExeScmProvider'...
fatal: '$GIT_DIR' too big
fatal: index-pack failed


FAILED:  org.apache.maven.wagon.providers.scm.ScmGitExeWagonTest.testWagonPutDirectoryDeepDestination

Error Message:
Error checking out: command failed: Cloning into 'F:\jenkins\jenkins-slave\workspace\n-box_maven-wagon_WAGON-526-MVYPB7RAMW5VZ4RA4NSMECE376IR6WO6PB7AIWCZTHT5KJGFZFHQ\m\wagon-providers\wagon-scm\target\test-output\checkout-org.apache.maven.scm.provider.git.gitexe.GitExeScmProvider'...
fatal: '$GIT_DIR' too big
fatal: index-pack failed

Stack Trace:
org.apache.maven.wagon.TransferFailedException:
Error checking out: command failed: Cloning into 'F:\jenkins\jenkins-slave\workspace\n-box_maven-wagon_WAGON-526-MVYPB7RAMW5VZ4RA4NSMECE376IR6WO6PB7AIWCZTHT5KJGFZFHQ\m\wagon-providers\wagon-scm\target\test-output\checkout-org.apache.maven.scm.provider.git.gitexe.GitExeScmProvider'...
fatal: '$GIT_DIR' too big
fatal: index-pack failed
Caused by: org.apache.maven.scm.ScmException:
command failed: Cloning into 'F:\jenkins\jenkins-slave\workspace\n-box_maven-wagon_WAGON-526-MVYPB7RAMW5VZ4RA4NSMECE376IR6WO6PB7AIWCZTHT5KJGFZFHQ\m\wagon-providers\wagon-scm\target\test-output\checkout-org.apache.maven.scm.provider.git.gitexe.GitExeScmProvider'...
fatal: '$GIT_DIR' too big
fatal: index-pack failed


FAILED:  org.apache.maven.wagon.providers.scm.ScmGitExeWagonTest.testWagon

Error Message:

  Unexpected method call TransferListener.transferError(TransferEvent[GET|ERROR|Repository[scm:git:file:///F:/jenkins/jenkins-slave/workspace/n-box_maven-wagon_WAGON-526-MVYPB7RAMW5VZ4RA4NSMECE376IR6WO6PB7AIWCZTHT5KJGFZFHQ/m/wagon-providers/wagon-scm/target/test-classes/test-repo-git-test/]|null|test-resource[len = 18; mod = 1536861315265]]):
    TransferListener.transferCompleted(TransferEvent[PUT|COMPLETED|Repository[scm:git:file:///F:/jenkins/jenkins-slave/workspace/n-box_maven-wagon_WAGON-526-MVYPB7RAMW5VZ4RA4NSMECE376IR6WO6PB7AIWCZTHT5KJGFZFHQ/m/wagon-providers/wagon-scm/target/test-classes/test-repo-git-test/]|F:\jenkins\jenkins-slave\workspace\n-box_maven-wagon_WAGON-526-MVYPB7RAMW5VZ4RA4NSMECE376IR6WO6PB7AIWCZTHT5KJGFZFHQ\m\wagon-providers\wagon-scm\target\test-output\test-resource|test-resource[len = 18; mod = 1536861315265]]): expected: 1, actual: 0

Stack Trace:
java.lang.AssertionError:

  Unexpected method call TransferListener.transferError(TransferEvent[GET|ERROR|Repository[scm:git:file:///F:/jenkins/jenkins-slave/workspace/n-box_maven-wagon_WAGON-526-MVYPB7RAMW5VZ4RA4NSMECE376IR6WO6PB7AIWCZTHT5KJGFZFHQ/m/wagon-providers/wagon-scm/target/test-classes/test-repo-git-test/]|null|test-resource[len = 18; mod = 1536861315265]]):
    TransferListener.transferCompleted(TransferEvent[PUT|COMPLETED|Repository[scm:git:file:///F:/jenkins/jenkins-slave/workspace/n-box_maven-wagon_WAGON-526-MVYPB7RAMW5VZ4RA4NSMECE376IR6WO6PB7AIWCZTHT5KJGFZFHQ/m/wagon-providers/wagon-scm/target/test-classes/test-repo-git-test/]|F:\jenkins\jenkins-slave\workspace\n-box_maven-wagon_WAGON-526-MVYPB7RAMW5VZ4RA4NSMECE376IR6WO6PB7AIWCZTHT5KJGFZFHQ\m\wagon-providers\wagon-scm\target\test-output\test-resource|test-resource[len = 18; mod = 1536861315265]]): expected: 1, actual: 0


FAILED:  org.apache.maven.wagon.providers.scm.ScmGitExeWagonTest.testWagonPutDirectoryForDot

Error Message:
Error checking out: command failed: Cloning into 'F:\jenkins\jenkins-slave\workspace\n-box_maven-wagon_WAGON-526-MVYPB7RAMW5VZ4RA4NSMECE376IR6WO6PB7AIWCZTHT5KJGFZFHQ\m\wagon-providers\wagon-scm\target\test-output\checkout-org.apache.maven.scm.provider.git.gitexe.GitExeScmProvider'...
fatal: '$GIT_DIR' too big
fatal: index-pack failed

Stack Trace:
org.apache.maven.wagon.TransferFailedException:
Error checking out: command failed: Cloning into 'F:\jenkins\jenkins-slave\workspace\n-box_maven-wagon_WAGON-526-MVYPB7RAMW5VZ4RA4NSMECE376IR6WO6PB7AIWCZTHT5KJGFZFHQ\m\wagon-providers\wagon-scm\target\test-output\checkout-org.apache.maven.scm.provider.git.gitexe.GitExeScmProvider'...
fatal: '$GIT_DIR' too big
fatal: index-pack failed
Caused by: org.apache.maven.scm.ScmException:
command failed: Cloning into 'F:\jenkins\jenkins-slave\workspace\n-box_maven-wagon_WAGON-526-MVYPB7RAMW5VZ4RA4NSMECE376IR6WO6PB7AIWCZTHT5KJGFZFHQ\m\wagon-providers\wagon-scm\target\test-output\checkout-org.apache.maven.scm.provider.git.gitexe.GitExeScmProvider'...
fatal: '$GIT_DIR' too big
fatal: index-pack failed


FAILED:  org.apache.maven.wagon.providers.scm.ScmGitExeWagonTest.testFailedGet

Error Message:
Error getting file from SCM

Stack Trace:
org.apache.maven.wagon.TransferFailedException: Error getting file from SCM
Caused by: org.apache.maven.scm.ScmException:
command failed: Cloning into 'F:\jenkins\jenkins-slave\workspace\n-box_maven-wagon_WAGON-526-MVYPB7RAMW5VZ4RA4NSMECE376IR6WO6PB7AIWCZTHT5KJGFZFHQ\m\wagon-providers\wagon-scm\target\test-output\checkout-org.apache.maven.scm.provider.git.gitexe.GitExeScmProvider'...
fatal: '$GIT_DIR' too big
fatal: index-pack failed


FAILED:  org.apache.maven.wagon.providers.scm.ScmGitExeWagonTest.testWagonPutDirectoryWhenDirectoryAlreadyExists

Error Message:
Error checking out: command failed: Cloning into 'F:\jenkins\jenkins-slave\workspace\n-box_maven-wagon_WAGON-526-MVYPB7RAMW5VZ4RA4NSMECE376IR6WO6PB7AIWCZTHT5KJGFZFHQ\m\wagon-providers\wagon-scm\target\test-output\checkout-org.apache.maven.scm.provider.git.gitexe.GitExeScmProvider'...
fatal: '$GIT_DIR' too big
fatal: index-pack failed

Stack Trace:
org.apache.maven.wagon.TransferFailedException:
Error checking out: command failed: Cloning into 'F:\jenkins\jenkins-slave\workspace\n-box_maven-wagon_WAGON-526-MVYPB7RAMW5VZ4RA4NSMECE376IR6WO6PB7AIWCZTHT5KJGFZFHQ\m\wagon-providers\wagon-scm\target\test-output\checkout-org.apache.maven.scm.provider.git.gitexe.GitExeScmProvider'...
fatal: '$GIT_DIR' too big
fatal: index-pack failed
Caused by: org.apache.maven.scm.ScmException:
command failed: Cloning into 'F:\jenkins\jenkins-slave\workspace\n-box_maven-wagon_WAGON-526-MVYPB7RAMW5VZ4RA4NSMECE376IR6WO6PB7AIWCZTHT5KJGFZFHQ\m\wagon-providers\wagon-scm\target\test-output\checkout-org.apache.maven.scm.provider.git.gitexe.GitExeScmProvider'...
fatal: '$GIT_DIR' too big
fatal: index-pack failed




Build log:
[...truncated 3.35 MB...]
[windows-jdk9] [INFO]
[windows-jdk9] [INFO] --- maven-enforcer-plugin:1.4.1:enforce (default) @ wagon-ssh ---
[windows-jdk9] [INFO]
[windows-jdk9] [INFO] --- apache-rat-plugin:0.12:check (rat-check) @ wagon-ssh ---
[windows-jdk9] [INFO] Enabled default license matchers.
[windows-jdk9] [INFO] Will parse SCM ignores for exclusions...
[windows-jdk9] [INFO] Finished adding exclusions from SCM ignore files.
[windows-jdk9] [INFO] 61 implicit excludes (use -debug for more details).
[windows-jdk9] [INFO] Exclude: .checkstyle
[windows-jdk9] [INFO] Exclude: **/*.odg
[windows-jdk9] [INFO] Exclude: src/test/resources/**
[windows-jdk9] [INFO] Exclude: src/main/resources/default-server-root/**
[windows-jdk9] [INFO] Exclude: src/main/resources/ssh-keys/**
[windows-jdk9] [INFO] Exclude: src/test/ssh-keys/**
[windows-jdk9] [INFO] Exclude: .repository/**
[windows-jdk9] [INFO] Exclude: out/**
[windows-jdk9] [INFO] Exclude: .repository/**
[windows-jdk9] [INFO] Exclude: .maven/spy.log
[windows-jdk9] [INFO] Exclude: dependency-reduced-pom.xml
[windows-jdk9] [INFO] Exclude: .java-version
[windows-jdk9] [INFO] 19 resources included (use -debug for more details)
[windows-jdk9] [INFO] Rat check: Summary over all files. Unapproved: 0, unknown: 0, generated: 0, approved: 19 licenses.
[windows-jdk9] [INFO]
[windows-jdk9] [INFO] --- maven-remote-resources-plugin:1.5:process (process-resource-bundles) @ wagon-ssh ---
[windows-jdk9] [INFO]
[windows-jdk9] [INFO] --- maven-resources-plugin:3.0.2:resources (default-resources) @ wagon-ssh ---
[windows-jdk9] [INFO] Using 'UTF-8' encoding to copy filtered resources.
[windows-jdk9] [INFO] skip non existing resourceDirectory F:\jenkins\jenkins-slave\workspace\n-box_maven-wagon_WAGON-526-MVYPB7RAMW5VZ4RA4NSMECE376IR6WO6PB7AIWCZTHT5KJGFZFHQ\m\wagon-providers\wagon-ssh\src\main\resources
[windows-jdk9] [INFO] Copying 3 resources
[windows-jdk9] [INFO]
[windows-jdk9] [INFO] --- maven-compiler-plugin:3.7.0:compile (default-compile) @ wagon-ssh ---
[windows-jdk9] [INFO] Changes detected - recompiling the module!
[windows-jdk9] [INFO] Compiling 7 source files to F:\jenkins\jenkins-slave\workspace\n-box_maven-wagon_WAGON-526-MVYPB7RAMW5VZ4RA4NSMECE376IR6WO6PB7AIWCZTHT5KJGFZFHQ\m\wagon-providers\wagon-ssh\target\classes
[windows-jdk9] [INFO]
[windows-jdk9] [INFO] --- plexus-component-metadata:1.7.1:generate-metadata (generate) @ wagon-ssh ---
[windows-jdk9] [INFO] Discovered 4 component descriptors(s)
[windows-jdk9] [INFO]
[windows-jdk9] [INFO] --- animal-sniffer-maven-plugin:1.15:check (check-java-1.7-compat) @ wagon-ssh ---
[windows-jdk9] [INFO] Checking unresolved references to org.codehaus.mojo.signature:java17:1.0
[windows-jdk9] [INFO]
[windows-jdk9] [INFO] --- maven-resources-plugin:3.0.2:testResources (default-testResources) @ wagon-ssh ---
[windows-jdk9] [INFO] Using 'UTF-8' encoding to copy filtered resources.
[windows-jdk9] [INFO] Copying 6 resources
[windows-jdk9] [INFO] Copying 3 resources
[windows-jdk9] [INFO]
[windows-jdk9] [INFO] --- maven-compiler-plugin:3.7.0:testCompile (default-testCompile) @ wagon-ssh ---
[windows-jdk9] [INFO] Changes detected - recompiling the module!
[windows-jdk9] [INFO] Compiling 8 source files to F:\jenkins\jenkins-slave\workspace\n-box_maven-wagon_WAGON-526-MVYPB7RAMW5VZ4RA4NSMECE376IR6WO6PB7AIWCZTHT5KJGFZFHQ\m\wagon-providers\wagon-ssh\target\test-classes
[windows-jdk9] [INFO] /F:/jenkins/jenkins-slave/workspace/n-box_maven-wagon_WAGON-526-MVYPB7RAMW5VZ4RA4NSMECE376IR6WO6PB7AIWCZTHT5KJGFZFHQ/m/wagon-providers/wagon-ssh/src/test/java/org/apache/maven/wagon/providers/ssh/jsch/ScpWagonWithSshPrivateKeySearchTest.java: F:\jenkins\jenkins-slave\workspace\n-box_maven-wagon_WAGON-526-MVYPB7RAMW5VZ4RA4NSMECE376IR6WO6PB7AIWCZTHT5KJGFZFHQ\m\wagon-providers\wagon-ssh\src\test\java\org\apache\maven\wagon\providers\ssh\jsch\ScpWagonWithSshPrivateKeySearchTest.java uses or overrides a deprecated API.
[windows-jdk9] [INFO] /F:/jenkins/jenkins-slave/workspace/n-box_maven-wagon_WAGON-526-MVYPB7RAMW5VZ4RA4NSMECE376IR6WO6PB7AIWCZTHT5KJGFZFHQ/m/wagon-providers/wagon-ssh/src/test/java/org/apache/maven/wagon/providers/ssh/jsch/ScpWagonWithSshPrivateKeySearchTest.java: Recompile with -Xlint:deprecation for details.
[windows-jdk9] [INFO]
[windows-jdk9] [INFO] --- maven-surefire-plugin:2.20:test (default-test) @ wagon-ssh ---
[windows-jdk9] [INFO]
[windows-jdk9] [INFO] --- maven-jar-plugin:3.0.2:jar (default-jar) @ wagon-ssh ---
[windows-jdk9] [INFO] Building jar: F:\jenkins\jenkins-slave\workspace\n-box_maven-wagon_WAGON-526-MVYPB7RAMW5VZ4RA4NSMECE376IR6WO6PB7AIWCZTHT5KJGFZFHQ\m\wagon-providers\wagon-ssh\target\wagon-ssh-3.1.1-SNAPSHOT.jar
[windows-jdk9] [INFO]
[windows-jdk9] [INFO] --- maven-site-plugin:3.7:attach-descriptor (attach-descriptor) @ wagon-ssh ---
[windows-jdk9] [INFO] Skipping because packaging 'jar' is not pom.
[windows-jdk9] [INFO]
[windows-jdk9] [INFO] --- maven-checkstyle-plugin:3.0.0:check (checkstyle-check) @ wagon-ssh ---
[windows-jdk9] [INFO] There is 1 error reported by Checkstyle 6.18 with config/maven_checks.xml ruleset.
[windows-jdk9] [INFO] Ignored 1 error, 0 violation remaining.
[windows-jdk9] [INFO]
[windows-jdk9] [INFO] ------------------------------------------------------------------------
[windows-jdk9] [INFO] Building Apache Maven Wagon :: Providers :: WebDAV Provider 3.1.1-SNAPSHOT
[windows-jdk9] [INFO] ------------------------------------------------------------------------
[windows-jdk9] [INFO] Downloading from central: https://repo.maven.apache.org/maven2/org/apache/jackrabbit/jackrabbit-webdav/2.14.4/jackrabbit-webdav-2.14.4.pom
[windows-jdk9] [INFO] Downloaded from central: https://repo.maven.apache.org/maven2/org/apache/jackrabbit/jackrabbit-webdav/2.14.4/jackrabbit-webdav-2.14.4.pom (4.0 kB at 146 kB/s)
[windows-jdk9] [INFO] Downloading from central: https://repo.maven.apache.org/maven2/org/apache/jackrabbit/jackrabbit-parent/2.14.4/jackrabbit-parent-2.14.4.pom
[windows-jdk9] [INFO] Downloaded from central: https://repo.maven.apache.org/maven2/org/apache/jackrabbit/jackrabbit-parent/2.14.4/jackrabbit-parent-2.14.4.pom (35 kB at 1.3 MB/s)
[windows-jdk9] [INFO] Downloading from central: https://repo.maven.apache.org/maven2/it/could/webdav/0.4/webdav-0.4.pom
[windows-jdk9] [INFO] Downloaded from central: https://repo.maven.apache.org/maven2/it/could/webdav/0.4/webdav-0.4.pom (1.1 kB at 37 kB/s)
[windows-jdk9] [INFO] Downloading from central: https://repo.maven.apache.org/maven2/biz/aQute/bnd/1.50.0/bnd-1.50.0.pom
[windows-jdk9] [INFO] Downloaded from central: https://repo.maven.apache.org/maven2/biz/aQute/bnd/1.50.0/bnd-1.50.0.pom (1.3 kB at 53 kB/s)
[windows-jdk9] [INFO] Downloading from central: https://repo.maven.apache.org/maven2/org/apache/jackrabbit/jackrabbit-webdav/2.14.4/jackrabbit-webdav-2.14.4.jar
[windows-jdk9] [INFO] Downloading from central: https://repo.maven.apache.org/maven2/javax/servlet/servlet-api/2.3/servlet-api-2.3.jar
[windows-jdk9] [INFO] Downloading from central: https://repo.maven.apache.org/maven2/it/could/webdav/0.4/webdav-0.4.jar
[windows-jdk9] [INFO] Downloading from central: https://repo.maven.apache.org/maven2/biz/aQute/bnd/1.50.0/bnd-1.50.0.jar
[windows-jdk9] [INFO] Downloaded from central: https://repo.maven.apache.org/maven2/it/could/webdav/0.4/webdav-0.4.jar (103 kB at 3.1 MB/s)
[windows-jdk9] [INFO] Downloaded from central: https://repo.maven.apache.org/maven2/javax/servlet/servlet-api/2.3/servlet-api-2.3.jar (78 kB at 2.2 MB/s)
[windows-jdk9] [INFO] Downloaded from central: https://repo.maven.apache.org/maven2/org/apache/jackrabbit/jackrabbit-webdav/2.14.4/jackrabbit-webdav-2.14.4.jar (365 kB at 8.3 MB/s)
[windows-jdk9] [INFO] Downloaded from central: https://repo.maven.apache.org/maven2/biz/aQute/bnd/1.50.0/bnd-1.50.0.jar (828 kB at 16 MB/s)
[windows-jdk9] [INFO]
[windows-jdk9] [INFO] --- maven-clean-plugin:3.0.0:clean (default-clean) @ wagon-webdav-jackrabbit ---
[windows-jdk9] [INFO]
[windows-jdk9] [INFO] --- maven-enforcer-plugin:1.4.1:enforce (enforce-maven-version) @ wagon-webdav-jackrabbit ---
[windows-jdk9] [INFO]
[windows-jdk9] [INFO] --- maven-enforcer-plugin:1.4.1:enforce (enforce-bytecode-version) @ wagon-webdav-jackrabbit ---
[windows-jdk9] [INFO]
[windows-jdk9] [INFO] --- maven-enforcer-plugin:1.4.1:enforce (ban-known-bad-maven-versions) @ wagon-webdav-jackrabbit ---
[windows-jdk9] [INFO]
[windows-jdk9] [INFO] --- maven-enforcer-plugin:1.4.1:enforce (default) @ wagon-webdav-jackrabbit ---
[windows-jdk9] [INFO]
[windows-jdk9] [INFO] --- apache-rat-plugin:0.12:check (rat-check) @ wagon-webdav-jackrabbit ---
[windows-jdk9] [INFO] Enabled default license matchers.
[windows-jdk9] [INFO] Will parse SCM ignores for exclusions...
[windows-jdk9] [INFO] Finished adding exclusions from SCM ignore files.
[windows-jdk9] [INFO] 61 implicit excludes (use -debug for more details).
[windows-jdk9] [INFO] Exclude: .checkstyle
[windows-jdk9] [INFO] Exclude: **/*.odg
[windows-jdk9] [INFO] Exclude: src/test/resources/**
[windows-jdk9] [INFO] Exclude: src/main/resources/default-server-root/**
[windows-jdk9] [INFO] Exclude: src/main/resources/ssh-keys/**
[windows-jdk9] [INFO] Exclude: src/test/ssh-keys/**
[windows-jdk9] [INFO] Exclude: .repository/**
[windows-jdk9] [INFO] Exclude: out/**
[windows-jdk9] [INFO] Exclude: .repository/**
[windows-jdk9] [INFO] Exclude: .maven/spy.log
[windows-jdk9] [INFO] Exclude: dependency-reduced-pom.xml
[windows-jdk9] [INFO] Exclude: .java-version
[windows-jdk9] [INFO] 12 resources included (use -debug for more details)
[windows-jdk9] [INFO] Rat check: Summary over all files. Unapproved: 0, unknown: 0, generated: 0, approved: 12 licenses.
[windows-jdk9] [INFO]
[windows-jdk9] [INFO] --- maven-remote-resources-plugin:1.5:process (process-resource-bundles) @ wagon-webdav-jackrabbit ---
[windows-jdk9] [INFO]
[windows-jdk9] [INFO] --- maven-resources-plugin:3.0.2:resources (default-resources) @ wagon-webdav-jackrabbit ---
[windows-jdk9] [INFO] Using 'UTF-8' encoding to copy filtered resources.
[windows-jdk9] [INFO] Copying 1 resource
[windows-jdk9] [INFO] Copying 3 resources
[windows-jdk9] [INFO]
[windows-jdk9] [INFO] --- maven-compiler-plugin:3.7.0:compile (default-compile) @ wagon-webdav-jackrabbit ---
[windows-jdk9] [INFO] Changes detected - recompiling the module!
[windows-jdk9] [INFO] Compiling 4 source files to F:\jenkins\jenkins-slave\workspace\n-box_maven-wagon_WAGON-526-MVYPB7RAMW5VZ4RA4NSMECE376IR6WO6PB7AIWCZTHT5KJGFZFHQ\m\wagon-providers\wagon-webdav-jackrabbit\target\classes
[windows-jdk9] [INFO] /F:/jenkins/jenkins-slave/workspace/n-box_maven-wagon_WAGON-526-MVYPB7RAMW5VZ4RA4NSMECE376IR6WO6PB7AIWCZTHT5KJGFZFHQ/m/wagon-providers/wagon-webdav-jackrabbit/src/main/java/org/apache/maven/wagon/providers/webdav/WebDavWagon.java: F:\jenkins\jenkins-slave\workspace\n-box_maven-wagon_WAGON-526-MVYPB7RAMW5VZ4RA4NSMECE376IR6WO6PB7AIWCZTHT5KJGFZFHQ\m\wagon-providers\wagon-webdav-jackrabbit\src\main\java\org\apache\maven\wagon\providers\webdav\WebDavWagon.java uses or overrides a deprecated API.
[windows-jdk9] [INFO] /F:/jenkins/jenkins-slave/workspace/n-box_maven-wagon_WAGON-526-MVYPB7RAMW5VZ4RA4NSMECE376IR6WO6PB7AIWCZTHT5KJGFZFHQ/m/wagon-providers/wagon-webdav-jackrabbit/src/main/java/org/apache/maven/wagon/providers/webdav/WebDavWagon.java: Recompile with -Xlint:deprecation for details.
[windows-jdk9] [INFO]
[windows-jdk9] [INFO] --- plexus-component-metadata:1.7.1:generate-metadata (generate) @ wagon-webdav-jackrabbit ---
[windows-jdk9] [INFO] Discovered 1 component descriptors(s)
[windows-jdk9] [INFO]
[windows-jdk9] [INFO] --- animal-sniffer-maven-plugin:1.15:check (check-java-1.7-compat) @ wagon-webdav-jackrabbit ---
[windows-jdk9] [INFO] Checking unresolved references to org.codehaus.mojo.signature:java17:1.0
[windows-jdk9] [INFO]
[windows-jdk9] [INFO] --- maven-resources-plugin:3.0.2:testResources (default-testResources) @ wagon-webdav-jackrabbit ---
[windows-jdk9] [INFO] Using 'UTF-8' encoding to copy filtered resources.
[windows-jdk9] [INFO] Copying 2 resources
[windows-jdk9] [INFO] Copying 3 resources
[windows-jdk9] [INFO]
[windows-jdk9] [INFO] --- maven-compiler-plugin:3.7.0:testCompile (default-testCompile) @ wagon-webdav-jackrabbit ---
[windows-jdk9] [INFO] Changes detected - recompiling the module!
[windows-jdk9] [INFO] Compiling 4 source files to F:\jenkins\jenkins-slave\workspace\n-box_maven-wagon_WAGON-526-MVYPB7RAMW5VZ4RA4NSMECE376IR6WO6PB7AIWCZTHT5KJGFZFHQ\m\wagon-providers\wagon-webdav-jackrabbit\target\test-classes
[windows-jdk9] [INFO] /F:/jenkins/jenkins-slave/workspace/n-box_maven-wagon_WAGON-526-MVYPB7RAMW5VZ4RA4NSMECE376IR6WO6PB7AIWCZTHT5KJGFZFHQ/m/wagon-providers/wagon-webdav-jackrabbit/src/test/java/org/apache/maven/wagon/providers/webdav/HttpClientWagonTest.java: F:\jenkins\jenkins-slave\workspace\n-box_maven-wagon_WAGON-526-MVYPB7RAMW5VZ4RA4NSMECE376IR6WO6PB7AIWCZTHT5KJGFZFHQ\m\wagon-providers\wagon-webdav-jackrabbit\src\test\java\org\apache\maven\wagon\providers\webdav\HttpClientWagonTest.java uses or overrides a deprecated API.
[windows-jdk9] [INFO] /F:/jenkins/jenkins-slave/workspace/n-box_maven-wagon_WAGON-526-MVYPB7RAMW5VZ4RA4NSMECE376IR6WO6PB7AIWCZTHT5KJGFZFHQ/m/wagon-providers/wagon-webdav-jackrabbit/src/test/java/org/apache/maven/wagon/providers/webdav/HttpClientWagonTest.java: Recompile with -Xlint:deprecation for details.
[windows-jdk9] [INFO]
[windows-jdk9] [INFO] --- maven-surefire-plugin:2.20:test (default-test) @ wagon-webdav-jackrabbit ---
[windows-jdk9] [INFO]
[windows-jdk9] [INFO] -------------------------------------------------------
[windows-jdk9] [INFO]  T E S T S
[windows-jdk9] [INFO] -------------------------------------------------------
[windows-jdk9] [INFO] Running org.apache.maven.wagon.providers.webdav.HttpClientWagonTest
[windows-jdk9] [INFO] Tests run: 6, Failures: 0, Errors: 0, Skipped: 0, Time elapsed: 0.873 s - in org.apache.maven.wagon.providers.webdav.HttpClientWagonTest
[windows-jdk9] [INFO] Running org.apache.maven.wagon.providers.webdav.PathNavigatorTest
[windows-jdk9] [INFO] Tests run: 1, Failures: 0, Errors: 0, Skipped: 0, Time elapsed: 0 s - in org.apache.maven.wagon.providers.webdav.PathNavigatorTest
[windows-jdk9] [INFO] Running org.apache.maven.wagon.providers.webdav.WebDavsWagonTest
[windows-jdk9] [INFO] Tests run: 69, Failures: 0, Errors: 0, Skipped: 0, Time elapsed: 33.71 s - in org.apache.maven.wagon.providers.webdav.WebDavsWagonTest
[windows-jdk9] [INFO] Running org.apache.maven.wagon.providers.webdav.WebDavWagonTest
[windows-jdk9] [INFO] Tests run: 69, Failures: 0, Errors: 0, Skipped: 0, Time elapsed: 26.746 s - in org.apache.maven.wagon.providers.webdav.WebDavWagonTest
[windows-jdk9] [INFO]
[windows-jdk9] [INFO] Results:
[windows-jdk9] [INFO]
[windows-jdk9] [INFO] Tests run: 145, Failures: 0, Errors: 0, Skipped: 0
[windows-jdk9] [INFO]
[windows-jdk9] [INFO]
[windows-jdk9] [INFO] --- maven-jar-plugin:3.0.2:jar (default-jar) @ wagon-webdav-jackrabbit ---
[windows-jdk9] [INFO] Building jar: F:\jenkins\jenkins-slave\workspace\n-box_maven-wagon_WAGON-526-MVYPB7RAMW5VZ4RA4NSMECE376IR6WO6PB7AIWCZTHT5KJGFZFHQ\m\wagon-providers\wagon-webdav-jackrabbit\target\wagon-webdav-jackrabbit-3.1.1-SNAPSHOT.jar
[windows-jdk9] [INFO]
[windows-jdk9] [INFO] --- maven-site-plugin:3.7:attach-descriptor (attach-descriptor) @ wagon-webdav-jackrabbit ---
[windows-jdk9] [INFO] Skipping because packaging 'jar' is not pom.
[windows-jdk9] [INFO]
[windows-jdk9] [INFO] --- maven-checkstyle-plugin:3.0.0:check (checkstyle-check) @ wagon-webdav-jackrabbit ---
[windows-jdk9] [INFO] ------------------------------------------------------------------------
[windows-jdk9] [INFO] Reactor Summary:
[windows-jdk9] [INFO]
[windows-jdk9] [INFO] Apache Maven Wagon ................................. SUCCESS [ 43.769 s]
[windows-jdk9] [INFO] Apache Maven Wagon :: API .......................... SUCCESS [ 13.853 s]
[windows-jdk9] [INFO] Apache Maven Wagon :: Provider Test ................ SUCCESS [  4.525 s]
[windows-jdk9] [INFO] Apache Maven Wagon :: Providers .................... SUCCESS [  1.526 s]
[windows-jdk9] [INFO] Apache Maven Wagon :: Providers :: File Provider ... SUCCESS [  4.787 s]
[windows-jdk9] [INFO] Apache Maven Wagon :: Providers :: FTP Provider .... SUCCESS [  8.555 s]
[windows-jdk9] [INFO] Apache Maven Wagon :: Providers :: HTTP Shared Library SUCCESS [  5.152 s]
[windows-jdk9] [INFO] Apache Maven Wagon :: Test Compatibility Kits ...... SUCCESS [  1.696 s]
[windows-jdk9] [INFO] Apache Maven Wagon :: HTTP Test Compatibility Kit .. SUCCESS [  3.158 s]
[windows-jdk9] [INFO] Apache Maven Wagon :: Providers :: HTTP Provider ... SUCCESS [04:44 min]
[windows-jdk9] [INFO] Apache Maven Wagon :: Providers :: Lightweight HTTP Provider SUCCESS [02:11 min]
[windows-jdk9] [INFO] Apache Maven Wagon :: Providers :: SCM Provider .... SUCCESS [ 40.184 s]
[windows-jdk9] [INFO] Apache Maven Wagon :: Providers :: SSH Common Library SUCCESS [  4.078 s]
[windows-jdk9] [INFO] Apache Maven Wagon :: Providers :: SSH Common Tests  SUCCESS [  3.452 s]
[windows-jdk9] [INFO] Apache Maven Wagon :: Providers :: SSH External Provider SUCCESS [  2.009 s]
[windows-jdk9] [INFO] Apache Maven Wagon :: Providers :: SSH Provider .... SUCCESS [  4.540 s]
[windows-jdk9] [INFO] Apache Maven Wagon :: Providers :: WebDAV Provider . SUCCESS [01:05 min]
[windows-jdk9] [INFO] ------------------------------------------------------------------------
[windows-jdk9] [INFO] BUILD SUCCESS
[windows-jdk9] [INFO] ------------------------------------------------------------------------
[windows-jdk9] [INFO] Total time: 10:25 min
[windows-jdk9] [INFO] Finished at: 2018-09-13T10:57:07-07:00
[windows-jdk9] [INFO] Final Memory: 45M/152M
[windows-jdk9] [INFO] ------------------------------------------------------------------------
[windows-jdk9] [WARNING] The requested profile "run-its" could not be activated because it does not exist.
[windows-jdk9] [INFO] [jenkins-event-spy] Generated F:\jenkins\jenkins-slave\workspace\n-box_maven-wagon_WAGON-526-MVYPB7RAMW5VZ4RA4NSMECE376IR6WO6PB7AIWCZTHT5KJGFZFHQ@tmp\withMaven130d1edd\maven-spy-20180913-104641-63317491383739207780051.log
[Pipeline] [windows-jdk9] }
[Pipeline] [windows-jdk9] // dir
[Pipeline] [windows-jdk9] }
[windows-jdk9] [withMaven] junitPublisher - Archive test results for Maven artifact org.apache.maven.wagon:wagon-provider-api:3.1.1-SNAPSHOT generated by maven-surefire-plugin:test (default-test): m\wagon-provider-api\target\surefire-reports\*.xml
[windows-jdk9] Recording test results
[windows-jdk9] [withMaven] junitPublisher - Archive test results for Maven artifact org.apache.maven.wagon:wagon-provider-test:3.1.1-SNAPSHOT generated by maven-surefire-plugin:test (default-test): m\wagon-provider-test\target\surefire-reports\*.xml
[windows-jdk9] Recording test results
[windows-jdk9] None of the test reports contained any result
[windows-jdk9] [withMaven] junitPublisher - Archive test results for Maven artifact org.apache.maven.wagon:wagon-file:3.1.1-SNAPSHOT generated by maven-surefire-plugin:test (default-test): m\wagon-providers\wagon-file\target\surefire-reports\*.xml
[windows-jdk9] Recording test results
[windows-jdk9] [withMaven] junitPublisher - Archive test results for Maven artifact org.apache.maven.wagon:wagon-ftp:3.1.1-SNAPSHOT generated by maven-surefire-plugin:test (default-test): m\wagon-providers\wagon-ftp\target\surefire-reports\*.xml
[windows-jdk9] Recording test results
[windows-jdk9] [withMaven] junitPublisher - Archive test results for Maven artifact org.apache.maven.wagon:wagon-http-shared:3.1.1-SNAPSHOT generated by maven-surefire-plugin:test (default-test): m\wagon-providers\wagon-http-shared\target\surefire-reports\*.xml
[windows-jdk9] Recording test results
[windows-jdk9] [withMaven] junitPublisher - Archive test results for Maven artifact org.apache.maven.wagon:wagon-tck-http:3.1.1-SNAPSHOT generated by maven-surefire-plugin:test (default-test): m\wagon-tcks\wagon-tck-http\target\surefire-reports\*.xml
[windows-jdk9] Recording test results
[windows-jdk9] None of the test reports contained any result
[windows-jdk9] [withMaven] junitPublisher - Archive test results for Maven artifact org.apache.maven.wagon:wagon-http:3.1.1-SNAPSHOT generated by maven-surefire-plugin:test (default-test): m\wagon-providers\wagon-http\target\surefire-reports\*.xml
[windows-jdk9] Recording test results
[windows-jdk9] [withMaven] junitPublisher - Archive test results for Maven artifact org.apache.maven.wagon:wagon-http-lightweight:3.1.1-SNAPSHOT generated by maven-surefire-plugin:test (default-test): m\wagon-providers\wagon-http-lightweight\target\surefire-reports\*.xml
[windows-jdk9] Recording test results
[windows-jdk9] [withMaven] junitPublisher - Archive test results for Maven artifact org.apache.maven.wagon:wagon-scm:3.1.1-SNAPSHOT generated by maven-surefire-plugin:test (default-test): m\wagon-providers\wagon-scm\target\surefire-reports\*.xml
[windows-jdk9] Recording test results
[windows-jdk9] [withMaven] junitPublisher - Archive test results for Maven artifact org.apache.maven.wagon:wagon-ssh-common:3.1.1-SNAPSHOT generated by maven-surefire-plugin:test (default-test): m\wagon-providers\wagon-ssh-common\target\surefire-reports\*.xml
[windows-jdk9] Recording test results
[windows-jdk9] [withMaven] junitPublisher - Archive test results for Maven artifact org.apache.maven.wagon:wagon-ssh-common-test:3.1.1-SNAPSHOT generated by maven-surefire-plugin:test (default-test): m\wagon-providers\wagon-ssh-common-test\target\surefire-reports\*.xml
[windows-jdk9] Recording test results
[windows-jdk9] None of the test reports contained any result
[windows-jdk9] [withMaven] junitPublisher - Archive test results for Maven artifact org.apache.maven.wagon:wagon-ssh-external:3.1.1-SNAPSHOT generated by maven-surefire-plugin:test (default-test): m\wagon-providers\wagon-ssh-external\target\surefire-reports\*.xml
[windows-jdk9] Recording test results
[windows-jdk9] None of the test reports contained any result
[windows-jdk9] [withMaven] junitPublisher - Archive test results for Maven artifact org.apache.maven.wagon:wagon-ssh:3.1.1-SNAPSHOT generated by maven-surefire-plugin:test (default-test): m\wagon-providers\wagon-ssh\target\surefire-reports\*.xml
[windows-jdk9] Recording test results
[windows-jdk9] None of the test reports contained any result
[windows-jdk9] [withMaven] junitPublisher - Archive test results for Maven artifact org.apache.maven.wagon:wagon-webdav-jackrabbit:3.1.1-SNAPSHOT generated by maven-surefire-plugin:test (default-test): m\wagon-providers\wagon-webdav-jackrabbit\target\surefire-reports\*.xml
[windows-jdk9] Recording test results
[Pipeline] [windows-jdk9] // withMaven
[Pipeline] [windows-jdk9] cleanWs
[windows-jdk9] [WS-CLEANUP] Deleting project workspace...[WS-CLEANUP] done
[Pipeline] [windows-jdk9] }
[Pipeline] [windows-jdk9] // stage
[Pipeline] [windows-jdk9] }
[Pipeline] [windows-jdk9] // node
[Pipeline] [windows-jdk9] }
[Pipeline] // parallel
[Pipeline] stage
[Pipeline] { (Notifications)
[Pipeline] echo
Build result: FAILURE
[Pipeline] jiraIssueSelector
[Pipeline] emailext
Reply | Threaded
Open this post in threaded view
|

Build failed in Jenkins: Maven TLP » maven-wagon » WAGON-526 #5

Apache Jenkins Server-2
See https://builds.apache.org/job/maven-box/job/maven-wagon/job/WAGON-526/5/

Changes:

* Exclude H25
* Exclude H31 cause master is failing constantly.
* no need to test anymore with '3.0.x'
* Add Java 11 to defaults
* Try to shorten path for Windows by using tempDir
* Fix arguments
* Add option for temp workspace
* disable tmpWs
* enable tmpWs
* Use def
* Try to shorten wsDir

37 tests failed.
FAILED:  org.apache.maven.wagon.providers.scm.ScmSvnExeWagonTest.testWagonPutDirectory

Error Message:
Error checking out: command failed: svn: E170000: Unable to connect to a repository at URL 'file://2/m/wagon-providers/wagon-scm/target/test-classes/test-repo-svn-test'
svn: E170000: Unable to open an ra_local session to URL
svn: E170000: Local URL 'file://2/m/wagon-providers/wagon-scm/target/test-classes/test-repo-svn-test' contains unsupported hostname

Stack Trace:
org.apache.maven.wagon.TransferFailedException:
Error checking out: command failed: svn: E170000: Unable to connect to a repository at URL 'file://2/m/wagon-providers/wagon-scm/target/test-classes/test-repo-svn-test'
svn: E170000: Unable to open an ra_local session to URL
svn: E170000: Local URL 'file://2/m/wagon-providers/wagon-scm/target/test-classes/test-repo-svn-test' contains unsupported hostname
Caused by: org.apache.maven.scm.ScmException:
command failed: svn: E170000: Unable to connect to a repository at URL 'file://2/m/wagon-providers/wagon-scm/target/test-classes/test-repo-svn-test'
svn: E170000: Unable to open an ra_local session to URL
svn: E170000: Local URL 'file://2/m/wagon-providers/wagon-scm/target/test-classes/test-repo-svn-test' contains unsupported hostname


FAILED:  org.apache.maven.wagon.providers.scm.ScmSvnExeWagonTest.testWagonPutDirectoryDeepDestination

Error Message:
Error checking out: command failed: svn: E170000: Unable to connect to a repository at URL 'file://2/m/wagon-providers/wagon-scm/target/test-classes/test-repo-svn-test'
svn: E170000: Unable to open an ra_local session to URL
svn: E170000: Local URL 'file://2/m/wagon-providers/wagon-scm/target/test-classes/test-repo-svn-test' contains unsupported hostname

Stack Trace:
org.apache.maven.wagon.TransferFailedException:
Error checking out: command failed: svn: E170000: Unable to connect to a repository at URL 'file://2/m/wagon-providers/wagon-scm/target/test-classes/test-repo-svn-test'
svn: E170000: Unable to open an ra_local session to URL
svn: E170000: Local URL 'file://2/m/wagon-providers/wagon-scm/target/test-classes/test-repo-svn-test' contains unsupported hostname
Caused by: org.apache.maven.scm.ScmException:
command failed: svn: E170000: Unable to connect to a repository at URL 'file://2/m/wagon-providers/wagon-scm/target/test-classes/test-repo-svn-test'
svn: E170000: Unable to open an ra_local session to URL
svn: E170000: Local URL 'file://2/m/wagon-providers/wagon-scm/target/test-classes/test-repo-svn-test' contains unsupported hostname


FAILED:  org.apache.maven.wagon.providers.scm.ScmSvnExeWagonTest.testWagon

Error Message:

  Unexpected method call TransferListener.transferError(TransferEvent[GET|ERROR|Repository[scm:svn:file://2/m/wagon-providers/wagon-scm/target/test-classes/test-repo-svn-test]|null|test-resource[len = 18; mod = 1539193861000]]):
    TransferListener.transferCompleted(TransferEvent[PUT|COMPLETED|Repository[scm:svn:file://2/m/wagon-providers/wagon-scm/target/test-classes/test-repo-svn-test]|/home/jenkins/jenkins-slave/workspace/n-box_maven-wagon_WAGON-526-MVYPB7RAMW5VZ4RA4NSMECE376IR6WO6PB7AIWCZTHT5KJGFZFHQ@2/m/wagon-providers/wagon-scm/target/test-output/test-resource|test-resource[len = 18; mod = 1539193861000]]): expected: 1, actual: 0

Stack Trace:
java.lang.AssertionError:

  Unexpected method call TransferListener.transferError(TransferEvent[GET|ERROR|Repository[scm:svn:file://2/m/wagon-providers/wagon-scm/target/test-classes/test-repo-svn-test]|null|test-resource[len = 18; mod = 1539193861000]]):
    TransferListener.transferCompleted(TransferEvent[PUT|COMPLETED|Repository[scm:svn:file://2/m/wagon-providers/wagon-scm/target/test-classes/test-repo-svn-test]|/home/jenkins/jenkins-slave/workspace/n-box_maven-wagon_WAGON-526-MVYPB7RAMW5VZ4RA4NSMECE376IR6WO6PB7AIWCZTHT5KJGFZFHQ@2/m/wagon-providers/wagon-scm/target/test-output/test-resource|test-resource[len = 18; mod = 1539193861000]]): expected: 1, actual: 0


FAILED:  org.apache.maven.wagon.providers.scm.ScmSvnExeWagonTest.testWagonPutDirectoryForDot

Error Message:
Error checking out: command failed: svn: E170000: Unable to connect to a repository at URL 'file://2/m/wagon-providers/wagon-scm/target/test-classes/test-repo-svn-test'
svn: E170000: Unable to open an ra_local session to URL
svn: E170000: Local URL 'file://2/m/wagon-providers/wagon-scm/target/test-classes/test-repo-svn-test' contains unsupported hostname

Stack Trace:
org.apache.maven.wagon.TransferFailedException:
Error checking out: command failed: svn: E170000: Unable to connect to a repository at URL 'file://2/m/wagon-providers/wagon-scm/target/test-classes/test-repo-svn-test'
svn: E170000: Unable to open an ra_local session to URL
svn: E170000: Local URL 'file://2/m/wagon-providers/wagon-scm/target/test-classes/test-repo-svn-test' contains unsupported hostname
Caused by: org.apache.maven.scm.ScmException:
command failed: svn: E170000: Unable to connect to a repository at URL 'file://2/m/wagon-providers/wagon-scm/target/test-classes/test-repo-svn-test'
svn: E170000: Unable to open an ra_local session to URL
svn: E170000: Local URL 'file://2/m/wagon-providers/wagon-scm/target/test-classes/test-repo-svn-test' contains unsupported hostname


FAILED:  org.apache.maven.wagon.providers.scm.ScmSvnExeWagonTest.testWagonGetFileList

Error Message:

  Unexpected method call TransferListener.transferError(TransferEvent[GET|ERROR|Repository[scm:svn:file://2/m/wagon-providers/wagon-scm/target/test-classes/test-repo-svn-test]|null|file-list/test-resource.txt[len = 18; mod = 1539193861000]]):
    TransferListener.transferCompleted(TransferEvent[PUT|COMPLETED|Repository[scm:svn:file://2/m/wagon-providers/wagon-scm/target/test-classes/test-repo-svn-test]|/home/jenkins/jenkins-slave/workspace/n-box_maven-wagon_WAGON-526-MVYPB7RAMW5VZ4RA4NSMECE376IR6WO6PB7AIWCZTHT5KJGFZFHQ@2/m/wagon-providers/wagon-scm/target/test-output/file-list/test-resource.txt|file-list/test-resource.txt[len = 18; mod = 1539193861000]]): expected: 1, actual: 0

Stack Trace:
java.lang.AssertionError:

  Unexpected method call TransferListener.transferError(TransferEvent[GET|ERROR|Repository[scm:svn:file://2/m/wagon-providers/wagon-scm/target/test-classes/test-repo-svn-test]|null|file-list/test-resource.txt[len = 18; mod = 1539193861000]]):
    TransferListener.transferCompleted(TransferEvent[PUT|COMPLETED|Repository[scm:svn:file://2/m/wagon-providers/wagon-scm/target/test-classes/test-repo-svn-test]|/home/jenkins/jenkins-slave/workspace/n-box_maven-wagon_WAGON-526-MVYPB7RAMW5VZ4RA4NSMECE376IR6WO6PB7AIWCZTHT5KJGFZFHQ@2/m/wagon-providers/wagon-scm/target/test-output/file-list/test-resource.txt|file-list/test-resource.txt[len = 18; mod = 1539193861000]]): expected: 1, actual: 0


FAILED:  org.apache.maven.wagon.providers.scm.ScmSvnExeWagonTest.testFailedGet

Error Message:
Error getting file from SCM

Stack Trace:
org.apache.maven.wagon.TransferFailedException: Error getting file from SCM
Caused by: org.apache.maven.scm.ScmException:
command failed: svn: E170000: Unable to connect to a repository at URL 'file://2/m/wagon-providers/wagon-scm/target/test-classes/test-repo-svn-test'
svn: E170000: Unable to open an ra_local session to URL
svn: E170000: Local URL 'file://2/m/wagon-providers/wagon-scm/target/test-classes/test-repo-svn-test' contains unsupported hostname


FAILED:  org.apache.maven.wagon.providers.scm.ScmSvnExeWagonTest.testWagonPutDirectoryWhenDirectoryAlreadyExists

Error Message:
Error checking out: command failed: svn: E170000: Unable to connect to a repository at URL 'file://2/m/wagon-providers/wagon-scm/target/test-classes/test-repo-svn-test'
svn: E170000: Unable to open an ra_local session to URL
svn: E170000: Local URL 'file://2/m/wagon-providers/wagon-scm/target/test-classes/test-repo-svn-test' contains unsupported hostname

Stack Trace:
org.apache.maven.wagon.TransferFailedException:
Error checking out: command failed: svn: E170000: Unable to connect to a repository at URL 'file://2/m/wagon-providers/wagon-scm/target/test-classes/test-repo-svn-test'
svn: E170000: Unable to open an ra_local session to URL
svn: E170000: Local URL 'file://2/m/wagon-providers/wagon-scm/target/test-classes/test-repo-svn-test' contains unsupported hostname
Caused by: org.apache.maven.scm.ScmException:
command failed: svn: E170000: Unable to connect to a repository at URL 'file://2/m/wagon-providers/wagon-scm/target/test-classes/test-repo-svn-test'
svn: E170000: Unable to open an ra_local session to URL
svn: E170000: Local URL 'file://2/m/wagon-providers/wagon-scm/target/test-classes/test-repo-svn-test' contains unsupported hostname


FAILED:  org.apache.maven.wagon.providers.scm.ScmSvnExeWagonTest.testWagonResourceExists

Error Message:

  Unexpected method call TransferListener.transferError(TransferEvent[GET|ERROR|Repository[scm:svn:file://2/m/wagon-providers/wagon-scm/target/test-classes/test-repo-svn-test]|null|test-resource[len = 18; mod = 1539193862000]]):
    TransferListener.transferCompleted(TransferEvent[PUT|COMPLETED|Repository[scm:svn:file://2/m/wagon-providers/wagon-scm/target/test-classes/test-repo-svn-test]|/home/jenkins/jenkins-slave/workspace/n-box_maven-wagon_WAGON-526-MVYPB7RAMW5VZ4RA4NSMECE376IR6WO6PB7AIWCZTHT5KJGFZFHQ@2/m/wagon-providers/wagon-scm/target/test-output/test-resource|test-resource[len = 18; mod = 1539193862000]]): expected: 1, actual: 0

Stack Trace:
java.lang.AssertionError:

  Unexpected method call TransferListener.transferError(TransferEvent[GET|ERROR|Repository[scm:svn:file://2/m/wagon-providers/wagon-scm/target/test-classes/test-repo-svn-test]|null|test-resource[len = 18; mod = 1539193862000]]):
    TransferListener.transferCompleted(TransferEvent[PUT|COMPLETED|Repository[scm:svn:file://2/m/wagon-providers/wagon-scm/target/test-classes/test-repo-svn-test]|/home/jenkins/jenkins-slave/workspace/n-box_maven-wagon_WAGON-526-MVYPB7RAMW5VZ4RA4NSMECE376IR6WO6PB7AIWCZTHT5KJGFZFHQ@2/m/wagon-providers/wagon-scm/target/test-output/test-resource|test-resource[len = 18; mod = 1539193862000]]): expected: 1, actual: 0


FAILED:  org.apache.maven.wagon.providers.scm.ScmGitExeWagonTest.testWagonPutDirectory

Error Message:
Error interacting with SCM: Unable to commit file. The git-commit command failed.
*** Please tell me who you are.

Run

  git config --global user.email "[hidden email]"
  git config --global user.name "Your Name"

to set your account's default identity.
Omit --global to set the identity only in this repository.

fatal:********@base.apache.org>) not allowed


Stack Trace:
org.apache.maven.wagon.TransferFailedException:
Error interacting with SCM: Unable to commit file. The git-commit command failed.
*** Please tell me who you are.

Run

  git config --global user.email "[hidden email]"
  git config --global user.name "Your Name"

to set your account's default identity.
Omit --global to set the identity only in this repository.

fatal:********@base.apache.org>) not allowed

Caused by: org.apache.maven.scm.ScmException:
Unable to commit file. The git-commit command failed.
*** Please tell me who you are.

Run

  git config --global user.email "[hidden email]"
  git config --global user.name "Your Name"

to set your account's default identity.
Omit --global to set the identity only in this repository.

fatal:********@base.apache.org>) not allowed



FAILED:  org.apache.maven.wagon.providers.scm.ScmGitExeWagonTest.testWagonPutDirectoryDeepDestination

Error Message:
Error interacting with SCM: Unable to commit file. The git-commit command failed.
*** Please tell me who you are.

Run

  git config --global user.email "[hidden email]"
  git config --global user.name "Your Name"

to set your account's default identity.
Omit --global to set the identity only in this repository.

fatal:********@base.apache.org>) not allowed


Stack Trace:
org.apache.maven.wagon.TransferFailedException:
Error interacting with SCM: Unable to commit file. The git-commit command failed.
*** Please tell me who you are.

Run

  git config --global user.email "[hidden email]"
  git config --global user.name "Your Name"

to set your account's default identity.
Omit --global to set the identity only in this repository.

fatal:********@base.apache.org>) not allowed

Caused by: org.apache.maven.scm.ScmException:
Unable to commit file. The git-commit command failed.
*** Please tell me who you are.

Run

  git config --global user.email "[hidden email]"
  git config --global user.name "Your Name"

to set your account's default identity.
Omit --global to set the identity only in this repository.

fatal:********@base.apache.org>) not allowed



FAILED:  org.apache.maven.wagon.providers.scm.ScmGitExeWagonTest.testWagon

Error Message:

  Unexpected method call TransferListener.transferError(TransferEvent[PUT|ERROR|Repository[scm:git:file:///home/jenkins/jenkins-slave/workspace/n-box_maven-wagon_WAGON-526-MVYPB7RAMW5VZ4RA4NSMECE376IR6WO6PB7AIWCZTHT5KJGFZFHQ/m/wagon-providers/wagon-scm/target/test-classes/test-repo-git-test/]|null|test-resource[len = 18; mod = 1539193787000]]):
    TransferListener.transferCompleted(TransferEvent[PUT|COMPLETED|Repository[scm:git:file:///home/jenkins/jenkins-slave/workspace/n-box_maven-wagon_WAGON-526-MVYPB7RAMW5VZ4RA4NSMECE376IR6WO6PB7AIWCZTHT5KJGFZFHQ/m/wagon-providers/wagon-scm/target/test-classes/test-repo-git-test/]|/home/jenkins/jenkins-slave/workspace/n-box_maven-wagon_WAGON-526-MVYPB7RAMW5VZ4RA4NSMECE376IR6WO6PB7AIWCZTHT5KJGFZFHQ/m/wagon-providers/wagon-scm/target/test-output/test-resource|test-resource[len = 18; mod = 1539193787000]]): expected: 1, actual: 0

Stack Trace:
java.lang.AssertionError:

  Unexpected method call TransferListener.transferError(TransferEvent[PUT|ERROR|Repository[scm:git:file:///home/jenkins/jenkins-slave/workspace/n-box_maven-wagon_WAGON-526-MVYPB7RAMW5VZ4RA4NSMECE376IR6WO6PB7AIWCZTHT5KJGFZFHQ/m/wagon-providers/wagon-scm/target/test-classes/test-repo-git-test/]|null|test-resource[len = 18; mod = 1539193787000]]):
    TransferListener.transferCompleted(TransferEvent[PUT|COMPLETED|Repository[scm:git:file:///home/jenkins/jenkins-slave/workspace/n-box_maven-wagon_WAGON-526-MVYPB7RAMW5VZ4RA4NSMECE376IR6WO6PB7AIWCZTHT5KJGFZFHQ/m/wagon-providers/wagon-scm/target/test-classes/test-repo-git-test/]|/home/jenkins/jenkins-slave/workspace/n-box_maven-wagon_WAGON-526-MVYPB7RAMW5VZ4RA4NSMECE376IR6WO6PB7AIWCZTHT5KJGFZFHQ/m/wagon-providers/wagon-scm/target/test-output/test-resource|test-resource[len = 18; mod = 1539193787000]]): expected: 1, actual: 0


FAILED:  org.apache.maven.wagon.providers.scm.ScmGitExeWagonTest.testWagonPutDirectoryForDot

Error Message:
Error interacting with SCM: Unable to commit file. The git-commit command failed.
*** Please tell me who you are.

Run

  git config --global user.email "[hidden email]"
  git config --global user.name "Your Name"

to set your account's default identity.
Omit --global to set the identity only in this repository.

fatal:********@base.apache.org>) not allowed


Stack Trace:
org.apache.maven.wagon.TransferFailedException:
Error interacting with SCM: Unable to commit file. The git-commit command failed.
*** Please tell me who you are.

Run

  git config --global user.email "[hidden email]"
  git config --global user.name "Your Name"

to set your account's default identity.
Omit --global to set the identity only in this repository.

fatal:********@base.apache.org>) not allowed

Caused by: org.apache.maven.scm.ScmException:
Unable to commit file. The git-commit command failed.
*** Please tell me who you are.

Run

  git config --global user.email "[hidden email]"
  git config --global user.name "Your Name"

to set your account's default identity.
Omit --global to set the identity only in this repository.

fatal:********@base.apache.org>) not allowed



FAILED:  org.apache.maven.wagon.providers.scm.ScmGitExeWagonTest.testWagonPutDirectoryWhenDirectoryAlreadyExists

Error Message:
Error interacting with SCM: Unable to commit file. The git-commit command failed.
*** Please tell me who you are.

Run

  git config --global user.email "[hidden email]"
  git config --global user.name "Your Name"

to set your account's default identity.
Omit --global to set the identity only in this repository.

fatal:********@base.apache.org>) not allowed


Stack Trace:
org.apache.maven.wagon.TransferFailedException:
Error interacting with SCM: Unable to commit file. The git-commit command failed.
*** Please tell me who you are.

Run

  git config --global user.email "[hidden email]"
  git config --global user.name "Your Name"

to set your account's default identity.
Omit --global to set the identity only in this repository.

fatal:********@base.apache.org>) not allowed

Caused by: org.apache.maven.scm.ScmException:
Unable to commit file. The git-commit command failed.
*** Please tell me who you are.

Run

  git config --global user.email "[hidden email]"
  git config --global user.name "Your Name"

to set your account's default identity.
Omit --global to set the identity only in this repository.

fatal:********@base.apache.org>) not allowed



FAILED:  org.apache.maven.wagon.providers.scm.ScmGitExeWagonTest.testWagonPutDirectory

Error Message:
Error checking out: command failed: Cloning into '/home/jenkins/jenkins-slave/workspace/n-box_maven-wagon_WAGON-526-MVYPB7RAMW5VZ4RA4NSMECE376IR6WO6PB7AIWCZTHT5KJGFZFHQ@2/m/wagon-providers/wagon-scm/target/test-output/checkout-org.apache.maven.scm.provider.git.gitexe.GitExeScmProvider'...
fatal: '/m/wagon-providers/wagon-scm/target/test-classes/test-repo-git-test/' does not appear to be a git repository
fatal: Could not read from remote repository.

Please make sure you have the correct access rights
and the repository exists.

Stack Trace:
org.apache.maven.wagon.TransferFailedException:
Error checking out: command failed: Cloning into '/home/jenkins/jenkins-slave/workspace/n-box_maven-wagon_WAGON-526-MVYPB7RAMW5VZ4RA4NSMECE376IR6WO6PB7AIWCZTHT5KJGFZFHQ@2/m/wagon-providers/wagon-scm/target/test-output/checkout-org.apache.maven.scm.provider.git.gitexe.GitExeScmProvider'...
fatal: '/m/wagon-providers/wagon-scm/target/test-classes/test-repo-git-test/' does not appear to be a git repository
fatal: Could not read from remote repository.

Please make sure you have the correct access rights
and the repository exists.
Caused by: org.apache.maven.scm.ScmException:
command failed: Cloning into '/home/jenkins/jenkins-slave/workspace/n-box_maven-wagon_WAGON-526-MVYPB7RAMW5VZ4RA4NSMECE376IR6WO6PB7AIWCZTHT5KJGFZFHQ@2/m/wagon-providers/wagon-scm/target/test-output/checkout-org.apache.maven.scm.provider.git.gitexe.GitExeScmProvider'...
fatal: '/m/wagon-providers/wagon-scm/target/test-classes/test-repo-git-test/' does not appear to be a git repository
fatal: Could not read from remote repository.

Please make sure you have the correct access rights
and the repository exists.


FAILED:  org.apache.maven.wagon.providers.scm.ScmGitExeWagonTest.testWagonPutDirectoryDeepDestination

Error Message:
Error checking out: command failed: Cloning into '/home/jenkins/jenkins-slave/workspace/n-box_maven-wagon_WAGON-526-MVYPB7RAMW5VZ4RA4NSMECE376IR6WO6PB7AIWCZTHT5KJGFZFHQ@2/m/wagon-providers/wagon-scm/target/test-output/checkout-org.apache.maven.scm.provider.git.gitexe.GitExeScmProvider'...
fatal: '/m/wagon-providers/wagon-scm/target/test-classes/test-repo-git-test/' does not appear to be a git repository
fatal: Could not read from remote repository.

Please make sure you have the correct access rights
and the repository exists.

Stack Trace:
org.apache.maven.wagon.TransferFailedException:
Error checking out: command failed: Cloning into '/home/jenkins/jenkins-slave/workspace/n-box_maven-wagon_WAGON-526-MVYPB7RAMW5VZ4RA4NSMECE376IR6WO6PB7AIWCZTHT5KJGFZFHQ@2/m/wagon-providers/wagon-scm/target/test-output/checkout-org.apache.maven.scm.provider.git.gitexe.GitExeScmProvider'...
fatal: '/m/wagon-providers/wagon-scm/target/test-classes/test-repo-git-test/' does not appear to be a git repository
fatal: Could not read from remote repository.

Please make sure you have the correct access rights
and the repository exists.
Caused by: org.apache.maven.scm.ScmException:
command failed: Cloning into '/home/jenkins/jenkins-slave/workspace/n-box_maven-wagon_WAGON-526-MVYPB7RAMW5VZ4RA4NSMECE376IR6WO6PB7AIWCZTHT5KJGFZFHQ@2/m/wagon-providers/wagon-scm/target/test-output/checkout-org.apache.maven.scm.provider.git.gitexe.GitExeScmProvider'...
fatal: '/m/wagon-providers/wagon-scm/target/test-classes/test-repo-git-test/' does not appear to be a git repository
fatal: Could not read from remote repository.

Please make sure you have the correct access rights
and the repository exists.


FAILED:  org.apache.maven.wagon.providers.scm.ScmGitExeWagonTest.testWagon

Error Message:

  Unexpected method call TransferListener.transferError(TransferEvent[GET|ERROR|Repository[scm:git:file://2/m/wagon-providers/wagon-scm/target/test-classes/test-repo-git-test/]|null|test-resource[len = 18; mod = 1539193862000]]):
    TransferListener.transferCompleted(TransferEvent[PUT|COMPLETED|Repository[scm:git:file://2/m/wagon-providers/wagon-scm/target/test-classes/test-repo-git-test/]|/home/jenkins/jenkins-slave/workspace/n-box_maven-wagon_WAGON-526-MVYPB7RAMW5VZ4RA4NSMECE376IR6WO6PB7AIWCZTHT5KJGFZFHQ@2/m/wagon-providers/wagon-scm/target/test-output/test-resource|test-resource[len = 18; mod = 1539193862000]]): expected: 1, actual: 0

Stack Trace:
java.lang.AssertionError:

  Unexpected method call TransferListener.transferError(TransferEvent[GET|ERROR|Repository[scm:git:file://2/m/wagon-providers/wagon-scm/target/test-classes/test-repo-git-test/]|null|test-resource[len = 18; mod = 1539193862000]]):
    TransferListener.transferCompleted(TransferEvent[PUT|COMPLETED|Repository[scm:git:file://2/m/wagon-providers/wagon-scm/target/test-classes/test-repo-git-test/]|/home/jenkins/jenkins-slave/workspace/n-box_maven-wagon_WAGON-526-MVYPB7RAMW5VZ4RA4NSMECE376IR6WO6PB7AIWCZTHT5KJGFZFHQ@2/m/wagon-providers/wagon-scm/target/test-output/test-resource|test-resource[len = 18; mod = 1539193862000]]): expected: 1, actual: 0


FAILED:  org.apache.maven.wagon.providers.scm.ScmGitExeWagonTest.testWagonPutDirectoryForDot

Error Message:
Error checking out: command failed: Cloning into '/home/jenkins/jenkins-slave/workspace/n-box_maven-wagon_WAGON-526-MVYPB7RAMW5VZ4RA4NSMECE376IR6WO6PB7AIWCZTHT5KJGFZFHQ@2/m/wagon-providers/wagon-scm/target/test-output/checkout-org.apache.maven.scm.provider.git.gitexe.GitExeScmProvider'...
fatal: '/m/wagon-providers/wagon-scm/target/test-classes/test-repo-git-test/' does not appear to be a git repository
fatal: Could not read from remote repository.

Please make sure you have the correct access rights
and the repository exists.

Stack Trace:
org.apache.maven.wagon.TransferFailedException:
Error checking out: command failed: Cloning into '/home/jenkins/jenkins-slave/workspace/n-box_maven-wagon_WAGON-526-MVYPB7RAMW5VZ4RA4NSMECE376IR6WO6PB7AIWCZTHT5KJGFZFHQ@2/m/wagon-providers/wagon-scm/target/test-output/checkout-org.apache.maven.scm.provider.git.gitexe.GitExeScmProvider'...
fatal: '/m/wagon-providers/wagon-scm/target/test-classes/test-repo-git-test/' does not appear to be a git repository
fatal: Could not read from remote repository.

Please make sure you have the correct access rights
and the repository exists.
Caused by: org.apache.maven.scm.ScmException:
command failed: Cloning into '/home/jenkins/jenkins-slave/workspace/n-box_maven-wagon_WAGON-526-MVYPB7RAMW5VZ4RA4NSMECE376IR6WO6PB7AIWCZTHT5KJGFZFHQ@2/m/wagon-providers/wagon-scm/target/test-output/checkout-org.apache.maven.scm.provider.git.gitexe.GitExeScmProvider'...
fatal: '/m/wagon-providers/wagon-scm/target/test-classes/test-repo-git-test/' does not appear to be a git repository
fatal: Could not read from remote repository.

Please make sure you have the correct access rights
and the repository exists.


FAILED:  org.apache.maven.wagon.providers.scm.ScmGitExeWagonTest.testFailedGet

Error Message:
Error getting file from SCM

Stack Trace:
org.apache.maven.wagon.TransferFailedException: Error getting file from SCM
Caused by: org.apache.maven.scm.ScmException:
command failed: Cloning into '/home/jenkins/jenkins-slave/workspace/n-box_maven-wagon_WAGON-526-MVYPB7RAMW5VZ4RA4NSMECE376IR6WO6PB7AIWCZTHT5KJGFZFHQ@2/m/wagon-providers/wagon-scm/target/test-output/checkout-org.apache.maven.scm.provider.git.gitexe.GitExeScmProvider'...
fatal: '/m/wagon-providers/wagon-scm/target/test-classes/test-repo-git-test/' does not appear to be a git repository
fatal: Could not read from remote repository.

Please make sure you have the correct access rights
and the repository exists.


FAILED:  org.apache.maven.wagon.providers.scm.ScmGitExeWagonTest.testWagonPutDirectoryWhenDirectoryAlreadyExists

Error Message:
Error checking out: command failed: Cloning into '/home/jenkins/jenkins-slave/workspace/n-box_maven-wagon_WAGON-526-MVYPB7RAMW5VZ4RA4NSMECE376IR6WO6PB7AIWCZTHT5KJGFZFHQ@2/m/wagon-providers/wagon-scm/target/test-output/checkout-org.apache.maven.scm.provider.git.gitexe.GitExeScmProvider'...
fatal: '/m/wagon-providers/wagon-scm/target/test-classes/test-repo-git-test/' does not appear to be a git repository
fatal: Could not read from remote repository.

Please make sure you have the correct access rights
and the repository exists.

Stack Trace:
org.apache.maven.wagon.TransferFailedException:
Error checking out: command failed: Cloning into '/home/jenkins/jenkins-slave/workspace/n-box_maven-wagon_WAGON-526-MVYPB7RAMW5VZ4RA4NSMECE376IR6WO6PB7AIWCZTHT5KJGFZFHQ@2/m/wagon-providers/wagon-scm/target/test-output/checkout-org.apache.maven.scm.provider.git.gitexe.GitExeScmProvider'...
fatal: '/m/wagon-providers/wagon-scm/target/test-classes/test-repo-git-test/' does not appear to be a git repository
fatal: Could not read from remote repository.

Please make sure you have the correct access rights
and the repository exists.
Caused by: org.apache.maven.scm.ScmException:
command failed: Cloning into '/home/jenkins/jenkins-slave/workspace/n-box_maven-wagon_WAGON-526-MVYPB7RAMW5VZ4RA4NSMECE376IR6WO6PB7AIWCZTHT5KJGFZFHQ@2/m/wagon-providers/wagon-scm/target/test-output/checkout-org.apache.maven.scm.provider.git.gitexe.GitExeScmProvider'...
fatal: '/m/wagon-providers/wagon-scm/target/test-classes/test-repo-git-test/' does not appear to be a git repository
fatal: Could not read from remote repository.

Please make sure you have the correct access rights
and the repository exists.


FAILED:  org.apache.maven.wagon.providers.scm.ScmGitExeWagonTest.testWagonPutDirectory

Error Message:
Error checking out: command failed: Cloning into 'F:\jenkins\jenkins-slave\workspace\n-box_maven-wagon_WAGON-526-MVYPB7RAMW5VZ4RA4NSMECE376IR6WO6PB7AIWCZTHT5KJGFZFHQ\m\wagon-providers\wagon-scm\target\test-output\checkout-org.apache.maven.scm.provider.git.gitexe.GitExeScmProvider'...
fatal: cannot stat 'F:/jenkins/jenkins-slave/workspace/n-box_maven-wagon_WAGON-526-MVYPB7RAMW5VZ4RA4NSMECE376IR6WO6PB7AIWCZTHT5KJGFZFHQ/m/wagon-providers/wagon-scm/target/test-output/checkout-org.apache.maven.scm.provider.git.gitexe.GitExeScmProvider/.git/hooks/applypatch-msg.sample': Filename too long

Stack Trace:
org.apache.maven.wagon.TransferFailedException:
Error checking out: command failed: Cloning into 'F:\jenkins\jenkins-slave\workspace\n-box_maven-wagon_WAGON-526-MVYPB7RAMW5VZ4RA4NSMECE376IR6WO6PB7AIWCZTHT5KJGFZFHQ\m\wagon-providers\wagon-scm\target\test-output\checkout-org.apache.maven.scm.provider.git.gitexe.GitExeScmProvider'...
fatal: cannot stat 'F:/jenkins/jenkins-slave/workspace/n-box_maven-wagon_WAGON-526-MVYPB7RAMW5VZ4RA4NSMECE376IR6WO6PB7AIWCZTHT5KJGFZFHQ/m/wagon-providers/wagon-scm/target/test-output/checkout-org.apache.maven.scm.provider.git.gitexe.GitExeScmProvider/.git/hooks/applypatch-msg.sample': Filename too long
Caused by: org.apache.maven.scm.ScmException:
command failed: Cloning into 'F:\jenkins\jenkins-slave\workspace\n-box_maven-wagon_WAGON-526-MVYPB7RAMW5VZ4RA4NSMECE376IR6WO6PB7AIWCZTHT5KJGFZFHQ\m\wagon-providers\wagon-scm\target\test-output\checkout-org.apache.maven.scm.provider.git.gitexe.GitExeScmProvider'...
fatal: cannot stat 'F:/jenkins/jenkins-slave/workspace/n-box_maven-wagon_WAGON-526-MVYPB7RAMW5VZ4RA4NSMECE376IR6WO6PB7AIWCZTHT5KJGFZFHQ/m/wagon-providers/wagon-scm/target/test-output/checkout-org.apache.maven.scm.provider.git.gitexe.GitExeScmProvider/.git/hooks/applypatch-msg.sample': Filename too long


FAILED:  org.apache.maven.wagon.providers.scm.ScmGitExeWagonTest.testWagonPutDirectoryDeepDestination

Error Message:
Error checking out: command failed: Cloning into 'F:\jenkins\jenkins-slave\workspace\n-box_maven-wagon_WAGON-526-MVYPB7RAMW5VZ4RA4NSMECE376IR6WO6PB7AIWCZTHT5KJGFZFHQ\m\wagon-providers\wagon-scm\target\test-output\checkout-org.apache.maven.scm.provider.git.gitexe.GitExeScmProvider'...
fatal: cannot stat 'F:/jenkins/jenkins-slave/workspace/n-box_maven-wagon_WAGON-526-MVYPB7RAMW5VZ4RA4NSMECE376IR6WO6PB7AIWCZTHT5KJGFZFHQ/m/wagon-providers/wagon-scm/target/test-output/checkout-org.apache.maven.scm.provider.git.gitexe.GitExeScmProvider/.git/hooks/applypatch-msg.sample': Filename too long

Stack Trace:
org.apache.maven.wagon.TransferFailedException:
Error checking out: command failed: Cloning into 'F:\jenkins\jenkins-slave\workspace\n-box_maven-wagon_WAGON-526-MVYPB7RAMW5VZ4RA4NSMECE376IR6WO6PB7AIWCZTHT5KJGFZFHQ\m\wagon-providers\wagon-scm\target\test-output\checkout-org.apache.maven.scm.provider.git.gitexe.GitExeScmProvider'...
fatal: cannot stat 'F:/jenkins/jenkins-slave/workspace/n-box_maven-wagon_WAGON-526-MVYPB7RAMW5VZ4RA4NSMECE376IR6WO6PB7AIWCZTHT5KJGFZFHQ/m/wagon-providers/wagon-scm/target/test-output/checkout-org.apache.maven.scm.provider.git.gitexe.GitExeScmProvider/.git/hooks/applypatch-msg.sample': Filename too long
Caused by: org.apache.maven.scm.ScmException:
command failed: Cloning into 'F:\jenkins\jenkins-slave\workspace\n-box_maven-wagon_WAGON-526-MVYPB7RAMW5VZ4RA4NSMECE376IR6WO6PB7AIWCZTHT5KJGFZFHQ\m\wagon-providers\wagon-scm\target\test-output\checkout-org.apache.maven.scm.provider.git.gitexe.GitExeScmProvider'...
fatal: cannot stat 'F:/jenkins/jenkins-slave/workspace/n-box_maven-wagon_WAGON-526-MVYPB7RAMW5VZ4RA4NSMECE376IR6WO6PB7AIWCZTHT5KJGFZFHQ/m/wagon-providers/wagon-scm/target/test-output/checkout-org.apache.maven.scm.provider.git.gitexe.GitExeScmProvider/.git/hooks/applypatch-msg.sample': Filename too long


FAILED:  org.apache.maven.wagon.providers.scm.ScmGitExeWagonTest.testWagon

Error Message:

  Unexpected method call TransferListener.transferError(TransferEvent[GET|ERROR|Repository[scm:git:file:///F:/jenkins/jenkins-slave/workspace/n-box_maven-wagon_WAGON-526-MVYPB7RAMW5VZ4RA4NSMECE376IR6WO6PB7AIWCZTHT5KJGFZFHQ/m/wagon-providers/wagon-scm/target/test-classes/test-repo-git-test/]|null|test-resource[len = 18; mod = 1539194076814]]):
    TransferListener.transferCompleted(TransferEvent[PUT|COMPLETED|Repository[scm:git:file:///F:/jenkins/jenkins-slave/workspace/n-box_maven-wagon_WAGON-526-MVYPB7RAMW5VZ4RA4NSMECE376IR6WO6PB7AIWCZTHT5KJGFZFHQ/m/wagon-providers/wagon-scm/target/test-classes/test-repo-git-test/]|F:\jenkins\jenkins-slave\workspace\n-box_maven-wagon_WAGON-526-MVYPB7RAMW5VZ4RA4NSMECE376IR6WO6PB7AIWCZTHT5KJGFZFHQ\m\wagon-providers\wagon-scm\target\test-output\test-resource|test-resource[len = 18; mod = 1539194076814]]): expected: 1, actual: 0

Stack Trace:
java.lang.AssertionError:

  Unexpected method call TransferListener.transferError(TransferEvent[GET|ERROR|Repository[scm:git:file:///F:/jenkins/jenkins-slave/workspace/n-box_maven-wagon_WAGON-526-MVYPB7RAMW5VZ4RA4NSMECE376IR6WO6PB7AIWCZTHT5KJGFZFHQ/m/wagon-providers/wagon-scm/target/test-classes/test-repo-git-test/]|null|test-resource[len = 18; mod = 1539194076814]]):
    TransferListener.transferCompleted(TransferEvent[PUT|COMPLETED|Repository[scm:git:file:///F:/jenkins/jenkins-slave/workspace/n-box_maven-wagon_WAGON-526-MVYPB7RAMW5VZ4RA4NSMECE376IR6WO6PB7AIWCZTHT5KJGFZFHQ/m/wagon-providers/wagon-scm/target/test-classes/test-repo-git-test/]|F:\jenkins\jenkins-slave\workspace\n-box_maven-wagon_WAGON-526-MVYPB7RAMW5VZ4RA4NSMECE376IR6WO6PB7AIWCZTHT5KJGFZFHQ\m\wagon-providers\wagon-scm\target\test-output\test-resource|test-resource[len = 18; mod = 1539194076814]]): expected: 1, actual: 0


FAILED:  org.apache.maven.wagon.providers.scm.ScmGitExeWagonTest.testWagonPutDirectoryForDot

Error Message:
Error checking out: command failed: Cloning into 'F:\jenkins\jenkins-slave\workspace\n-box_maven-wagon_WAGON-526-MVYPB7RAMW5VZ4RA4NSMECE376IR6WO6PB7AIWCZTHT5KJGFZFHQ\m\wagon-providers\wagon-scm\target\test-output\checkout-org.apache.maven.scm.provider.git.gitexe.GitExeScmProvider'...
fatal: cannot stat 'F:/jenkins/jenkins-slave/workspace/n-box_maven-wagon_WAGON-526-MVYPB7RAMW5VZ4RA4NSMECE376IR6WO6PB7AIWCZTHT5KJGFZFHQ/m/wagon-providers/wagon-scm/target/test-output/checkout-org.apache.maven.scm.provider.git.gitexe.GitExeScmProvider/.git/hooks/applypatch-msg.sample': Filename too long

Stack Trace:
org.apache.maven.wagon.TransferFailedException:
Error checking out: command failed: Cloning into 'F:\jenkins\jenkins-slave\workspace\n-box_maven-wagon_WAGON-526-MVYPB7RAMW5VZ4RA4NSMECE376IR6WO6PB7AIWCZTHT5KJGFZFHQ\m\wagon-providers\wagon-scm\target\test-output\checkout-org.apache.maven.scm.provider.git.gitexe.GitExeScmProvider'...
fatal: cannot stat 'F:/jenkins/jenkins-slave/workspace/n-box_maven-wagon_WAGON-526-MVYPB7RAMW5VZ4RA4NSMECE376IR6WO6PB7AIWCZTHT5KJGFZFHQ/m/wagon-providers/wagon-scm/target/test-output/checkout-org.apache.maven.scm.provider.git.gitexe.GitExeScmProvider/.git/hooks/applypatch-msg.sample': Filename too long
Caused by: org.apache.maven.scm.ScmException:
command failed: Cloning into 'F:\jenkins\jenkins-slave\workspace\n-box_maven-wagon_WAGON-526-MVYPB7RAMW5VZ4RA4NSMECE376IR6WO6PB7AIWCZTHT5KJGFZFHQ\m\wagon-providers\wagon-scm\target\test-output\checkout-org.apache.maven.scm.provider.git.gitexe.GitExeScmProvider'...
fatal: cannot stat 'F:/jenkins/jenkins-slave/workspace/n-box_maven-wagon_WAGON-526-MVYPB7RAMW5VZ4RA4NSMECE376IR6WO6PB7AIWCZTHT5KJGFZFHQ/m/wagon-providers/wagon-scm/target/test-output/checkout-org.apache.maven.scm.provider.git.gitexe.GitExeScmProvider/.git/hooks/applypatch-msg.sample': Filename too long


FAILED:  org.apache.maven.wagon.providers.scm.ScmGitExeWagonTest.testFailedGet

Error Message:
Error getting file from SCM

Stack Trace:
org.apache.maven.wagon.TransferFailedException: Error getting file from SCM
Caused by: org.apache.maven.scm.ScmException:
command failed: Cloning into 'F:\jenkins\jenkins-slave\workspace\n-box_maven-wagon_WAGON-526-MVYPB7RAMW5VZ4RA4NSMECE376IR6WO6PB7AIWCZTHT5KJGFZFHQ\m\wagon-providers\wagon-scm\target\test-output\checkout-org.apache.maven.scm.provider.git.gitexe.GitExeScmProvider'...
fatal: cannot stat 'F:/jenkins/jenkins-slave/workspace/n-box_maven-wagon_WAGON-526-MVYPB7RAMW5VZ4RA4NSMECE376IR6WO6PB7AIWCZTHT5KJGFZFHQ/m/wagon-providers/wagon-scm/target/test-output/checkout-org.apache.maven.scm.provider.git.gitexe.GitExeScmProvider/.git/hooks/applypatch-msg.sample': Filename too long


FAILED:  org.apache.maven.wagon.providers.scm.ScmGitExeWagonTest.testWagonPutDirectoryWhenDirectoryAlreadyExists

Error Message:
Error checking out: command failed: Cloning into 'F:\jenkins\jenkins-slave\workspace\n-box_maven-wagon_WAGON-526-MVYPB7RAMW5VZ4RA4NSMECE376IR6WO6PB7AIWCZTHT5KJGFZFHQ\m\wagon-providers\wagon-scm\target\test-output\checkout-org.apache.maven.scm.provider.git.gitexe.GitExeScmProvider'...
fatal: cannot stat 'F:/jenkins/jenkins-slave/workspace/n-box_maven-wagon_WAGON-526-MVYPB7RAMW5VZ4RA4NSMECE376IR6WO6PB7AIWCZTHT5KJGFZFHQ/m/wagon-providers/wagon-scm/target/test-output/checkout-org.apache.maven.scm.provider.git.gitexe.GitExeScmProvider/.git/hooks/applypatch-msg.sample': Filename too long

Stack Trace:
org.apache.maven.wagon.TransferFailedException:
Error checking out: command failed: Cloning into 'F:\jenkins\jenkins-slave\workspace\n-box_maven-wagon_WAGON-526-MVYPB7RAMW5VZ4RA4NSMECE376IR6WO6PB7AIWCZTHT5KJGFZFHQ\m\wagon-providers\wagon-scm\target\test-output\checkout-org.apache.maven.scm.provider.git.gitexe.GitExeScmProvider'...
fatal: cannot stat 'F:/jenkins/jenkins-slave/workspace/n-box_maven-wagon_WAGON-526-MVYPB7RAMW5VZ4RA4NSMECE376IR6WO6PB7AIWCZTHT5KJGFZFHQ/m/wagon-providers/wagon-scm/target/test-output/checkout-org.apache.maven.scm.provider.git.gitexe.GitExeScmProvider/.git/hooks/applypatch-msg.sample': Filename too long
Caused by: org.apache.maven.scm.ScmException:
command failed: Cloning into 'F:\jenkins\jenkins-slave\workspace\n-box_maven-wagon_WAGON-526-MVYPB7RAMW5VZ4RA4NSMECE376IR6WO6PB7AIWCZTHT5KJGFZFHQ\m\wagon-providers\wagon-scm\target\test-output\checkout-org.apache.maven.scm.provider.git.gitexe.GitExeScmProvider'...
fatal: cannot stat 'F:/jenkins/jenkins-slave/workspace/n-box_maven-wagon_WAGON-526-MVYPB7RAMW5VZ4RA4NSMECE376IR6WO6PB7AIWCZTHT5KJGFZFHQ/m/wagon-providers/wagon-scm/target/test-output/checkout-org.apache.maven.scm.provider.git.gitexe.GitExeScmProvider/.git/hooks/applypatch-msg.sample': Filename too long


FAILED:  org.apache.maven.wagon.providers.scm.ScmGitExeWagonTest.testWagonPutDirectory

Error Message:
Error checking out: command failed: Cloning into 'F:\jenkins\jenkins-slave\workspace\n-box_maven-wagon_WAGON-526-MVYPB7RAMW5VZ4RA4NSMECE376IR6WO6PB7AIWCZTHT5KJGFZFHQ\m\wagon-providers\wagon-scm\target\test-output\checkout-org.apache.maven.scm.provider.git.gitexe.GitExeScmProvider'...
fatal: '$GIT_DIR' too big
fatal: index-pack failed

Stack Trace:
org.apache.maven.wagon.TransferFailedException:
Error checking out: command failed: Cloning into 'F:\jenkins\jenkins-slave\workspace\n-box_maven-wagon_WAGON-526-MVYPB7RAMW5VZ4RA4NSMECE376IR6WO6PB7AIWCZTHT5KJGFZFHQ\m\wagon-providers\wagon-scm\target\test-output\checkout-org.apache.maven.scm.provider.git.gitexe.GitExeScmProvider'...
fatal: '$GIT_DIR' too big
fatal: index-pack failed
Caused by: org.apache.maven.scm.ScmException:
command failed: Cloning into 'F:\jenkins\jenkins-slave\workspace\n-box_maven-wagon_WAGON-526-MVYPB7RAMW5VZ4RA4NSMECE376IR6WO6PB7AIWCZTHT5KJGFZFHQ\m\wagon-providers\wagon-scm\target\test-output\checkout-org.apache.maven.scm.provider.git.gitexe.GitExeScmProvider'...
fatal: '$GIT_DIR' too big
fatal: index-pack failed


FAILED:  org.apache.maven.wagon.providers.scm.ScmGitExeWagonTest.testWagonPutDirectoryDeepDestination

Error Message:
Error checking out: command failed: Cloning into 'F:\jenkins\jenkins-slave\workspace\n-box_maven-wagon_WAGON-526-MVYPB7RAMW5VZ4RA4NSMECE376IR6WO6PB7AIWCZTHT5KJGFZFHQ\m\wagon-providers\wagon-scm\target\test-output\checkout-org.apache.maven.scm.provider.git.gitexe.GitExeScmProvider'...
fatal: '$GIT_DIR' too big
fatal: index-pack failed

Stack Trace:
org.apache.maven.wagon.TransferFailedException:
Error checking out: command failed: Cloning into 'F:\jenkins\jenkins-slave\workspace\n-box_maven-wagon_WAGON-526-MVYPB7RAMW5VZ4RA4NSMECE376IR6WO6PB7AIWCZTHT5KJGFZFHQ\m\wagon-providers\wagon-scm\target\test-output\checkout-org.apache.maven.scm.provider.git.gitexe.GitExeScmProvider'...
fatal: '$GIT_DIR' too big
fatal: index-pack failed
Caused by: org.apache.maven.scm.ScmException:
command failed: Cloning into 'F:\jenkins\jenkins-slave\workspace\n-box_maven-wagon_WAGON-526-MVYPB7RAMW5VZ4RA4NSMECE376IR6WO6PB7AIWCZTHT5KJGFZFHQ\m\wagon-providers\wagon-scm\target\test-output\checkout-org.apache.maven.scm.provider.git.gitexe.GitExeScmProvider'...
fatal: '$GIT_DIR' too big
fatal: index-pack failed


FAILED:  org.apache.maven.wagon.providers.scm.ScmGitExeWagonTest.testWagon

Error Message:

  Unexpected method call TransferListener.transferError(TransferEvent[GET|ERROR|Repository[scm:git:file:///F:/jenkins/jenkins-slave/workspace/n-box_maven-wagon_WAGON-526-MVYPB7RAMW5VZ4RA4NSMECE376IR6WO6PB7AIWCZTHT5KJGFZFHQ/m/wagon-providers/wagon-scm/target/test-classes/test-repo-git-test/]|null|test-resource[len = 18; mod = 1539194124548]]):
    TransferListener.transferCompleted(TransferEvent[PUT|COMPLETED|Repository[scm:git:file:///F:/jenkins/jenkins-slave/workspace/n-box_maven-wagon_WAGON-526-MVYPB7RAMW5VZ4RA4NSMECE376IR6WO6PB7AIWCZTHT5KJGFZFHQ/m/wagon-providers/wagon-scm/target/test-classes/test-repo-git-test/]|F:\jenkins\jenkins-slave\workspace\n-box_maven-wagon_WAGON-526-MVYPB7RAMW5VZ4RA4NSMECE376IR6WO6PB7AIWCZTHT5KJGFZFHQ\m\wagon-providers\wagon-scm\target\test-output\test-resource|test-resource[len = 18; mod = 1539194124548]]): expected: 1, actual: 0

Stack Trace:
java.lang.AssertionError:

  Unexpected method call TransferListener.transferError(TransferEvent[GET|ERROR|Repository[scm:git:file:///F:/jenkins/jenkins-slave/workspace/n-box_maven-wagon_WAGON-526-MVYPB7RAMW5VZ4RA4NSMECE376IR6WO6PB7AIWCZTHT5KJGFZFHQ/m/wagon-providers/wagon-scm/target/test-classes/test-repo-git-test/]|null|test-resource[len = 18; mod = 1539194124548]]):
    TransferListener.transferCompleted(TransferEvent[PUT|COMPLETED|Repository[scm:git:file:///F:/jenkins/jenkins-slave/workspace/n-box_maven-wagon_WAGON-526-MVYPB7RAMW5VZ4RA4NSMECE376IR6WO6PB7AIWCZTHT5KJGFZFHQ/m/wagon-providers/wagon-scm/target/test-classes/test-repo-git-test/]|F:\jenkins\jenkins-slave\workspace\n-box_maven-wagon_WAGON-526-MVYPB7RAMW5VZ4RA4NSMECE376IR6WO6PB7AIWCZTHT5KJGFZFHQ\m\wagon-providers\wagon-scm\target\test-output\test-resource|test-resource[len = 18; mod = 1539194124548]]): expected: 1, actual: 0


FAILED:  org.apache.maven.wagon.providers.scm.ScmGitExeWagonTest.testWagonPutDirectoryForDot

Error Message:
Error checking out: command failed: Cloning into 'F:\jenkins\jenkins-slave\workspace\n-box_maven-wagon_WAGON-526-MVYPB7RAMW5VZ4RA4NSMECE376IR6WO6PB7AIWCZTHT5KJGFZFHQ\m\wagon-providers\wagon-scm\target\test-output\checkout-org.apache.maven.scm.provider.git.gitexe.GitExeScmProvider'...
fatal: '$GIT_DIR' too big
fatal: index-pack failed

Stack Trace:
org.apache.maven.wagon.TransferFailedException:
Error checking out: command failed: Cloning into 'F:\jenkins\jenkins-slave\workspace\n-box_maven-wagon_WAGON-526-MVYPB7RAMW5VZ4RA4NSMECE376IR6WO6PB7AIWCZTHT5KJGFZFHQ\m\wagon-providers\wagon-scm\target\test-output\checkout-org.apache.maven.scm.provider.git.gitexe.GitExeScmProvider'...
fatal: '$GIT_DIR' too big
fatal: index-pack failed
Caused by: org.apache.maven.scm.ScmException:
command failed: Cloning into 'F:\jenkins\jenkins-slave\workspace\n-box_maven-wagon_WAGON-526-MVYPB7RAMW5VZ4RA4NSMECE376IR6WO6PB7AIWCZTHT5KJGFZFHQ\m\wagon-providers\wagon-scm\target\test-output\checkout-org.apache.maven.scm.provider.git.gitexe.GitExeScmProvider'...
fatal: '$GIT_DIR' too big
fatal: index-pack failed


FAILED:  org.apache.maven.wagon.providers.scm.ScmGitExeWagonTest.testFailedGet

Error Message:
Error getting file from SCM

Stack Trace:
org.apache.maven.wagon.TransferFailedException: Error getting file from SCM
Caused by: org.apache.maven.scm.ScmException:
command failed: Cloning into 'F:\jenkins\jenkins-slave\workspace\n-box_maven-wagon_WAGON-526-MVYPB7RAMW5VZ4RA4NSMECE376IR6WO6PB7AIWCZTHT5KJGFZFHQ\m\wagon-providers\wagon-scm\target\test-output\checkout-org.apache.maven.scm.provider.git.gitexe.GitExeScmProvider'...
fatal: '$GIT_DIR' too big
fatal: index-pack failed


FAILED:  org.apache.maven.wagon.providers.scm.ScmGitExeWagonTest.testWagonPutDirectoryWhenDirectoryAlreadyExists

Error Message:
Error checking out: command failed: Cloning into 'F:\jenkins\jenkins-slave\workspace\n-box_maven-wagon_WAGON-526-MVYPB7RAMW5VZ4RA4NSMECE376IR6WO6PB7AIWCZTHT5KJGFZFHQ\m\wagon-providers\wagon-scm\target\test-output\checkout-org.apache.maven.scm.provider.git.gitexe.GitExeScmProvider'...
fatal: '$GIT_DIR' too big
fatal: index-pack failed

Stack Trace:
org.apache.maven.wagon.TransferFailedException:
Error checking out: command failed: Cloning into 'F:\jenkins\jenkins-slave\workspace\n-box_maven-wagon_WAGON-526-MVYPB7RAMW5VZ4RA4NSMECE376IR6WO6PB7AIWCZTHT5KJGFZFHQ\m\wagon-providers\wagon-scm\target\test-output\checkout-org.apache.maven.scm.provider.git.gitexe.GitExeScmProvider'...
fatal: '$GIT_DIR' too big
fatal: index-pack failed
Caused by: org.apache.maven.scm.ScmException:
command failed: Cloning into 'F:\jenkins\jenkins-slave\workspace\n-box_maven-wagon_WAGON-526-MVYPB7RAMW5VZ4RA4NSMECE376IR6WO6PB7AIWCZTHT5KJGFZFHQ\m\wagon-providers\wagon-scm\target\test-output\checkout-org.apache.maven.scm.provider.git.gitexe.GitExeScmProvider'...
fatal: '$GIT_DIR' too big
fatal: index-pack failed


FAILED:  org.apache.maven.wagon.providers.scm.ScmGitExeWagonTest.testWagonPutDirectory

Error Message:
Error checking out: command failed: Cloning into 'F:\jenkins\jenkins-slave\workspace\n-box_maven-wagon_WAGON-526-MVYPB7RAMW5VZ4RA4NSMECE376IR6WO6PB7AIWCZTHT5KJGFZFHQ\m\wagon-providers\wagon-scm\target\test-output\checkout-org.apache.maven.scm.provider.git.gitexe.GitExeScmProvider'...
fatal: '$GIT_DIR' too big
fatal: index-pack failed

Stack Trace:
org.apache.maven.wagon.TransferFailedException:
Error checking out: command failed: Cloning into 'F:\jenkins\jenkins-slave\workspace\n-box_maven-wagon_WAGON-526-MVYPB7RAMW5VZ4RA4NSMECE376IR6WO6PB7AIWCZTHT5KJGFZFHQ\m\wagon-providers\wagon-scm\target\test-output\checkout-org.apache.maven.scm.provider.git.gitexe.GitExeScmProvider'...
fatal: '$GIT_DIR' too big
fatal: index-pack failed
Caused by: org.apache.maven.scm.ScmException:
command failed: Cloning into 'F:\jenkins\jenkins-slave\workspace\n-box_maven-wagon_WAGON-526-MVYPB7RAMW5VZ4RA4NSMECE376IR6WO6PB7AIWCZTHT5KJGFZFHQ\m\wagon-providers\wagon-scm\target\test-output\checkout-org.apache.maven.scm.provider.git.gitexe.GitExeScmProvider'...
fatal: '$GIT_DIR' too big
fatal: index-pack failed


FAILED:  org.apache.maven.wagon.providers.scm.ScmGitExeWagonTest.testWagonPutDirectoryDeepDestination

Error Message:
Error checking out: command failed: Cloning into 'F:\jenkins\jenkins-slave\workspace\n-box_maven-wagon_WAGON-526-MVYPB7RAMW5VZ4RA4NSMECE376IR6WO6PB7AIWCZTHT5KJGFZFHQ\m\wagon-providers\wagon-scm\target\test-output\checkout-org.apache.maven.scm.provider.git.gitexe.GitExeScmProvider'...
fatal: '$GIT_DIR' too big
fatal: index-pack failed

Stack Trace:
org.apache.maven.wagon.TransferFailedException:
Error checking out: command failed: Cloning into 'F:\jenkins\jenkins-slave\workspace\n-box_maven-wagon_WAGON-526-MVYPB7RAMW5VZ4RA4NSMECE376IR6WO6PB7AIWCZTHT5KJGFZFHQ\m\wagon-providers\wagon-scm\target\test-output\checkout-org.apache.maven.scm.provider.git.gitexe.GitExeScmProvider'...
fatal: '$GIT_DIR' too big
fatal: index-pack failed
Caused by: org.apache.maven.scm.ScmException:
command failed: Cloning into 'F:\jenkins\jenkins-slave\workspace\n-box_maven-wagon_WAGON-526-MVYPB7RAMW5VZ4RA4NSMECE376IR6WO6PB7AIWCZTHT5KJGFZFHQ\m\wagon-providers\wagon-scm\target\test-output\checkout-org.apache.maven.scm.provider.git.gitexe.GitExeScmProvider'...
fatal: '$GIT_DIR' too big
fatal: index-pack failed


FAILED:  org.apache.maven.wagon.providers.scm.ScmGitExeWagonTest.testWagon

Error Message:

  Unexpected method call TransferListener.transferError(TransferEvent[GET|ERROR|Repository[scm:git:file:///F:/jenkins/jenkins-slave/workspace/n-box_maven-wagon_WAGON-526-MVYPB7RAMW5VZ4RA4NSMECE376IR6WO6PB7AIWCZTHT5KJGFZFHQ/m/wagon-providers/wagon-scm/target/test-classes/test-repo-git-test/]|null|test-resource[len = 18; mod = 1539194234486]]):
    TransferListener.transferCompleted(TransferEvent[PUT|COMPLETED|Repository[scm:git:file:///F:/jenkins/jenkins-slave/workspace/n-box_maven-wagon_WAGON-526-MVYPB7RAMW5VZ4RA4NSMECE376IR6WO6PB7AIWCZTHT5KJGFZFHQ/m/wagon-providers/wagon-scm/target/test-classes/test-repo-git-test/]|F:\jenkins\jenkins-slave\workspace\n-box_maven-wagon_WAGON-526-MVYPB7RAMW5VZ4RA4NSMECE376IR6WO6PB7AIWCZTHT5KJGFZFHQ\m\wagon-providers\wagon-scm\target\test-output\test-resource|test-resource[len = 18; mod = 1539194234486]]): expected: 1, actual: 0

Stack Trace:
java.lang.AssertionError:

  Unexpected method call TransferListener.transferError(TransferEvent[GET|ERROR|Repository[scm:git:file:///F:/jenkins/jenkins-slave/workspace/n-box_maven-wagon_WAGON-526-MVYPB7RAMW5VZ4RA4NSMECE376IR6WO6PB7AIWCZTHT5KJGFZFHQ/m/wagon-providers/wagon-scm/target/test-classes/test-repo-git-test/]|null|test-resource[len = 18; mod = 1539194234486]]):
    TransferListener.transferCompleted(TransferEvent[PUT|COMPLETED|Repository[scm:git:file:///F:/jenkins/jenkins-slave/workspace/n-box_maven-wagon_WAGON-526-MVYPB7RAMW5VZ4RA4NSMECE376IR6WO6PB7AIWCZTHT5KJGFZFHQ/m/wagon-providers/wagon-scm/target/test-classes/test-repo-git-test/]|F:\jenkins\jenkins-slave\workspace\n-box_maven-wagon_WAGON-526-MVYPB7RAMW5VZ4RA4NSMECE376IR6WO6PB7AIWCZTHT5KJGFZFHQ\m\wagon-providers\wagon-scm\target\test-output\test-resource|test-resource[len = 18; mod = 1539194234486]]): expected: 1, actual: 0


FAILED:  org.apache.maven.wagon.providers.scm.ScmGitExeWagonTest.testWagonPutDirectoryForDot

Error Message:
Error checking out: command failed: Cloning into 'F:\jenkins\jenkins-slave\workspace\n-box_maven-wagon_WAGON-526-MVYPB7RAMW5VZ4RA4NSMECE376IR6WO6PB7AIWCZTHT5KJGFZFHQ\m\wagon-providers\wagon-scm\target\test-output\checkout-org.apache.maven.scm.provider.git.gitexe.GitExeScmProvider'...
fatal: '$GIT_DIR' too big
fatal: index-pack failed

Stack Trace:
org.apache.maven.wagon.TransferFailedException:
Error checking out: command failed: Cloning into 'F:\jenkins\jenkins-slave\workspace\n-box_maven-wagon_WAGON-526-MVYPB7RAMW5VZ4RA4NSMECE376IR6WO6PB7AIWCZTHT5KJGFZFHQ\m\wagon-providers\wagon-scm\target\test-output\checkout-org.apache.maven.scm.provider.git.gitexe.GitExeScmProvider'...
fatal: '$GIT_DIR' too big
fatal: index-pack failed
Caused by: org.apache.maven.scm.ScmException:
command failed: Cloning into 'F:\jenkins\jenkins-slave\workspace\n-box_maven-wagon_WAGON-526-MVYPB7RAMW5VZ4RA4NSMECE376IR6WO6PB7AIWCZTHT5KJGFZFHQ\m\wagon-providers\wagon-scm\target\test-output\checkout-org.apache.maven.scm.provider.git.gitexe.GitExeScmProvider'...
fatal: '$GIT_DIR' too big
fatal: index-pack failed


FAILED:  org.apache.maven.wagon.providers.scm.ScmGitExeWagonTest.testFailedGet

Error Message:
Error getting file from SCM

Stack Trace:
org.apache.maven.wagon.TransferFailedException: Error getting file from SCM
Caused by: org.apache.maven.scm.ScmException:
command failed: Cloning into 'F:\jenkins\jenkins-slave\workspace\n-box_maven-wagon_WAGON-526-MVYPB7RAMW5VZ4RA4NSMECE376IR6WO6PB7AIWCZTHT5KJGFZFHQ\m\wagon-providers\wagon-scm\target\test-output\checkout-org.apache.maven.scm.provider.git.gitexe.GitExeScmProvider'...
fatal: '$GIT_DIR' too big
fatal: index-pack failed


FAILED:  org.apache.maven.wagon.providers.scm.ScmGitExeWagonTest.testWagonPutDirectoryWhenDirectoryAlreadyExists

Error Message:
Error checking out: command failed: Cloning into 'F:\jenkins\jenkins-slave\workspace\n-box_maven-wagon_WAGON-526-MVYPB7RAMW5VZ4RA4NSMECE376IR6WO6PB7AIWCZTHT5KJGFZFHQ\m\wagon-providers\wagon-scm\target\test-output\checkout-org.apache.maven.scm.provider.git.gitexe.GitExeScmProvider'...
fatal: '$GIT_DIR' too big
fatal: index-pack failed

Stack Trace:
org.apache.maven.wagon.TransferFailedException:
Error checking out: command failed: Cloning into 'F:\jenkins\jenkins-slave\workspace\n-box_maven-wagon_WAGON-526-MVYPB7RAMW5VZ4RA4NSMECE376IR6WO6PB7AIWCZTHT5KJGFZFHQ\m\wagon-providers\wagon-scm\target\test-output\checkout-org.apache.maven.scm.provider.git.gitexe.GitExeScmProvider'...
fatal: '$GIT_DIR' too big
fatal: index-pack failed
Caused by: org.apache.maven.scm.ScmException:
command failed: Cloning into 'F:\jenkins\jenkins-slave\workspace\n-box_maven-wagon_WAGON-526-MVYPB7RAMW5VZ4RA4NSMECE376IR6WO6PB7AIWCZTHT5KJGFZFHQ\m\wagon-providers\wagon-scm\target\test-output\checkout-org.apache.maven.scm.provider.git.gitexe.GitExeScmProvider'...
fatal: '$GIT_DIR' too big
fatal: index-pack failed




Build log:
[...truncated 3.36 MB...]
[windows-jdk9] [INFO]
[windows-jdk9] [INFO] --- maven-enforcer-plugin:1.4.1:enforce (default) @ wagon-ssh ---
[windows-jdk9] [INFO]
[windows-jdk9] [INFO] --- apache-rat-plugin:0.12:check (rat-check) @ wagon-ssh ---
[windows-jdk9] [INFO] Enabled default license matchers.
[windows-jdk9] [INFO] Will parse SCM ignores for exclusions...
[windows-jdk9] [INFO] Finished adding exclusions from SCM ignore files.
[windows-jdk9] [INFO] 61 implicit excludes (use -debug for more details).
[windows-jdk9] [INFO] Exclude: .checkstyle
[windows-jdk9] [INFO] Exclude: **/*.odg
[windows-jdk9] [INFO] Exclude: src/test/resources/**
[windows-jdk9] [INFO] Exclude: src/main/resources/default-server-root/**
[windows-jdk9] [INFO] Exclude: src/main/resources/ssh-keys/**
[windows-jdk9] [INFO] Exclude: src/test/ssh-keys/**
[windows-jdk9] [INFO] Exclude: .repository/**
[windows-jdk9] [INFO] Exclude: out/**
[windows-jdk9] [INFO] Exclude: .repository/**
[windows-jdk9] [INFO] Exclude: .maven/spy.log
[windows-jdk9] [INFO] Exclude: dependency-reduced-pom.xml
[windows-jdk9] [INFO] Exclude: .java-version
[windows-jdk9] [INFO] 19 resources included (use -debug for more details)
[windows-jdk9] [INFO] Rat check: Summary over all files. Unapproved: 0, unknown: 0, generated: 0, approved: 19 licenses.
[windows-jdk9] [INFO]
[windows-jdk9] [INFO] --- maven-remote-resources-plugin:1.5:process (process-resource-bundles) @ wagon-ssh ---
[windows-jdk9] [INFO]
[windows-jdk9] [INFO] --- maven-resources-plugin:3.0.2:resources (default-resources) @ wagon-ssh ---
[windows-jdk9] [INFO] Using 'UTF-8' encoding to copy filtered resources.
[windows-jdk9] [INFO] skip non existing resourceDirectory F:\jenkins\jenkins-slave\workspace\n-box_maven-wagon_WAGON-526-MVYPB7RAMW5VZ4RA4NSMECE376IR6WO6PB7AIWCZTHT5KJGFZFHQ\m\wagon-providers\wagon-ssh\src\main\resources
[windows-jdk9] [INFO] Copying 3 resources
[windows-jdk9] [INFO]
[windows-jdk9] [INFO] --- maven-compiler-plugin:3.7.0:compile (default-compile) @ wagon-ssh ---
[windows-jdk9] [INFO] Changes detected - recompiling the module!
[windows-jdk9] [INFO] Compiling 7 source files to F:\jenkins\jenkins-slave\workspace\n-box_maven-wagon_WAGON-526-MVYPB7RAMW5VZ4RA4NSMECE376IR6WO6PB7AIWCZTHT5KJGFZFHQ\m\wagon-providers\wagon-ssh\target\classes
[windows-jdk9] [INFO]
[windows-jdk9] [INFO] --- plexus-component-metadata:1.7.1:generate-metadata (generate) @ wagon-ssh ---
[windows-jdk9] [INFO] Discovered 4 component descriptors(s)
[windows-jdk9] [INFO]
[windows-jdk9] [INFO] --- animal-sniffer-maven-plugin:1.15:check (check-java-1.7-compat) @ wagon-ssh ---
[windows-jdk9] [INFO] Checking unresolved references to org.codehaus.mojo.signature:java17:1.0
[windows-jdk9] [INFO]
[windows-jdk9] [INFO] --- maven-resources-plugin:3.0.2:testResources (default-testResources) @ wagon-ssh ---
[windows-jdk9] [INFO] Using 'UTF-8' encoding to copy filtered resources.
[windows-jdk9] [INFO] Copying 6 resources
[windows-jdk9] [INFO] Copying 3 resources
[windows-jdk9] [INFO]
[windows-jdk9] [INFO] --- maven-compiler-plugin:3.7.0:testCompile (default-testCompile) @ wagon-ssh ---
[windows-jdk9] [INFO] Changes detected - recompiling the module!
[windows-jdk9] [INFO] Compiling 8 source files to F:\jenkins\jenkins-slave\workspace\n-box_maven-wagon_WAGON-526-MVYPB7RAMW5VZ4RA4NSMECE376IR6WO6PB7AIWCZTHT5KJGFZFHQ\m\wagon-providers\wagon-ssh\target\test-classes
[windows-jdk9] [INFO] /F:/jenkins/jenkins-slave/workspace/n-box_maven-wagon_WAGON-526-MVYPB7RAMW5VZ4RA4NSMECE376IR6WO6PB7AIWCZTHT5KJGFZFHQ/m/wagon-providers/wagon-ssh/src/test/java/org/apache/maven/wagon/providers/ssh/jsch/ScpWagonWithSshPrivateKeySearchTest.java: F:\jenkins\jenkins-slave\workspace\n-box_maven-wagon_WAGON-526-MVYPB7RAMW5VZ4RA4NSMECE376IR6WO6PB7AIWCZTHT5KJGFZFHQ\m\wagon-providers\wagon-ssh\src\test\java\org\apache\maven\wagon\providers\ssh\jsch\ScpWagonWithSshPrivateKeySearchTest.java uses or overrides a deprecated API.
[windows-jdk9] [INFO] /F:/jenkins/jenkins-slave/workspace/n-box_maven-wagon_WAGON-526-MVYPB7RAMW5VZ4RA4NSMECE376IR6WO6PB7AIWCZTHT5KJGFZFHQ/m/wagon-providers/wagon-ssh/src/test/java/org/apache/maven/wagon/providers/ssh/jsch/ScpWagonWithSshPrivateKeySearchTest.java: Recompile with -Xlint:deprecation for details.
[windows-jdk9] [INFO]
[windows-jdk9] [INFO] --- maven-surefire-plugin:2.20:test (default-test) @ wagon-ssh ---
[windows-jdk9] [INFO]
[windows-jdk9] [INFO] --- maven-jar-plugin:3.0.2:jar (default-jar) @ wagon-ssh ---
[windows-jdk9] [INFO] Building jar: F:\jenkins\jenkins-slave\workspace\n-box_maven-wagon_WAGON-526-MVYPB7RAMW5VZ4RA4NSMECE376IR6WO6PB7AIWCZTHT5KJGFZFHQ\m\wagon-providers\wagon-ssh\target\wagon-ssh-3.1.1-SNAPSHOT.jar
[windows-jdk9] [INFO]
[windows-jdk9] [INFO] --- maven-site-plugin:3.7:attach-descriptor (attach-descriptor) @ wagon-ssh ---
[windows-jdk9] [INFO] Skipping because packaging 'jar' is not pom.
[windows-jdk9] [INFO]
[windows-jdk9] [INFO] --- maven-checkstyle-plugin:3.0.0:check (checkstyle-check) @ wagon-ssh ---
[windows-jdk9] [INFO] There is 1 error reported by Checkstyle 6.18 with config/maven_checks.xml ruleset.
[windows-jdk9] [INFO] Ignored 1 error, 0 violation remaining.
[windows-jdk9] [INFO]
[windows-jdk9] [INFO] ------------------------------------------------------------------------
[windows-jdk9] [INFO] Building Apache Maven Wagon :: Providers :: WebDAV Provider 3.1.1-SNAPSHOT
[windows-jdk9] [INFO] ------------------------------------------------------------------------
[windows-jdk9] [INFO] Downloading from central: https://repo.maven.apache.org/maven2/org/apache/jackrabbit/jackrabbit-webdav/2.14.4/jackrabbit-webdav-2.14.4.pom
[windows-jdk9] [INFO] Downloaded from central: https://repo.maven.apache.org/maven2/org/apache/jackrabbit/jackrabbit-webdav/2.14.4/jackrabbit-webdav-2.14.4.pom (4.0 kB at 146 kB/s)
[windows-jdk9] [INFO] Downloading from central: https://repo.maven.apache.org/maven2/org/apache/jackrabbit/jackrabbit-parent/2.14.4/jackrabbit-parent-2.14.4.pom
[windows-jdk9] [INFO] Downloaded from central: https://repo.maven.apache.org/maven2/org/apache/jackrabbit/jackrabbit-parent/2.14.4/jackrabbit-parent-2.14.4.pom (35 kB at 1.1 MB/s)
[windows-jdk9] [INFO] Downloading from central: https://repo.maven.apache.org/maven2/it/could/webdav/0.4/webdav-0.4.pom
[windows-jdk9] [INFO] Downloaded from central: https://repo.maven.apache.org/maven2/it/could/webdav/0.4/webdav-0.4.pom (1.1 kB at 71 kB/s)
[windows-jdk9] [INFO] Downloading from central: https://repo.maven.apache.org/maven2/biz/aQute/bnd/1.50.0/bnd-1.50.0.pom
[windows-jdk9] [INFO] Downloaded from central: https://repo.maven.apache.org/maven2/biz/aQute/bnd/1.50.0/bnd-1.50.0.pom (1.3 kB at 39 kB/s)
[windows-jdk9] [INFO] Downloading from central: https://repo.maven.apache.org/maven2/org/apache/jackrabbit/jackrabbit-webdav/2.14.4/jackrabbit-webdav-2.14.4.jar
[windows-jdk9] [INFO] Downloading from central: https://repo.maven.apache.org/maven2/it/could/webdav/0.4/webdav-0.4.jar
[windows-jdk9] [INFO] Downloading from central: https://repo.maven.apache.org/maven2/biz/aQute/bnd/1.50.0/bnd-1.50.0.jar
[windows-jdk9] [INFO] Downloading from central: https://repo.maven.apache.org/maven2/javax/servlet/servlet-api/2.3/servlet-api-2.3.jar
[windows-jdk9] [INFO] Downloaded from central: https://repo.maven.apache.org/maven2/it/could/webdav/0.4/webdav-0.4.jar (103 kB at 1.6 MB/s)
[windows-jdk9] [INFO] Downloaded from central: https://repo.maven.apache.org/maven2/javax/servlet/servlet-api/2.3/servlet-api-2.3.jar (78 kB at 1.1 MB/s)
[windows-jdk9] [INFO] Downloaded from central: https://repo.maven.apache.org/maven2/org/apache/jackrabbit/jackrabbit-webdav/2.14.4/jackrabbit-webdav-2.14.4.jar (365 kB at 4.6 MB/s)
[windows-jdk9] [INFO] Downloaded from central: https://repo.maven.apache.org/maven2/biz/aQute/bnd/1.50.0/bnd-1.50.0.jar (828 kB at 8.6 MB/s)
[windows-jdk9] [INFO]
[windows-jdk9] [INFO] --- maven-clean-plugin:3.0.0:clean (default-clean) @ wagon-webdav-jackrabbit ---
[windows-jdk9] [INFO]
[windows-jdk9] [INFO] --- maven-enforcer-plugin:1.4.1:enforce (enforce-maven-version) @ wagon-webdav-jackrabbit ---
[windows-jdk9] [INFO]
[windows-jdk9] [INFO] --- maven-enforcer-plugin:1.4.1:enforce (enforce-bytecode-version) @ wagon-webdav-jackrabbit ---
[windows-jdk9] [INFO]
[windows-jdk9] [INFO] --- maven-enforcer-plugin:1.4.1:enforce (ban-known-bad-maven-versions) @ wagon-webdav-jackrabbit ---
[windows-jdk9] [INFO]
[windows-jdk9] [INFO] --- maven-enforcer-plugin:1.4.1:enforce (default) @ wagon-webdav-jackrabbit ---
[windows-jdk9] [INFO]
[windows-jdk9] [INFO] --- apache-rat-plugin:0.12:check (rat-check) @ wagon-webdav-jackrabbit ---
[windows-jdk9] [INFO] Enabled default license matchers.
[windows-jdk9] [INFO] Will parse SCM ignores for exclusions...
[windows-jdk9] [INFO] Finished adding exclusions from SCM ignore files.
[windows-jdk9] [INFO] 61 implicit excludes (use -debug for more details).
[windows-jdk9] [INFO] Exclude: .checkstyle
[windows-jdk9] [INFO] Exclude: **/*.odg
[windows-jdk9] [INFO] Exclude: src/test/resources/**
[windows-jdk9] [INFO] Exclude: src/main/resources/default-server-root/**
[windows-jdk9] [INFO] Exclude: src/main/resources/ssh-keys/**
[windows-jdk9] [INFO] Exclude: src/test/ssh-keys/**
[windows-jdk9] [INFO] Exclude: .repository/**
[windows-jdk9] [INFO] Exclude: out/**
[windows-jdk9] [INFO] Exclude: .repository/**
[windows-jdk9] [INFO] Exclude: .maven/spy.log
[windows-jdk9] [INFO] Exclude: dependency-reduced-pom.xml
[windows-jdk9] [INFO] Exclude: .java-version
[windows-jdk9] [INFO] 12 resources included (use -debug for more details)
[windows-jdk9] [INFO] Rat check: Summary over all files. Unapproved: 0, unknown: 0, generated: 0, approved: 12 licenses.
[windows-jdk9] [INFO]
[windows-jdk9] [INFO] --- maven-remote-resources-plugin:1.5:process (process-resource-bundles) @ wagon-webdav-jackrabbit ---
[windows-jdk9] [INFO]
[windows-jdk9] [INFO] --- maven-resources-plugin:3.0.2:resources (default-resources) @ wagon-webdav-jackrabbit ---
[windows-jdk9] [INFO] Using 'UTF-8' encoding to copy filtered resources.
[windows-jdk9] [INFO] Copying 1 resource
[windows-jdk9] [INFO] Copying 3 resources
[windows-jdk9] [INFO]
[windows-jdk9] [INFO] --- maven-compiler-plugin:3.7.0:compile (default-compile) @ wagon-webdav-jackrabbit ---
[windows-jdk9] [INFO] Changes detected - recompiling the module!
[windows-jdk9] [INFO] Compiling 4 source files to F:\jenkins\jenkins-slave\workspace\n-box_maven-wagon_WAGON-526-MVYPB7RAMW5VZ4RA4NSMECE376IR6WO6PB7AIWCZTHT5KJGFZFHQ\m\wagon-providers\wagon-webdav-jackrabbit\target\classes
[windows-jdk9] [INFO] /F:/jenkins/jenkins-slave/workspace/n-box_maven-wagon_WAGON-526-MVYPB7RAMW5VZ4RA4NSMECE376IR6WO6PB7AIWCZTHT5KJGFZFHQ/m/wagon-providers/wagon-webdav-jackrabbit/src/main/java/org/apache/maven/wagon/providers/webdav/WebDavWagon.java: F:\jenkins\jenkins-slave\workspace\n-box_maven-wagon_WAGON-526-MVYPB7RAMW5VZ4RA4NSMECE376IR6WO6PB7AIWCZTHT5KJGFZFHQ\m\wagon-providers\wagon-webdav-jackrabbit\src\main\java\org\apache\maven\wagon\providers\webdav\WebDavWagon.java uses or overrides a deprecated API.
[windows-jdk9] [INFO] /F:/jenkins/jenkins-slave/workspace/n-box_maven-wagon_WAGON-526-MVYPB7RAMW5VZ4RA4NSMECE376IR6WO6PB7AIWCZTHT5KJGFZFHQ/m/wagon-providers/wagon-webdav-jackrabbit/src/main/java/org/apache/maven/wagon/providers/webdav/WebDavWagon.java: Recompile with -Xlint:deprecation for details.
[windows-jdk9] [INFO]
[windows-jdk9] [INFO] --- plexus-component-metadata:1.7.1:generate-metadata (generate) @ wagon-webdav-jackrabbit ---
[windows-jdk9] [INFO] Discovered 1 component descriptors(s)
[windows-jdk9] [INFO]
[windows-jdk9] [INFO] --- animal-sniffer-maven-plugin:1.15:check (check-java-1.7-compat) @ wagon-webdav-jackrabbit ---
[windows-jdk9] [INFO] Checking unresolved references to org.codehaus.mojo.signature:java17:1.0
[windows-jdk9] [INFO]
[windows-jdk9] [INFO] --- maven-resources-plugin:3.0.2:testResources (default-testResources) @ wagon-webdav-jackrabbit ---
[windows-jdk9] [INFO] Using 'UTF-8' encoding to copy filtered resources.
[windows-jdk9] [INFO] Copying 2 resources
[windows-jdk9] [INFO] Copying 3 resources
[windows-jdk9] [INFO]
[windows-jdk9] [INFO] --- maven-compiler-plugin:3.7.0:testCompile (default-testCompile) @ wagon-webdav-jackrabbit ---
[windows-jdk9] [INFO] Changes detected - recompiling the module!
[windows-jdk9] [INFO] Compiling 4 source files to F:\jenkins\jenkins-slave\workspace\n-box_maven-wagon_WAGON-526-MVYPB7RAMW5VZ4RA4NSMECE376IR6WO6PB7AIWCZTHT5KJGFZFHQ\m\wagon-providers\wagon-webdav-jackrabbit\target\test-classes
[windows-jdk9] [INFO] /F:/jenkins/jenkins-slave/workspace/n-box_maven-wagon_WAGON-526-MVYPB7RAMW5VZ4RA4NSMECE376IR6WO6PB7AIWCZTHT5KJGFZFHQ/m/wagon-providers/wagon-webdav-jackrabbit/src/test/java/org/apache/maven/wagon/providers/webdav/HttpClientWagonTest.java: F:\jenkins\jenkins-slave\workspace\n-box_maven-wagon_WAGON-526-MVYPB7RAMW5VZ4RA4NSMECE376IR6WO6PB7AIWCZTHT5KJGFZFHQ\m\wagon-providers\wagon-webdav-jackrabbit\src\test\java\org\apache\maven\wagon\providers\webdav\HttpClientWagonTest.java uses or overrides a deprecated API.
[windows-jdk9] [INFO] /F:/jenkins/jenkins-slave/workspace/n-box_maven-wagon_WAGON-526-MVYPB7RAMW5VZ4RA4NSMECE376IR6WO6PB7AIWCZTHT5KJGFZFHQ/m/wagon-providers/wagon-webdav-jackrabbit/src/test/java/org/apache/maven/wagon/providers/webdav/HttpClientWagonTest.java: Recompile with -Xlint:deprecation for details.
[windows-jdk9] [INFO]
[windows-jdk9] [INFO] --- maven-surefire-plugin:2.20:test (default-test) @ wagon-webdav-jackrabbit ---
[windows-jdk9] [INFO]
[windows-jdk9] [INFO] -------------------------------------------------------
[windows-jdk9] [INFO]  T E S T S
[windows-jdk9] [INFO] -------------------------------------------------------
[windows-jdk9] [INFO] Running org.apache.maven.wagon.providers.webdav.HttpClientWagonTest
[windows-jdk9] [INFO] Tests run: 6, Failures: 0, Errors: 0, Skipped: 0, Time elapsed: 0.877 s - in org.apache.maven.wagon.providers.webdav.HttpClientWagonTest
[windows-jdk9] [INFO] Running org.apache.maven.wagon.providers.webdav.PathNavigatorTest
[windows-jdk9] [INFO] Tests run: 1, Failures: 0, Errors: 0, Skipped: 0, Time elapsed: 0.001 s - in org.apache.maven.wagon.providers.webdav.PathNavigatorTest
[windows-jdk9] [INFO] Running org.apache.maven.wagon.providers.webdav.WebDavsWagonTest
[windows-jdk9] [INFO] Tests run: 69, Failures: 0, Errors: 0, Skipped: 0, Time elapsed: 32.641 s - in org.apache.maven.wagon.providers.webdav.WebDavsWagonTest
[windows-jdk9] [INFO] Running org.apache.maven.wagon.providers.webdav.WebDavWagonTest
[windows-jdk9] [INFO] Tests run: 69, Failures: 0, Errors: 0, Skipped: 0, Time elapsed: 27.358 s - in org.apache.maven.wagon.providers.webdav.WebDavWagonTest
[windows-jdk9] [INFO]
[windows-jdk9] [INFO] Results:
[windows-jdk9] [INFO]
[windows-jdk9] [INFO] Tests run: 145, Failures: 0, Errors: 0, Skipped: 0
[windows-jdk9] [INFO]
[windows-jdk9] [INFO]
[windows-jdk9] [INFO] --- maven-jar-plugin:3.0.2:jar (default-jar) @ wagon-webdav-jackrabbit ---
[windows-jdk9] [INFO] Building jar: F:\jenkins\jenkins-slave\workspace\n-box_maven-wagon_WAGON-526-MVYPB7RAMW5VZ4RA4NSMECE376IR6WO6PB7AIWCZTHT5KJGFZFHQ\m\wagon-providers\wagon-webdav-jackrabbit\target\wagon-webdav-jackrabbit-3.1.1-SNAPSHOT.jar
[windows-jdk9] [INFO]
[windows-jdk9] [INFO] --- maven-site-plugin:3.7:attach-descriptor (attach-descriptor) @ wagon-webdav-jackrabbit ---
[windows-jdk9] [INFO] Skipping because packaging 'jar' is not pom.
[windows-jdk9] [INFO]
[windows-jdk9] [INFO] --- maven-checkstyle-plugin:3.0.0:check (checkstyle-check) @ wagon-webdav-jackrabbit ---
[windows-jdk9] [INFO] ------------------------------------------------------------------------
[windows-jdk9] [INFO] Reactor Summary:
[windows-jdk9] [INFO]
[windows-jdk9] [INFO] Apache Maven Wagon ................................. SUCCESS [ 58.613 s]
[windows-jdk9] [INFO] Apache Maven Wagon :: API .......................... SUCCESS [ 18.594 s]
[windows-jdk9] [INFO] Apache Maven Wagon :: Provider Test ................ SUCCESS [  6.482 s]
[windows-jdk9] [INFO] Apache Maven Wagon :: Providers .................... SUCCESS [  2.039 s]
[windows-jdk9] [INFO] Apache Maven Wagon :: Providers :: File Provider ... SUCCESS [  4.543 s]
[windows-jdk9] [INFO] Apache Maven Wagon :: Providers :: FTP Provider .... SUCCESS [  8.796 s]
[windows-jdk9] [INFO] Apache Maven Wagon :: Providers :: HTTP Shared Library SUCCESS [  5.567 s]
[windows-jdk9] [INFO] Apache Maven Wagon :: Test Compatibility Kits ...... SUCCESS [  1.083 s]
[windows-jdk9] [INFO] Apache Maven Wagon :: HTTP Test Compatibility Kit .. SUCCESS [  3.395 s]
[windows-jdk9] [INFO] Apache Maven Wagon :: Providers :: HTTP Provider ... SUCCESS [05:13 min]
[windows-jdk9] [INFO] Apache Maven Wagon :: Providers :: Lightweight HTTP Provider SUCCESS [02:13 min]
[windows-jdk9] [INFO] Apache Maven Wagon :: Providers :: SCM Provider .... SUCCESS [ 43.178 s]
[windows-jdk9] [INFO] Apache Maven Wagon :: Providers :: SSH Common Library SUCCESS [  5.327 s]
[windows-jdk9] [INFO] Apache Maven Wagon :: Providers :: SSH Common Tests  SUCCESS [  4.276 s]
[windows-jdk9] [INFO] Apache Maven Wagon :: Providers :: SSH External Provider SUCCESS [  2.381 s]
[windows-jdk9] [INFO] Apache Maven Wagon :: Providers :: SSH Provider .... SUCCESS [  5.374 s]
[windows-jdk9] [INFO] Apache Maven Wagon :: Providers :: WebDAV Provider . SUCCESS [01:05 min]
[windows-jdk9] [INFO] ------------------------------------------------------------------------
[windows-jdk9] [INFO] BUILD SUCCESS
[windows-jdk9] [INFO] ------------------------------------------------------------------------
[windows-jdk9] [INFO] Total time: 11:25 min
[windows-jdk9] [INFO] Finished at: 2018-10-10T10:59:13-07:00
[windows-jdk9] [INFO] Final Memory: 45M/152M
[windows-jdk9] [INFO] ------------------------------------------------------------------------
[windows-jdk9] [WARNING] The requested profile "run-its" could not be activated because it does not exist.
[windows-jdk9] [INFO] [jenkins-event-spy] Generated F:\jenkins\jenkins-slave\workspace\n-box_maven-wagon_WAGON-526-MVYPB7RAMW5VZ4RA4NSMECE376IR6WO6PB7AIWCZTHT5KJGFZFHQ@tmp\withMaven31d4ab16\maven-spy-20181010-104747-22713533775314935729540.log
[Pipeline] [windows-jdk9] }
[Pipeline] [windows-jdk9] // dir
[Pipeline] [windows-jdk9] }
[windows-jdk9] [withMaven] junitPublisher - Archive test results for Maven artifact org.apache.maven.wagon:wagon-provider-api:3.1.1-SNAPSHOT generated by maven-surefire-plugin:test (default-test): m\wagon-provider-api\target\surefire-reports\*.xml
[windows-jdk9] Recording test results
[windows-jdk9] [withMaven] junitPublisher - Archive test results for Maven artifact org.apache.maven.wagon:wagon-provider-test:3.1.1-SNAPSHOT generated by maven-surefire-plugin:test (default-test): m\wagon-provider-test\target\surefire-reports\*.xml
[windows-jdk9] Recording test results
[windows-jdk9] None of the test reports contained any result
[windows-jdk9] [withMaven] junitPublisher - Archive test results for Maven artifact org.apache.maven.wagon:wagon-file:3.1.1-SNAPSHOT generated by maven-surefire-plugin:test (default-test): m\wagon-providers\wagon-file\target\surefire-reports\*.xml
[windows-jdk9] Recording test results
[windows-jdk9] [withMaven] junitPublisher - Archive test results for Maven artifact org.apache.maven.wagon:wagon-ftp:3.1.1-SNAPSHOT generated by maven-surefire-plugin:test (default-test): m\wagon-providers\wagon-ftp\target\surefire-reports\*.xml
[windows-jdk9] Recording test results
[windows-jdk9] [withMaven] junitPublisher - Archive test results for Maven artifact org.apache.maven.wagon:wagon-http-shared:3.1.1-SNAPSHOT generated by maven-surefire-plugin:test (default-test): m\wagon-providers\wagon-http-shared\target\surefire-reports\*.xml
[windows-jdk9] Recording test results
[windows-jdk9] [withMaven] junitPublisher - Archive test results for Maven artifact org.apache.maven.wagon:wagon-tck-http:3.1.1-SNAPSHOT generated by maven-surefire-plugin:test (default-test): m\wagon-tcks\wagon-tck-http\target\surefire-reports\*.xml
[windows-jdk9] Recording test results
[windows-jdk9] None of the test reports contained any result
[windows-jdk9] [withMaven] junitPublisher - Archive test results for Maven artifact org.apache.maven.wagon:wagon-http:3.1.1-SNAPSHOT generated by maven-surefire-plugin:test (default-test): m\wagon-providers\wagon-http\target\surefire-reports\*.xml
[windows-jdk9] Recording test results
[windows-jdk9] [withMaven] junitPublisher - Archive test results for Maven artifact org.apache.maven.wagon:wagon-http-lightweight:3.1.1-SNAPSHOT generated by maven-surefire-plugin:test (default-test): m\wagon-providers\wagon-http-lightweight\target\surefire-reports\*.xml
[windows-jdk9] Recording test results
[windows-jdk9] [withMaven] junitPublisher - Archive test results for Maven artifact org.apache.maven.wagon:wagon-scm:3.1.1-SNAPSHOT generated by maven-surefire-plugin:test (default-test): m\wagon-providers\wagon-scm\target\surefire-reports\*.xml
[windows-jdk9] Recording test results
[windows-jdk9] [withMaven] junitPublisher - Archive test results for Maven artifact org.apache.maven.wagon:wagon-ssh-common:3.1.1-SNAPSHOT generated by maven-surefire-plugin:test (default-test): m\wagon-providers\wagon-ssh-common\target\surefire-reports\*.xml
[windows-jdk9] Recording test results
[windows-jdk9] [withMaven] junitPublisher - Archive test results for Maven artifact org.apache.maven.wagon:wagon-ssh-common-test:3.1.1-SNAPSHOT generated by maven-surefire-plugin:test (default-test): m\wagon-providers\wagon-ssh-common-test\target\surefire-reports\*.xml
[windows-jdk9] Recording test results
[windows-jdk9] None of the test reports contained any result
[windows-jdk9] [withMaven] junitPublisher - Archive test results for Maven artifact org.apache.maven.wagon:wagon-ssh-external:3.1.1-SNAPSHOT generated by maven-surefire-plugin:test (default-test): m\wagon-providers\wagon-ssh-external\target\surefire-reports\*.xml
[windows-jdk9] Recording test results
[windows-jdk9] None of the test reports contained any result
[windows-jdk9] [withMaven] junitPublisher - Archive test results for Maven artifact org.apache.maven.wagon:wagon-ssh:3.1.1-SNAPSHOT generated by maven-surefire-plugin:test (default-test): m\wagon-providers\wagon-ssh\target\surefire-reports\*.xml
[windows-jdk9] Recording test results
[windows-jdk9] None of the test reports contained any result
[windows-jdk9] [withMaven] junitPublisher - Archive test results for Maven artifact org.apache.maven.wagon:wagon-webdav-jackrabbit:3.1.1-SNAPSHOT generated by maven-surefire-plugin:test (default-test): m\wagon-providers\wagon-webdav-jackrabbit\target\surefire-reports\*.xml
[windows-jdk9] Recording test results
[Pipeline] [windows-jdk9] // withMaven
[Pipeline] [windows-jdk9] cleanWs
[windows-jdk9] [WS-CLEANUP] Deleting project workspace...[WS-CLEANUP] done
[Pipeline] [windows-jdk9] }
[Pipeline] [windows-jdk9] // stage
[Pipeline] [windows-jdk9] }
[Pipeline] [windows-jdk9] // node
[Pipeline] [windows-jdk9] }
[Pipeline] // parallel
[Pipeline] stage
[Pipeline] { (Notifications)
[Pipeline] echo
Build result: FAILURE
[Pipeline] jiraIssueSelector
[Pipeline] emailext