Build failed in Jenkins: Maven TLP » maven-surefire » milestones-roadmap #1

classic Classic list List threaded Threaded
2 messages Options
Reply | Threaded
Open this post in threaded view
|

Build failed in Jenkins: Maven TLP » maven-surefire » milestones-roadmap #1

Apache Jenkins Server-2
See https://builds.apache.org/job/maven-box/job/maven-surefire/job/milestones-roadmap/1/

No changes.

1 tests failed.
FAILED:  junit.framework.JUnit4TestCaseFacade.forcedShutdown

Error Message:
expected:<2500.0> but was:<3149.0>

Stack Trace:
java.lang.AssertionError: expected:<2500.0> but was:<3149.0>
        at org.junit.Assert.fail(Assert.java:88)
        at org.junit.Assert.failNotEquals(Assert.java:834)
        at org.junit.Assert.assertEquals(Assert.java:575)
        at org.junit.Assert.assertEquals(Assert.java:700)
        at org.apache.maven.surefire.junitcore.pc.ParallelComputerUtilTest.forcedShutdown(ParallelComputerUtilTest.java:1003)
        at java.base/jdk.internal.reflect.NativeMethodAccessorImpl.invoke0(Native Method)
        at java.base/jdk.internal.reflect.NativeMethodAccessorImpl.invoke(NativeMethodAccessorImpl.java:62)
        at java.base/jdk.internal.reflect.DelegatingMethodAccessorImpl.invoke(DelegatingMethodAccessorImpl.java:43)
        at java.base/java.lang.reflect.Method.invoke(Method.java:564)
        at org.junit.runners.model.FrameworkMethod$1.runReflectiveCall(FrameworkMethod.java:50)
        at org.junit.internal.runners.model.ReflectiveCallable.run(ReflectiveCallable.java:12)
        at org.junit.runners.model.FrameworkMethod.invokeExplosively(FrameworkMethod.java:47)
        at org.junit.experimental.theories.Theories$TheoryAnchor$2.evaluate(Theories.java:274)
        at org.junit.internal.runners.statements.RunBefores.evaluate(RunBefores.java:26)
        at org.junit.rules.ExpectedException$ExpectedExceptionStatement.evaluate(ExpectedException.java:239)
        at org.junit.rules.RunRules.evaluate(RunRules.java:20)
        at org.junit.experimental.theories.Theories$TheoryAnchor$1$1.evaluate(Theories.java:232)
        at org.junit.experimental.theories.Theories$TheoryAnchor.runWithCompleteAssignment(Theories.java:218)
        at org.junit.experimental.theories.Theories$TheoryAnchor.runWithAssignment(Theories.java:204)
        at org.junit.experimental.theories.Theories$TheoryAnchor.evaluate(Theories.java:187)
        at org.junit.runners.ParentRunner.runLeaf(ParentRunner.java:325)
        at org.junit.runners.BlockJUnit4ClassRunner.runChild(BlockJUnit4ClassRunner.java:78)
        at org.junit.runners.BlockJUnit4ClassRunner.runChild(BlockJUnit4ClassRunner.java:57)
        at org.junit.runners.ParentRunner$3.run(ParentRunner.java:290)
        at org.junit.runners.ParentRunner$1.schedule(ParentRunner.java:71)
        at org.junit.runners.ParentRunner.runChildren(ParentRunner.java:288)
        at org.junit.runners.ParentRunner.access$000(ParentRunner.java:58)
        at org.junit.runners.ParentRunner$2.evaluate(ParentRunner.java:268)
        at org.junit.internal.runners.statements.RunBefores.evaluate(RunBefores.java:26)
        at org.junit.internal.runners.statements.RunAfters.evaluate(RunAfters.java:27)
        at org.junit.runners.ParentRunner.run(ParentRunner.java:363)
        at junit.framework.JUnit4TestAdapter.run(JUnit4TestAdapter.java:38)
        at junit.framework.TestSuite.runTest(TestSuite.java:252)
        at junit.framework.TestSuite.run(TestSuite.java:247)
        at java.base/jdk.internal.reflect.NativeMethodAccessorImpl.invoke0(Native Method)
        at java.base/jdk.internal.reflect.NativeMethodAccessorImpl.invoke(NativeMethodAccessorImpl.java:62)
        at java.base/jdk.internal.reflect.DelegatingMethodAccessorImpl.invoke(DelegatingMethodAccessorImpl.java:43)
        at java.base/java.lang.reflect.Method.invoke(Method.java:564)
        at org.apache.maven.shadefire.surefire.junit.JUnitTestSet.execute(JUnitTestSet.java:99)
        at org.apache.maven.shadefire.surefire.junit.JUnit3Provider.executeTestSet(JUnit3Provider.java:140)
        at org.apache.maven.shadefire.surefire.junit.JUnit3Provider.invoke(JUnit3Provider.java:113)
        at org.apache.maven.shadefire.surefire.booter.ForkedBooter.invokeProviderInSameClassLoader(ForkedBooter.java:384)
        at org.apache.maven.shadefire.surefire.booter.ForkedBooter.runSuitesInProcess(ForkedBooter.java:345)
        at org.apache.maven.shadefire.surefire.booter.ForkedBooter.execute(ForkedBooter.java:126)
        at org.apache.maven.shadefire.surefire.booter.ForkedBooter.main(ForkedBooter.java:418)




Build log:
[...truncated 31400 lines...]
[2019-11-03T22:25:26.719Z] [INFO] Running org.apache.maven.surefire.its.jiras.Surefire1053SystemPropertiesIT
[2019-11-03T22:25:27.380Z] [INFO] Tests run: 3, Failures: 0, Errors: 0, Skipped: 0, Time elapsed: 19.379 s - in org.apache.maven.surefire.its.jiras.Surefire1534ReuseForksFalseWithJavaModuleIT
[2019-11-03T22:25:27.380Z] [INFO] Running org.apache.maven.surefire.its.jiras.Surefire1535TestNGParallelSuitesIT
[2019-11-03T22:25:32.060Z] [INFO] Tests run: 1, Failures: 0, Errors: 0, Skipped: 0, Time elapsed: 28.659 s - in org.apache.maven.surefire.its.jiras.Surefire1098BalancedRunOrderIT
[2019-11-03T22:25:32.060Z] [INFO] Running org.apache.maven.surefire.its.jiras.Surefire1122ParallelAndFlakyTestsIT
[2019-11-03T22:25:41.740Z] [INFO] Tests run: 2, Failures: 0, Errors: 0, Skipped: 0, Time elapsed: 14.578 s - in org.apache.maven.surefire.its.jiras.Surefire1053SystemPropertiesIT
[2019-11-03T22:25:41.740Z] [INFO] Running org.apache.maven.surefire.its.jiras.Surefire1055CorrectConcurrentTestCountIT
[2019-11-03T22:25:48.413Z] [INFO] Tests run: 1, Failures: 0, Errors: 0, Skipped: 0, Time elapsed: 6.571 s - in org.apache.maven.surefire.its.jiras.Surefire1055CorrectConcurrentTestCountIT
[2019-11-03T22:25:48.413Z] [INFO] Running org.apache.maven.surefire.its.jiras.Surefire1080ParallelForkDoubleTestIT
[2019-11-03T22:25:50.294Z] [INFO] Tests run: 3, Failures: 0, Errors: 0, Skipped: 0, Time elapsed: 18.53 s - in org.apache.maven.surefire.its.jiras.Surefire1122ParallelAndFlakyTestsIT
[2019-11-03T22:25:50.294Z] [INFO] Running org.apache.maven.surefire.its.jiras.Surefire1135ImproveIgnoreMessageForTestNGIT
[2019-11-03T22:25:52.486Z] [INFO] Tests run: 2, Failures: 0, Errors: 0, Skipped: 0, Time elapsed: 22.919 s - in org.apache.maven.surefire.its.jiras.Surefire747MethodParallelWithSuiteCountIT
[2019-11-03T22:25:52.486Z] [INFO] Running org.apache.maven.surefire.its.jiras.Surefire772BothReportsIT
[2019-11-03T22:25:53.786Z] [INFO] Tests run: 1, Failures: 0, Errors: 0, Skipped: 0, Time elapsed: 6.18 s - in org.apache.maven.surefire.its.jiras.Surefire1080ParallelForkDoubleTestIT
[2019-11-03T22:25:53.786Z] [INFO] Running org.apache.maven.surefire.its.jiras.Surefire1082ParallelJUnitParameterizedIT
[2019-11-03T22:25:59.158Z] [INFO] Tests run: 3, Failures: 0, Errors: 0, Skipped: 0, Time elapsed: 9.872 s - in org.apache.maven.surefire.its.jiras.Surefire772BothReportsIT
[2019-11-03T22:25:59.158Z] [INFO] Running org.apache.maven.surefire.its.jiras.Surefire772NoFailsafeReportsIT
[2019-11-03T22:25:59.619Z] [INFO] Tests run: 4, Failures: 0, Errors: 0, Skipped: 0, Time elapsed: 33.852 s - in org.apache.maven.surefire.its.jiras.Surefire1535TestNGParallelSuitesIT
[2019-11-03T22:25:59.620Z] [INFO] Running org.apache.maven.surefire.its.jiras.Surefire1585IT
[2019-11-03T22:26:05.333Z] [INFO] Tests run: 2, Failures: 0, Errors: 0, Skipped: 0, Time elapsed: 15.074 s - in org.apache.maven.surefire.its.jiras.Surefire1135ImproveIgnoreMessageForTestNGIT
[2019-11-03T22:26:05.333Z] [INFO] Running org.apache.maven.surefire.its.jiras.Surefire1136CwdPropagationInForkedModeIT
[2019-11-03T22:26:05.893Z] [INFO] Tests run: 2, Failures: 0, Errors: 0, Skipped: 0, Time elapsed: 41.721 s - in org.apache.maven.surefire.its.jiras.Surefire1490ReportTitleDescriptionIT
[2019-11-03T22:26:05.893Z] [INFO] Running org.apache.maven.surefire.its.jiras.Surefire1534ReuseForksFalseWithJavaModuleIT
[2019-11-03T22:26:05.893Z] [WARNING] Tests run: 3, Failures: 0, Errors: 0, Skipped: 3, Time elapsed: 0.001 s - in org.apache.maven.surefire.its.jiras.Surefire1534ReuseForksFalseWithJavaModuleIT
[2019-11-03T22:26:05.893Z] [INFO] Running org.apache.maven.surefire.its.jiras.Surefire1535TestNGParallelSuitesIT
[2019-11-03T22:26:10.706Z] [INFO] Tests run: 1, Failures: 0, Errors: 0, Skipped: 0, Time elapsed: 6.231 s - in org.apache.maven.surefire.its.jiras.Surefire1136CwdPropagationInForkedModeIT
[2019-11-03T22:26:10.706Z] [INFO] Running org.apache.maven.surefire.its.jiras.Surefire1144XmlRunTimeIT
[2019-11-03T22:26:11.488Z] [INFO] Tests run: 4, Failures: 0, Errors: 0, Skipped: 0, Time elapsed: 12.656 s - in org.apache.maven.surefire.its.jiras.Surefire772NoFailsafeReportsIT
[2019-11-03T22:26:11.489Z] [INFO] Running org.apache.maven.surefire.its.jiras.Surefire772NoSurefireReportsIT
[2019-11-03T22:26:14.624Z] [INFO] Tests run: 2, Failures: 0, Errors: 0, Skipped: 0, Time elapsed: 13.116 s - in org.apache.maven.surefire.its.jiras.Surefire1585IT
[2019-11-03T22:26:14.624Z] [INFO] Running org.apache.maven.surefire.its.jiras.Surefire162CharsetProviderIT
[2019-11-03T22:26:17.388Z] [INFO] Tests run: 1, Failures: 0, Errors: 0, Skipped: 0, Time elapsed: 6.573 s - in org.apache.maven.surefire.its.jiras.Surefire1144XmlRunTimeIT
[2019-11-03T22:26:17.388Z] [INFO] Running org.apache.maven.surefire.its.jiras.Surefire1152RerunFailingTestsInSuiteIT
[2019-11-03T22:26:18.918Z] [INFO] Tests run: 1, Failures: 0, Errors: 0, Skipped: 0, Time elapsed: 6.222 s - in org.apache.maven.surefire.its.jiras.Surefire162CharsetProviderIT
[2019-11-03T22:26:18.919Z] [INFO] Running org.apache.maven.surefire.its.jiras.Surefire224WellFormedXmlFailuresIT
Aborted by tibordigana
[2019-11-03T22:26:19.353Z] Sending interrupt signal to process
[2019-11-03T22:26:20.571Z] [INFO] Tests run: 3, Failures: 0, Errors: 0, Skipped: 0, Time elapsed: 22.854 s - in org.apache.maven.surefire.its.jiras.Surefire1082ParallelJUnitParameterizedIT
[2019-11-03T22:26:20.571Z] [INFO] Running org.apache.maven.surefire.its.jiras.Surefire1098BalancedRunOrderIT
[2019-11-03T22:26:20.916Z] [INFO]
[2019-11-03T22:26:20.916Z] [INFO] Results:
[2019-11-03T22:26:20.916Z] [INFO]
[2019-11-03T22:26:20.916Z] [WARNING] Tests run: 738, Failures: 0, Errors: 0, Skipped: 219
[2019-11-03T22:26:20.916Z] [INFO]
[2019-11-03T22:26:20.916Z] [INFO]
[2019-11-03T22:26:20.916Z] [INFO] --- maven-checkstyle-plugin:3.0.0:check (checkstyle-check) @ surefire-its ---
[2019-11-03T22:26:21.498Z] Sending interrupt signal to process
[2019-11-03T22:26:21.540Z] script returned exit code -1
[2019-11-03T22:26:22.038Z] [INFO]
[2019-11-03T22:26:22.038Z] [INFO] Results:
[2019-11-03T22:26:22.038Z] [INFO]
[2019-11-03T22:26:22.038Z] [WARNING] Tests run: 669, Failures: 0, Errors: 0, Skipped: 137
[2019-11-03T22:26:22.038Z] [INFO]
[2019-11-03T22:26:22.038Z] [INFO]
[2019-11-03T22:26:22.038Z] [INFO] --- maven-checkstyle-plugin:3.0.0:check (checkstyle-check) @ surefire-its ---
[2019-11-03T22:26:22.950Z] Sending interrupt signal to process
[2019-11-03T22:26:23.064Z] script returned exit code -1073741502
[2019-11-03T22:26:24.057Z] [INFO]
[2019-11-03T22:26:24.057Z] [INFO] Results:
[2019-11-03T22:26:24.057Z] [INFO]
[2019-11-03T22:26:24.057Z] [WARNING] Tests run: 677, Failures: 0, Errors: 0, Skipped: 132
[2019-11-03T22:26:24.057Z] [INFO]
[2019-11-03T22:26:24.057Z] [INFO]
[2019-11-03T22:26:24.057Z] [INFO] --- maven-checkstyle-plugin:3.0.0:check (checkstyle-check) @ surefire-its ---
[2019-11-03T22:26:24.371Z] Terminate batch job (Y/N)?
[2019-11-03T22:26:24.392Z] script returned exit code 1
[2019-11-03T22:26:24.428Z] Sending interrupt signal to process
[2019-11-03T22:26:25.646Z] [INFO] Tests run: 1, Failures: 0, Errors: 0, Skipped: 0, Time elapsed: 5.587 s - in org.apache.maven.surefire.its.jiras.Surefire224WellFormedXmlFailuresIT
[2019-11-03T22:26:25.646Z] [INFO] Running org.apache.maven.surefire.its.jiras.Surefire257NotRerunningTestsIT
[2019-11-03T22:26:25.646Z] Terminate batch job (Y/N)?
[2019-11-03T22:26:25.657Z] script returned exit code 1
[2019-11-03T22:26:26.368Z] Sending interrupt signal to process
[2019-11-03T22:26:26.713Z] [INFO] Tests run: 4, Failures: 0, Errors: 0, Skipped: 0, Time elapsed: 12.841 s - in org.apache.maven.surefire.its.jiras.Surefire772NoSurefireReportsIT
[2019-11-03T22:26:26.713Z] [INFO] Running org.apache.maven.surefire.its.jiras.Surefire772SpecifiedReportsIT
[2019-11-03T22:26:27.344Z] [INFO]
[2019-11-03T22:26:27.344Z] [INFO] Results:
[2019-11-03T22:26:27.344Z] [INFO]
[2019-11-03T22:26:27.344Z] [WARNING] Tests run: 795, Failures: 0, Errors: 0, Skipped: 141
[2019-11-03T22:26:27.344Z] [INFO]
[2019-11-03T22:26:27.344Z] [INFO]
[2019-11-03T22:26:27.344Z] [INFO] --- maven-checkstyle-plugin:3.0.0:check (checkstyle-check) @ surefire-its ---
[2019-11-03T22:26:27.643Z] script returned exit code -1073741502
[Pipeline] }
[Pipeline] }
[Pipeline] }
[Pipeline] }
[Pipeline] }
[Pipeline] // withEnv
[Pipeline] // withEnv
[Pipeline] // withEnv
[Pipeline] // withEnv
[Pipeline] // withEnv
[Pipeline] }
[Pipeline] }
[Pipeline] }
[Pipeline] }
[Pipeline] }
[Pipeline] // stage
[Pipeline] // stage
[Pipeline] // stage
[Pipeline] // stage
[Pipeline] // stage
[Pipeline] fileExists
[Pipeline] fileExists
[Pipeline] fileExists
[Pipeline] fileExists
[Pipeline] fileExists
[Pipeline] zip
[Pipeline] zip
[Pipeline] zip
[2019-11-03T22:26:28.366Z] Writing zip file of C:\Users\jenkins\AppData\Local\Temp\2\jenkins-maven-box-maven-surefire-milestones-roadmap-1\maven-failsafe-plugin\target\it to C:\Users\jenkins\AppData\Local\Temp\2\jenkins-maven-box-maven-surefire-milestones-roadmap-1\maven-failsafe-plugin--windows-jdk14-maven3.6.x.zip
[Pipeline] zip
[Pipeline] zip
[2019-11-03T22:26:28.377Z] Writing zip file of C:\Users\jenkins\AppData\Local\Temp\2\jenkins-maven-box-maven-surefire-milestones-roadmap-1\maven-failsafe-plugin\target\it to C:\Users\jenkins\AppData\Local\Temp\2\jenkins-maven-box-maven-surefire-milestones-roadmap-1\maven-failsafe-plugin--windows-jdk11-maven3.6.x.zip
[2019-11-03T22:26:28.385Z] Writing zip file of C:\Users\jenkins\AppData\Local\Temp\3\jenkins-maven-box-maven-surefire-milestones-roadmap-1\maven-failsafe-plugin\target\it to C:\Users\jenkins\AppData\Local\Temp\3\jenkins-maven-box-maven-surefire-milestones-roadmap-1\maven-failsafe-plugin--windows-jdk8-maven3.6.x.zip
[2019-11-03T22:26:28.391Z] Writing zip file of C:\Users\jenkins\AppData\Local\Temp\3\jenkins-maven-box-maven-surefire-milestones-roadmap-1\maven-failsafe-plugin\target\it to C:\Users\jenkins\AppData\Local\Temp\3\jenkins-maven-box-maven-surefire-milestones-roadmap-1\maven-failsafe-plugin--windows-jdk13-maven3.6.x.zip
[2019-11-03T22:26:28.394Z] Writing zip file of C:\Users\jenkins\AppData\Local\Temp\3\jenkins-maven-box-maven-surefire-milestones-roadmap-1@2\maven-failsafe-plugin\target\it to C:\Users\jenkins\AppData\Local\Temp\3\jenkins-maven-box-maven-surefire-milestones-roadmap-1@2\maven-failsafe-plugin--windows-jdk7-maven3.6.x.zip
[2019-11-03T22:26:28.474Z] Zipped 78 entries.
[2019-11-03T22:26:28.474Z] Archiving C:\Users\jenkins\AppData\Local\Temp\2\jenkins-maven-box-maven-surefire-milestones-roadmap-1\maven-failsafe-plugin--windows-jdk11-maven3.6.x.zip
[2019-11-03T22:26:28.474Z] [Fast Archiver] No prior successful build to compare, so performing full copy of artifacts
[2019-11-03T22:26:28.486Z] Zipped 78 entries.
[2019-11-03T22:26:28.486Z] Archiving C:\Users\jenkins\AppData\Local\Temp\2\jenkins-maven-box-maven-surefire-milestones-roadmap-1\maven-failsafe-plugin--windows-jdk14-maven3.6.x.zip
[2019-11-03T22:26:28.486Z] [Fast Archiver] No prior successful build to compare, so performing full copy of artifacts
[Pipeline] fileExists
[2019-11-03T22:26:28.513Z] Zipped 78 entries.
[2019-11-03T22:26:28.514Z] Archiving C:\Users\jenkins\AppData\Local\Temp\3\jenkins-maven-box-maven-surefire-milestones-roadmap-1\maven-failsafe-plugin--windows-jdk8-maven3.6.x.zip
[2019-11-03T22:26:28.514Z] [Fast Archiver] No prior successful build to compare, so performing full copy of artifacts
[2019-11-03T22:26:28.518Z] Zipped 79 entries.
[2019-11-03T22:26:28.518Z] Archiving C:\Users\jenkins\AppData\Local\Temp\3\jenkins-maven-box-maven-surefire-milestones-roadmap-1@2\maven-failsafe-plugin--windows-jdk7-maven3.6.x.zip
[2019-11-03T22:26:28.522Z] Zipped 78 entries.
[2019-11-03T22:26:28.522Z] Archiving C:\Users\jenkins\AppData\Local\Temp\3\jenkins-maven-box-maven-surefire-milestones-roadmap-1\maven-failsafe-plugin--windows-jdk13-maven3.6.x.zip
[2019-11-03T22:26:28.528Z] [Fast Archiver] No prior successful build to compare, so performing full copy of artifacts
[2019-11-03T22:26:28.528Z] [Fast Archiver] No prior successful build to compare, so performing full copy of artifacts
[Pipeline] fileExists
[Pipeline] zip
[2019-11-03T22:26:28.571Z] Writing zip file of C:\Users\jenkins\AppData\Local\Temp\2\jenkins-maven-box-maven-surefire-milestones-roadmap-1\surefire-its\target to C:\Users\jenkins\AppData\Local\Temp\2\jenkins-maven-box-maven-surefire-milestones-roadmap-1\surefire-its--windows-jdk11-maven3.6.x.zip
[Pipeline] zip
[Pipeline] fileExists
[Pipeline] fileExists
[Pipeline] fileExists
[2019-11-03T22:26:28.624Z] Writing zip file of C:\Users\jenkins\AppData\Local\Temp\2\jenkins-maven-box-maven-surefire-milestones-roadmap-1\surefire-its\target to C:\Users\jenkins\AppData\Local\Temp\2\jenkins-maven-box-maven-surefire-milestones-roadmap-1\surefire-its--windows-jdk14-maven3.6.x.zip
[Pipeline] zip
[Pipeline] zip
[Pipeline] zip
[2019-11-03T22:26:28.672Z] Writing zip file of C:\Users\jenkins\AppData\Local\Temp\3\jenkins-maven-box-maven-surefire-milestones-roadmap-1\surefire-its\target to C:\Users\jenkins\AppData\Local\Temp\3\jenkins-maven-box-maven-surefire-milestones-roadmap-1\surefire-its--windows-jdk8-maven3.6.x.zip
[2019-11-03T22:26:28.673Z] Writing zip file of C:\Users\jenkins\AppData\Local\Temp\3\jenkins-maven-box-maven-surefire-milestones-roadmap-1\surefire-its\target to C:\Users\jenkins\AppData\Local\Temp\3\jenkins-maven-box-maven-surefire-milestones-roadmap-1\surefire-its--windows-jdk13-maven3.6.x.zip
[2019-11-03T22:26:28.678Z] Writing zip file of C:\Users\jenkins\AppData\Local\Temp\3\jenkins-maven-box-maven-surefire-milestones-roadmap-1@2\surefire-its\target to C:\Users\jenkins\AppData\Local\Temp\3\jenkins-maven-box-maven-surefire-milestones-roadmap-1@2\surefire-its--windows-jdk7-maven3.6.x.zip
Click here to forcibly terminate running steps
[2019-11-03T22:26:40.897Z] Zipped 13126 entries.
[2019-11-03T22:26:40.897Z] Archiving C:\Users\jenkins\AppData\Local\Temp\3\jenkins-maven-box-maven-surefire-milestones-roadmap-1\surefire-its--windows-jdk8-maven3.6.x.zip
[2019-11-03T22:26:40.897Z] [Fast Archiver] No prior successful build to compare, so performing full copy of artifacts
[2019-11-03T22:26:41.269Z] Zipped 13931 entries.
[2019-11-03T22:26:41.269Z] Archiving C:\Users\jenkins\AppData\Local\Temp\3\jenkins-maven-box-maven-surefire-milestones-roadmap-1@2\surefire-its--windows-jdk7-maven3.6.x.zip
[2019-11-03T22:26:41.270Z] [Fast Archiver] No prior successful build to compare, so performing full copy of artifacts
[Pipeline] archiveArtifacts
[2019-11-03T22:26:42.093Z] Archiving artifacts
[2019-11-03T22:26:42.109Z] [Fast Archiver] No prior successful build to compare, so performing full copy of artifacts
[2019-11-03T22:26:42.288Z] Zipped 15766 entries.
[2019-11-03T22:26:42.289Z] Archiving C:\Users\jenkins\AppData\Local\Temp\2\jenkins-maven-box-maven-surefire-milestones-roadmap-1\surefire-its--windows-jdk14-maven3.6.x.zip
[2019-11-03T22:26:42.289Z] [Fast Archiver] No prior successful build to compare, so performing full copy of artifacts
[2019-11-03T22:26:42.422Z] Zipped 13406 entries.
[2019-11-03T22:26:42.422Z] Archiving C:\Users\jenkins\AppData\Local\Temp\2\jenkins-maven-box-maven-surefire-milestones-roadmap-1\surefire-its--windows-jdk11-maven3.6.x.zip
[2019-11-03T22:26:42.422Z] [Fast Archiver] No prior successful build to compare, so performing full copy of artifacts
[Pipeline] archiveArtifacts
[2019-11-03T22:26:42.841Z] Archiving artifacts
[2019-11-03T22:26:42.851Z] [Fast Archiver] No prior successful build to compare, so performing full copy of artifacts
[Pipeline] archiveArtifacts
[2019-11-03T22:26:43.339Z] Archiving artifacts
[2019-11-03T22:26:43.349Z] [Fast Archiver] No prior successful build to compare, so performing full copy of artifacts
[Pipeline] cleanWs
[2019-11-03T22:26:43.569Z] [WS-CLEANUP] Deleting project workspace...
[2019-11-03T22:26:43.569Z] [WS-CLEANUP] Deferred wipeout is used...
[2019-11-03T22:26:43.660Z] [WS-CLEANUP] done
[Pipeline] }
[Pipeline] // ws
[Pipeline] archiveArtifacts
[Pipeline] }
[2019-11-03T22:26:43.755Z] Archiving artifacts
[2019-11-03T22:26:43.765Z] [Fast Archiver] No prior successful build to compare, so performing full copy of artifacts
[Pipeline] // timestamps
[Pipeline] }
[Pipeline] // node
[Pipeline] }
Failed in branch windows-jdk8-maven3.6.x
[Pipeline] cleanWs
[2019-11-03T22:26:44.337Z] [WS-CLEANUP] Deleting project workspace...
[2019-11-03T22:26:44.337Z] [WS-CLEANUP] Deferred wipeout is used...
[2019-11-03T22:26:44.451Z] [WS-CLEANUP] done
[Pipeline] cleanWs
[2019-11-03T22:26:44.472Z] [WS-CLEANUP] Deleting project workspace...
[2019-11-03T22:26:44.472Z] [WS-CLEANUP] Deferred wipeout is used...
[Pipeline] }
[Pipeline] // ws
[Pipeline] }
[2019-11-03T22:26:44.565Z] [WS-CLEANUP] done
[Pipeline] // timestamps
[Pipeline] }
[Pipeline] }
[Pipeline] // node
[Pipeline] // ws
[Pipeline] }
Failed in branch windows-jdk7-maven3.6.x
[Pipeline] }
[Pipeline] // timestamps
[Pipeline] }
[Pipeline] // node
[Pipeline] }
Failed in branch windows-jdk11-maven3.6.x
[Pipeline] cleanWs
[2019-11-03T22:26:45.289Z] [WS-CLEANUP] Deleting project workspace...
[2019-11-03T22:26:45.289Z] [WS-CLEANUP] Deferred wipeout is used...
[2019-11-03T22:26:45.388Z] [WS-CLEANUP] done
[Pipeline] }
[Pipeline] // ws
[Pipeline] }
[Pipeline] // timestamps
[Pipeline] }
[Pipeline] // node
[Pipeline] }
Failed in branch windows-jdk14-maven3.6.x
[2019-11-03T22:26:46.324Z] Zipped 14986 entries.
[2019-11-03T22:26:46.324Z] Archiving C:\Users\jenkins\AppData\Local\Temp\3\jenkins-maven-box-maven-surefire-milestones-roadmap-1\surefire-its--windows-jdk13-maven3.6.x.zip
[2019-11-03T22:26:46.324Z] [Fast Archiver] No prior successful build to compare, so performing full copy of artifacts
[Pipeline] archiveArtifacts
[2019-11-03T22:26:47.799Z] Archiving artifacts
[2019-11-03T22:26:47.821Z] [Fast Archiver] No prior successful build to compare, so performing full copy of artifacts
[Pipeline] cleanWs
[2019-11-03T22:26:49.247Z] [WS-CLEANUP] Deleting project workspace...
[2019-11-03T22:26:49.247Z] [WS-CLEANUP] Deferred wipeout is used...
[2019-11-03T22:26:49.343Z] [WS-CLEANUP] done
[Pipeline] }
[Pipeline] // ws
[Pipeline] }
[Pipeline] // timestamps
[Pipeline] }
[Pipeline] // node
[Pipeline] }
Failed in branch windows-jdk13-maven3.6.x
[Pipeline] // parallel
[Pipeline] echo
org.jenkinsci.plugins.workflow.steps.FlowInterruptedException: org.jenkinsci.plugins.workflow.steps.FlowInterruptedException
[Pipeline] echo
Build result: FAILURE
[Pipeline] jiraIssueSelector
[Pipeline] echo
The authors of changes [].
[Pipeline] echo
Sending email ...
[Pipeline] emailext
Reply | Threaded
Open this post in threaded view
|

Build succeeded in Jenkins: Maven TLP » maven-surefire » milestones-roadmap #2

Apache Jenkins Server-2