Build failed in Jenkins: Maven TLP » maven-surefire » maven2surefire-jvm-communication #74

classic Classic list List threaded Threaded
1 message Options
Reply | Threaded
Open this post in threaded view
|

Build failed in Jenkins: Maven TLP » maven-surefire » maven2surefire-jvm-communication #74

Apache Jenkins Server-2
See https://builds.apache.org/job/maven-box/job/maven-surefire/job/maven2surefire-jvm-communication/74/

Changes:

* E2E test for TCP

All tests passed

Build log:
[...truncated 17150 lines...]
[2020-03-25T09:45:42.873Z] [INFO] Exclude: **/.github/**
[2020-03-25T09:45:42.873Z] [INFO] Exclude: **/.idea
[2020-03-25T09:45:42.873Z] [INFO] Exclude: **/.svn/**/*
[2020-03-25T09:45:42.873Z] [INFO] Exclude: **/*.iml
[2020-03-25T09:45:42.873Z] [INFO] Exclude: **/*.ipr
[2020-03-25T09:45:42.873Z] [INFO] Exclude: **/*.iws
[2020-03-25T09:45:42.873Z] [INFO] Exclude: **/*.versionsBackup
[2020-03-25T09:45:42.873Z] [INFO] Exclude: **/dependency-reduced-pom.xml
[2020-03-25T09:45:42.873Z] [INFO] Exclude: .repository/**
[2020-03-25T09:45:42.873Z] [INFO] Exclude: src/test/resources/**/*
[2020-03-25T09:45:42.873Z] [INFO] Exclude: src/test/resources/**/*.css
[2020-03-25T09:45:42.873Z] [INFO] Exclude: **/*.jj
[2020-03-25T09:45:42.873Z] [INFO] Exclude: src/main/resources/META-INF/services/org.apache.maven.surefire.providerapi.SurefireProvider
[2020-03-25T09:45:42.873Z] [INFO] Exclude: DEPENDENCIES
[2020-03-25T09:45:42.873Z] [INFO] Exclude: .m2/**
[2020-03-25T09:45:42.873Z] [INFO] Exclude: .m2
[2020-03-25T09:45:42.873Z] [INFO] Exclude: .travis.yml
[2020-03-25T09:45:43.145Z] [INFO] 151 resources included (use -debug for more details)
[2020-03-25T09:45:43.524Z] [INFO] Rat check: Summary over all files. Unapproved: 1, unknown: 1, generated: 0, approved: 150 licenses.
[2020-03-25T09:45:43.524Z] [INFO] ------------------------------------------------------------------------
[2020-03-25T09:45:43.524Z] [INFO] Reactor Summary for Apache Maven Surefire 3.0.0-SNAPSHOT:
[2020-03-25T09:45:43.524Z] [INFO]
[2020-03-25T09:45:43.524Z] [INFO] Apache Maven Surefire .............................. SUCCESS [01:05 min]
[2020-03-25T09:45:43.524Z] [INFO] SureFire Logger API ................................ SUCCESS [ 22.680 s]
[2020-03-25T09:45:43.524Z] [INFO] SureFire API ....................................... SUCCESS [ 20.458 s]
[2020-03-25T09:45:43.524Z] [INFO] Surefire Extensions API ............................ SUCCESS [  6.229 s]
[2020-03-25T09:45:43.524Z] [INFO] Surefire Extensions SPI ............................ SUCCESS [  2.421 s]
[2020-03-25T09:45:43.524Z] [INFO] SureFire Booter .................................... SUCCESS [ 21.923 s]
[2020-03-25T09:45:43.524Z] [INFO] Maven Surefire Test-Grouping Support ............... SUCCESS [  9.521 s]
[2020-03-25T09:45:43.524Z] [INFO] SureFire Providers ................................. SUCCESS [  0.887 s]
[2020-03-25T09:45:43.524Z] [INFO] Shared JUnit3 Provider Code ........................ SUCCESS [  4.530 s]
[2020-03-25T09:45:43.524Z] [INFO] Shared Java 5 Provider Base ........................ SUCCESS [  5.780 s]
[2020-03-25T09:45:43.524Z] [INFO] Shared JUnit4 Provider Code ........................ SUCCESS [  6.386 s]
[2020-03-25T09:45:43.524Z] [INFO] Shared JUnit48 Provider Code ....................... SUCCESS [  7.049 s]
[2020-03-25T09:45:43.524Z] [INFO] SureFire JUnit Runner .............................. SUCCESS [  4.983 s]
[2020-03-25T09:45:43.524Z] [INFO] SureFire JUnit4 Runner ............................. SUCCESS [  4.862 s]
[2020-03-25T09:45:43.524Z] [INFO] Maven Surefire Common .............................. FAILURE [  3.472 s]
[2020-03-25T09:45:43.524Z] [INFO] SureFire JUnitCore Runner .......................... SKIPPED
[2020-03-25T09:45:43.524Z] [INFO] SureFire JUnit Platform Runner ..................... SKIPPED
[2020-03-25T09:45:43.524Z] [INFO] SureFire TestNG Utils .............................. SKIPPED
[2020-03-25T09:45:43.524Z] [INFO] SureFire TestNG Runner ............................. SKIPPED
[2020-03-25T09:45:43.524Z] [INFO] ShadeFire JUnit3 Provider .......................... SKIPPED
[2020-03-25T09:45:43.524Z] [INFO] Surefire Report Parser ............................. SKIPPED
[2020-03-25T09:45:43.524Z] [INFO] Maven Surefire Plugin .............................. SKIPPED
[2020-03-25T09:45:43.524Z] [INFO] Maven Failsafe Plugin .............................. SKIPPED
[2020-03-25T09:45:43.524Z] [INFO] Maven Surefire Report Plugin ....................... SKIPPED
[2020-03-25T09:45:43.524Z] [INFO] Maven Surefire Integration Tests ................... SKIPPED
[2020-03-25T09:45:43.524Z] [INFO] Surefire Shared Utils .............................. SKIPPED
[2020-03-25T09:45:43.524Z] [INFO] ------------------------------------------------------------------------
[2020-03-25T09:45:43.524Z] [INFO] BUILD FAILURE
[2020-03-25T09:45:43.524Z] [INFO] ------------------------------------------------------------------------
[2020-03-25T09:45:43.524Z] [INFO] Total time:  03:12 min
[2020-03-25T09:45:43.524Z] [INFO] Finished at: 2020-03-25T02:45:43-07:00
[2020-03-25T09:45:43.524Z] [INFO] ------------------------------------------------------------------------
[2020-03-25T09:45:43.524Z] [ERROR] Failed to execute goal org.apache.rat:apache-rat-plugin:0.12:check (rat-check) on project maven-surefire-common: Too many files with unapproved license: 1 See RAT report in: C:\Users\jenkins\AppData\Local\Temp\2\jenkins-maven-box-maven-surefire-maven2surefire-jvm-communication-74\maven-surefire-common\target\rat.txt -> [Help 1]
[2020-03-25T09:45:43.524Z] org.apache.maven.lifecycle.LifecycleExecutionException: Failed to execute goal org.apache.rat:apache-rat-plugin:0.12:check (rat-check) on project maven-surefire-common: Too many files with unapproved license: 1 See RAT report in: C:\Users\jenkins\AppData\Local\Temp\2\jenkins-maven-box-maven-surefire-maven2surefire-jvm-communication-74\maven-surefire-common\target\rat.txt
[2020-03-25T09:45:43.524Z]     at org.apache.maven.lifecycle.internal.MojoExecutor.execute (MojoExecutor.java:215)
[2020-03-25T09:45:43.524Z]     at org.apache.maven.lifecycle.internal.MojoExecutor.execute (MojoExecutor.java:156)
[2020-03-25T09:45:43.524Z]     at org.apache.maven.lifecycle.internal.MojoExecutor.execute (MojoExecutor.java:148)
[2020-03-25T09:45:43.524Z]     at org.apache.maven.lifecycle.internal.LifecycleModuleBuilder.buildProject (LifecycleModuleBuilder.java:117)
[2020-03-25T09:45:43.524Z]     at org.apache.maven.lifecycle.internal.LifecycleModuleBuilder.buildProject (LifecycleModuleBuilder.java:81)
[2020-03-25T09:45:43.524Z]     at org.apache.maven.lifecycle.internal.builder.singlethreaded.SingleThreadedBuilder.build (SingleThreadedBuilder.java:56)
[2020-03-25T09:45:43.524Z]     at org.apache.maven.lifecycle.internal.LifecycleStarter.execute (LifecycleStarter.java:128)
[2020-03-25T09:45:43.524Z]     at org.apache.maven.DefaultMaven.doExecute (DefaultMaven.java:305)
[2020-03-25T09:45:43.525Z]     at org.apache.maven.DefaultMaven.doExecute (DefaultMaven.java:192)
[2020-03-25T09:45:43.525Z]     at org.apache.maven.DefaultMaven.execute (DefaultMaven.java:105)
[2020-03-25T09:45:43.525Z]     at org.apache.maven.cli.MavenCli.execute (MavenCli.java:956)
[2020-03-25T09:45:43.525Z]     at org.apache.maven.cli.MavenCli.doMain (MavenCli.java:288)
[2020-03-25T09:45:43.525Z]     at org.apache.maven.cli.MavenCli.main (MavenCli.java:192)
[2020-03-25T09:45:43.525Z]     at sun.reflect.NativeMethodAccessorImpl.invoke0 (Native Method)
[2020-03-25T09:45:43.525Z]     at sun.reflect.NativeMethodAccessorImpl.invoke (NativeMethodAccessorImpl.java:62)
[2020-03-25T09:45:43.525Z]     at sun.reflect.DelegatingMethodAccessorImpl.invoke (DelegatingMethodAccessorImpl.java:43)
[2020-03-25T09:45:43.525Z]     at java.lang.reflect.Method.invoke (Method.java:498)
[2020-03-25T09:45:43.525Z]     at org.codehaus.plexus.classworlds.launcher.Launcher.launchEnhanced (Launcher.java:282)
[2020-03-25T09:45:43.525Z]     at org.codehaus.plexus.classworlds.launcher.Launcher.launch (Launcher.java:225)
[2020-03-25T09:45:43.525Z]     at org.codehaus.plexus.classworlds.launcher.Launcher.mainWithExitCode (Launcher.java:406)
[2020-03-25T09:45:43.525Z]     at org.codehaus.plexus.classworlds.launcher.Launcher.main (Launcher.java:347)
[2020-03-25T09:45:43.525Z] Caused by: org.apache.rat.mp.RatCheckException: Too many files with unapproved license: 1 See RAT report in: C:\Users\jenkins\AppData\Local\Temp\2\jenkins-maven-box-maven-surefire-maven2surefire-jvm-communication-74\maven-surefire-common\target\rat.txt
[2020-03-25T09:45:43.525Z]     at org.apache.rat.mp.RatCheckMojo.check (RatCheckMojo.java:183)
[2020-03-25T09:45:43.525Z]     at org.apache.rat.mp.RatCheckMojo.execute (RatCheckMojo.java:156)
[2020-03-25T09:45:43.525Z]     at org.apache.maven.plugin.DefaultBuildPluginManager.executeMojo (DefaultBuildPluginManager.java:137)
[2020-03-25T09:45:43.525Z]     at org.apache.maven.lifecycle.internal.MojoExecutor.execute (MojoExecutor.java:210)
[2020-03-25T09:45:43.525Z]     at org.apache.maven.lifecycle.internal.MojoExecutor.execute (MojoExecutor.java:156)
[2020-03-25T09:45:43.525Z]     at org.apache.maven.lifecycle.internal.MojoExecutor.execute (MojoExecutor.java:148)
[2020-03-25T09:45:43.525Z]     at org.apache.maven.lifecycle.internal.LifecycleModuleBuilder.buildProject (LifecycleModuleBuilder.java:117)
[2020-03-25T09:45:43.525Z]     at org.apache.maven.lifecycle.internal.LifecycleModuleBuilder.buildProject (LifecycleModuleBuilder.java:81)
[2020-03-25T09:45:43.525Z]     at org.apache.maven.lifecycle.internal.builder.singlethreaded.SingleThreadedBuilder.build (SingleThreadedBuilder.java:56)
[2020-03-25T09:45:43.525Z]     at org.apache.maven.lifecycle.internal.LifecycleStarter.execute (LifecycleStarter.java:128)
[2020-03-25T09:45:43.525Z]     at org.apache.maven.DefaultMaven.doExecute (DefaultMaven.java:305)
[2020-03-25T09:45:43.525Z]     at org.apache.maven.DefaultMaven.doExecute (DefaultMaven.java:192)
[2020-03-25T09:45:43.525Z]     at org.apache.maven.DefaultMaven.execute (DefaultMaven.java:105)
[2020-03-25T09:45:43.525Z]     at org.apache.maven.cli.MavenCli.execute (MavenCli.java:956)
[2020-03-25T09:45:43.525Z]     at org.apache.maven.cli.MavenCli.doMain (MavenCli.java:288)
[2020-03-25T09:45:43.525Z]     at org.apache.maven.cli.MavenCli.main (MavenCli.java:192)
[2020-03-25T09:45:43.525Z]     at sun.reflect.NativeMethodAccessorImpl.invoke0 (Native Method)
[2020-03-25T09:45:43.525Z]     at sun.reflect.NativeMethodAccessorImpl.invoke (NativeMethodAccessorImpl.java:62)
[2020-03-25T09:45:43.525Z]     at sun.reflect.DelegatingMethodAccessorImpl.invoke (DelegatingMethodAccessorImpl.java:43)
[2020-03-25T09:45:43.525Z]     at java.lang.reflect.Method.invoke (Method.java:498)
[2020-03-25T09:45:43.525Z]     at org.codehaus.plexus.classworlds.launcher.Launcher.launchEnhanced (Launcher.java:282)
[2020-03-25T09:45:43.525Z]     at org.codehaus.plexus.classworlds.launcher.Launcher.launch (Launcher.java:225)
[2020-03-25T09:45:43.525Z]     at org.codehaus.plexus.classworlds.launcher.Launcher.mainWithExitCode (Launcher.java:406)
[2020-03-25T09:45:43.525Z]     at org.codehaus.plexus.classworlds.launcher.Launcher.main (Launcher.java:347)
[2020-03-25T09:45:43.525Z] [ERROR]
[2020-03-25T09:45:43.525Z] [ERROR] Re-run Maven using the -X switch to enable full debug logging.
[2020-03-25T09:45:43.525Z] [ERROR]
[2020-03-25T09:45:43.525Z] [ERROR] For more information about the errors and possible solutions, please read the following articles:
[2020-03-25T09:45:43.525Z] [ERROR] [Help 1] http://cwiki.apache.org/confluence/display/MAVEN/MojoFailureException
[2020-03-25T09:45:43.525Z] [ERROR]
[2020-03-25T09:45:43.525Z] [ERROR] After correcting the problems, you can resume the build with the command
[2020-03-25T09:45:43.525Z] [ERROR]   mvn <args> -rf :maven-surefire-common
[Pipeline] }
[Pipeline] // withEnv
[Pipeline] }
[Pipeline] // stage
[Pipeline] fileExists
[Pipeline] fileExists
[2020-03-25T09:45:43.761Z] [INFO] Rat check: Summary over all files. Unapproved: 1, unknown: 1, generated: 0, approved: 150 licenses.
[2020-03-25T09:45:43.761Z] [INFO] ------------------------------------------------------------------------
[2020-03-25T09:45:43.761Z] [INFO] Reactor Summary for Apache Maven Surefire 3.0.0-SNAPSHOT:
[2020-03-25T09:45:43.762Z] [INFO]
[2020-03-25T09:45:43.762Z] [INFO] Apache Maven Surefire .............................. SUCCESS [ 54.109 s]
[2020-03-25T09:45:43.762Z] [INFO] SureFire Logger API ................................ SUCCESS [ 21.398 s]
[2020-03-25T09:45:43.762Z] [INFO] SureFire API ....................................... SUCCESS [ 17.801 s]
[2020-03-25T09:45:43.762Z] [INFO] Surefire Extensions API ............................ SUCCESS [  7.305 s]
[2020-03-25T09:45:43.762Z] [INFO] Surefire Extensions SPI ............................ SUCCESS [  2.254 s]
[2020-03-25T09:45:43.762Z] [INFO] SureFire Booter .................................... SUCCESS [ 20.582 s]
[2020-03-25T09:45:43.762Z] [INFO] Maven Surefire Test-Grouping Support ............... SUCCESS [  9.276 s]
[2020-03-25T09:45:43.762Z] [INFO] SureFire Providers ................................. SUCCESS [  0.857 s]
[2020-03-25T09:45:43.762Z] [INFO] Shared JUnit3 Provider Code ........................ SUCCESS [  4.839 s]
[2020-03-25T09:45:43.762Z] [INFO] Shared Java 5 Provider Base ........................ SUCCESS [  5.472 s]
[2020-03-25T09:45:43.762Z] [INFO] Shared JUnit4 Provider Code ........................ SUCCESS [  6.067 s]
[2020-03-25T09:45:43.762Z] [INFO] Shared JUnit48 Provider Code ....................... SUCCESS [  6.803 s]
[2020-03-25T09:45:43.762Z] [INFO] SureFire JUnit Runner .............................. SUCCESS [  5.186 s]
[2020-03-25T09:45:43.762Z] [INFO] SureFire JUnit4 Runner ............................. SUCCESS [  4.819 s]
[2020-03-25T09:45:43.762Z] [INFO] Maven Surefire Common .............................. FAILURE [  2.598 s]
[2020-03-25T09:45:43.762Z] [INFO] SureFire JUnitCore Runner .......................... SKIPPED
[2020-03-25T09:45:43.762Z] [INFO] SureFire JUnit Platform Runner ..................... SKIPPED
[2020-03-25T09:45:43.762Z] [INFO] SureFire TestNG Utils .............................. SKIPPED
[2020-03-25T09:45:43.762Z] [INFO] SureFire TestNG Runner ............................. SKIPPED
[2020-03-25T09:45:43.762Z] [INFO] ShadeFire JUnit3 Provider .......................... SKIPPED
[2020-03-25T09:45:43.762Z] [INFO] Surefire Report Parser ............................. SKIPPED
[2020-03-25T09:45:43.762Z] [INFO] Maven Surefire Plugin .............................. SKIPPED
[2020-03-25T09:45:43.762Z] [INFO] Maven Failsafe Plugin .............................. SKIPPED
[2020-03-25T09:45:43.762Z] [INFO] Maven Surefire Report Plugin ....................... SKIPPED
[2020-03-25T09:45:43.762Z] [INFO] Maven Surefire Integration Tests ................... SKIPPED
[2020-03-25T09:45:43.762Z] [INFO] Surefire Shared Utils .............................. SKIPPED
[2020-03-25T09:45:43.762Z] [INFO] ------------------------------------------------------------------------
[2020-03-25T09:45:43.762Z] [INFO] BUILD FAILURE
[2020-03-25T09:45:43.762Z] [INFO] ------------------------------------------------------------------------
[2020-03-25T09:45:43.762Z] [INFO] Total time:  02:51 min
[2020-03-25T09:45:43.762Z] [INFO] Finished at: 2020-03-25T02:45:43-07:00
[2020-03-25T09:45:43.762Z] [INFO] ------------------------------------------------------------------------
[2020-03-25T09:45:43.762Z] [ERROR] Failed to execute goal org.apache.rat:apache-rat-plugin:0.12:check (rat-check) on project maven-surefire-common: Too many files with unapproved license: 1 See RAT report in: C:\Users\jenkins\AppData\Local\Temp\2\jenkins-maven-box-maven-surefire-maven2surefire-jvm-communication-74@2\maven-surefire-common\target\rat.txt -> [Help 1]
[2020-03-25T09:45:43.762Z] org.apache.maven.lifecycle.LifecycleExecutionException: Failed to execute goal org.apache.rat:apache-rat-plugin:0.12:check (rat-check) on project maven-surefire-common: Too many files with unapproved license: 1 See RAT report in: C:\Users\jenkins\AppData\Local\Temp\2\jenkins-maven-box-maven-surefire-maven2surefire-jvm-communication-74@2\maven-surefire-common\target\rat.txt
[2020-03-25T09:45:43.762Z]     at org.apache.maven.lifecycle.internal.MojoExecutor.execute (MojoExecutor.java:215)
[2020-03-25T09:45:43.762Z]     at org.apache.maven.lifecycle.internal.MojoExecutor.execute (MojoExecutor.java:156)
[2020-03-25T09:45:43.762Z]     at org.apache.maven.lifecycle.internal.MojoExecutor.execute (MojoExecutor.java:148)
[2020-03-25T09:45:43.762Z]     at org.apache.maven.lifecycle.internal.LifecycleModuleBuilder.buildProject (LifecycleModuleBuilder.java:117)
[2020-03-25T09:45:43.762Z]     at org.apache.maven.lifecycle.internal.LifecycleModuleBuilder.buildProject (LifecycleModuleBuilder.java:81)
[2020-03-25T09:45:43.762Z]     at org.apache.maven.lifecycle.internal.builder.singlethreaded.SingleThreadedBuilder.build (SingleThreadedBuilder.java:56)
[2020-03-25T09:45:43.762Z]     at org.apache.maven.lifecycle.internal.LifecycleStarter.execute (LifecycleStarter.java:128)
[2020-03-25T09:45:43.762Z]     at org.apache.maven.DefaultMaven.doExecute (DefaultMaven.java:305)
[2020-03-25T09:45:43.762Z]     at org.apache.maven.DefaultMaven.doExecute (DefaultMaven.java:192)
[2020-03-25T09:45:43.762Z]     at org.apache.maven.DefaultMaven.execute (DefaultMaven.java:105)
[2020-03-25T09:45:43.762Z]     at org.apache.maven.cli.MavenCli.execute (MavenCli.java:956)
[2020-03-25T09:45:43.762Z]     at org.apache.maven.cli.MavenCli.doMain (MavenCli.java:288)
[2020-03-25T09:45:43.762Z]     at org.apache.maven.cli.MavenCli.main (MavenCli.java:192)
[2020-03-25T09:45:43.762Z]     at sun.reflect.NativeMethodAccessorImpl.invoke0 (Native Method)
[2020-03-25T09:45:43.762Z]     at sun.reflect.NativeMethodAccessorImpl.invoke (NativeMethodAccessorImpl.java:62)
[2020-03-25T09:45:43.762Z]     at sun.reflect.DelegatingMethodAccessorImpl.invoke (DelegatingMethodAccessorImpl.java:43)
[2020-03-25T09:45:43.762Z]     at java.lang.reflect.Method.invoke (Method.java:498)
[2020-03-25T09:45:43.762Z]     at org.codehaus.plexus.classworlds.launcher.Launcher.launchEnhanced (Launcher.java:282)
[2020-03-25T09:45:43.763Z]     at org.codehaus.plexus.classworlds.launcher.Launcher.launch (Launcher.java:225)
[2020-03-25T09:45:43.763Z]     at org.codehaus.plexus.classworlds.launcher.Launcher.mainWithExitCode (Launcher.java:406)
[2020-03-25T09:45:43.763Z]     at org.codehaus.plexus.classworlds.launcher.Launcher.main (Launcher.java:347)
[2020-03-25T09:45:43.763Z] Caused by: org.apache.rat.mp.RatCheckException: Too many files with unapproved license: 1 See RAT report in: C:\Users\jenkins\AppData\Local\Temp\2\jenkins-maven-box-maven-surefire-maven2surefire-jvm-communication-74@2\maven-surefire-common\target\rat.txt
[2020-03-25T09:45:43.763Z]     at org.apache.rat.mp.RatCheckMojo.check (RatCheckMojo.java:183)
[2020-03-25T09:45:43.763Z]     at org.apache.rat.mp.RatCheckMojo.execute (RatCheckMojo.java:156)
[2020-03-25T09:45:43.763Z]     at org.apache.maven.plugin.DefaultBuildPluginManager.executeMojo (DefaultBuildPluginManager.java:137)
[2020-03-25T09:45:43.763Z]     at org.apache.maven.lifecycle.internal.MojoExecutor.execute (MojoExecutor.java:210)
[2020-03-25T09:45:43.763Z]     at org.apache.maven.lifecycle.internal.MojoExecutor.execute (MojoExecutor.java:156)
[2020-03-25T09:45:43.763Z]     at org.apache.maven.lifecycle.internal.MojoExecutor.execute (MojoExecutor.java:148)
[2020-03-25T09:45:43.763Z]     at org.apache.maven.lifecycle.internal.LifecycleModuleBuilder.buildProject (LifecycleModuleBuilder.java:117)
[2020-03-25T09:45:43.763Z]     at org.apache.maven.lifecycle.internal.LifecycleModuleBuilder.buildProject (LifecycleModuleBuilder.java:81)
[2020-03-25T09:45:43.763Z]     at org.apache.maven.lifecycle.internal.builder.singlethreaded.SingleThreadedBuilder.build (SingleThreadedBuilder.java:56)
[2020-03-25T09:45:43.763Z]     at org.apache.maven.lifecycle.internal.LifecycleStarter.execute (LifecycleStarter.java:128)
[2020-03-25T09:45:43.763Z]     at org.apache.maven.DefaultMaven.doExecute (DefaultMaven.java:305)
[2020-03-25T09:45:43.763Z]     at org.apache.maven.DefaultMaven.doExecute (DefaultMaven.java:192)
[2020-03-25T09:45:43.763Z]     at org.apache.maven.DefaultMaven.execute (DefaultMaven.java:105)
[2020-03-25T09:45:43.763Z]     at org.apache.maven.cli.MavenCli.execute (MavenCli.java:956)
[2020-03-25T09:45:43.763Z]     at org.apache.maven.cli.MavenCli.doMain (MavenCli.java:288)
[2020-03-25T09:45:43.763Z]     at org.apache.maven.cli.MavenCli.main (MavenCli.java:192)
[2020-03-25T09:45:43.763Z]     at sun.reflect.NativeMethodAccessorImpl.invoke0 (Native Method)
[2020-03-25T09:45:43.763Z]     at sun.reflect.NativeMethodAccessorImpl.invoke (NativeMethodAccessorImpl.java:62)
[2020-03-25T09:45:43.763Z]     at sun.reflect.DelegatingMethodAccessorImpl.invoke (DelegatingMethodAccessorImpl.java:43)
[2020-03-25T09:45:43.763Z]     at java.lang.reflect.Method.invoke (Method.java:498)
[2020-03-25T09:45:43.763Z]     at org.codehaus.plexus.classworlds.launcher.Launcher.launchEnhanced (Launcher.java:282)
[2020-03-25T09:45:43.763Z]     at org.codehaus.plexus.classworlds.launcher.Launcher.launch (Launcher.java:225)
[2020-03-25T09:45:43.763Z]     at org.codehaus.plexus.classworlds.launcher.Launcher.mainWithExitCode (Launcher.java:406)
[2020-03-25T09:45:43.763Z]     at org.codehaus.plexus.classworlds.launcher.Launcher.main (Launcher.java:347)
[2020-03-25T09:45:43.763Z] [ERROR]
[2020-03-25T09:45:43.763Z] [ERROR] Re-run Maven using the -X switch to enable full debug logging.
[2020-03-25T09:45:43.763Z] [ERROR]
[2020-03-25T09:45:43.763Z] [ERROR] For more information about the errors and possible solutions, please read the following articles:
[2020-03-25T09:45:43.763Z] [ERROR] [Help 1] http://cwiki.apache.org/confluence/display/MAVEN/MojoFailureException
[2020-03-25T09:45:43.763Z] [ERROR]
[2020-03-25T09:45:43.763Z] [ERROR] After correcting the problems, you can resume the build with the command
[2020-03-25T09:45:43.763Z] [ERROR]   mvn <args> -rf :maven-surefire-common
[Pipeline] archiveArtifacts
[2020-03-25T09:45:43.780Z] Archiving artifacts
[Pipeline] cleanWs
[2020-03-25T09:45:43.846Z] [WS-CLEANUP] Deleting project workspace...
[2020-03-25T09:45:43.846Z] [WS-CLEANUP] Deferred wipeout is used...
[2020-03-25T09:45:43.887Z] [WS-CLEANUP] done
[Pipeline] }
[Pipeline] // ws
[Pipeline] }
[Pipeline] // timestamps
[Pipeline] }
[Pipeline] // node
[Pipeline] }
[Pipeline] }
[Pipeline] // withEnv
[Pipeline] }
[Pipeline] // stage
[Pipeline] fileExists
[Pipeline] fileExists
[Pipeline] archiveArtifacts
[2020-03-25T09:45:44.538Z] Archiving artifacts
[Pipeline] cleanWs
[2020-03-25T09:45:47.068Z] [WS-CLEANUP] Deleting project workspace...
[2020-03-25T09:45:47.068Z] [WS-CLEANUP] Deferred wipeout is used...
[2020-03-25T09:45:47.136Z] [WS-CLEANUP] done
[Pipeline] }
[Pipeline] // ws
[Pipeline] }
[Pipeline] // timestamps
[Pipeline] }
[Pipeline] // node
[Pipeline] }
[Pipeline] // parallel
[Pipeline] echo
Build result: FAILURE
[Pipeline] jiraIssueSelector
[Pipeline] echo
The authors of changes [tibordigana].
[Pipeline] echo
Sending email ...
[Pipeline] emailext