Build failed in Jenkins: Maven TLP » maven-surefire » maven2surefire-jvm-communication #5

classic Classic list List threaded Threaded
7 messages Options
Reply | Threaded
Open this post in threaded view
|

Build failed in Jenkins: Maven TLP » maven-surefire » maven2surefire-jvm-communication #5

Apache Jenkins Server-2
See https://builds.apache.org/job/maven-box/job/maven-surefire/job/maven2surefire-jvm-communication/5/

Changes:

* exclude nodes with MAVEN_OPTS issues
* exclude more nodes with MAVEN_OPTS issues
* exclude more nodes with MAVEN_OPTS issues
* stop avoiding nodes with MAVEN_OPTS issue
* [INFRA-18734] Jenkins builds fail on email notifications due to unknown
* Scripts not permitted to use staticMethod
* excluded message body from the log message
* NotSerializableException: hudson.plugins.git.GitChangeSetList
* investigating permissions to the call 'ChangeSetList.author'
* NotSerializableException: hudson.plugins.git.GitChangeSetList
* [INFRA-18734] Jenkins builds fail on email notifications due to unknown
* Prevent Caused: java.io.NotSerializableException: hudson.model.User
* added archives
* added archives fix
* print disk space usage
* sh 'df -hT'
* [INFRA-18734] Jenkins builds fail on email notifications due to unknown
* last() cannot be called on []
* [improvement] currentBuild.changeSets can be referenced as changes
* moved the fix of INFRA-18734 to jenkinsNotify
* ${env.EXECUTOR_NUMBER} returns null
* inline env.BRANCH_NAME directly in IF statement
* used env.EXECUTOR_NUMBER
* moved "def localRepo ..." to the stage execution block

All tests passed

Build log:
[...truncated 60883 lines...]
[2019-08-24T14:18:32.261Z] [INFO] Tests run: 4, Failures: 0, Errors: 0, Skipped: 0, Time elapsed: 12.793 s - in org.apache.maven.surefire.its.jiras.Surefire772NoFailsafeReportsIT
[2019-08-24T14:18:32.261Z] [INFO] Running org.apache.maven.surefire.its.jiras.Surefire772NoSurefireReportsIT
[2019-08-24T14:18:35.594Z] [INFO] Tests run: 4, Failures: 0, Errors: 0, Skipped: 0, Time elapsed: 23.118 s - in org.apache.maven.surefire.its.jiras.Surefire828EmptyGroupExprIT
[2019-08-24T14:18:35.594Z] [INFO] Running org.apache.maven.surefire.its.jiras.Surefire832ProviderSelectionIT
[2019-08-24T14:18:38.789Z] [INFO] Tests run: 1, Failures: 0, Errors: 0, Skipped: 0, Time elapsed: 5.909 s - in org.apache.maven.surefire.its.jiras.Surefire832ProviderSelectionIT
[2019-08-24T14:18:38.789Z] [INFO] Running org.apache.maven.surefire.its.jiras.Surefire839TestWithoutCategoriesIT
[2019-08-24T14:18:45.451Z] [INFO] Tests run: 4, Failures: 0, Errors: 0, Skipped: 0, Time elapsed: 12.697 s - in org.apache.maven.surefire.its.jiras.Surefire772NoSurefireReportsIT
[2019-08-24T14:18:45.452Z] [INFO] Running org.apache.maven.surefire.its.jiras.Surefire772SpecifiedReportsIT
[2019-08-24T14:18:51.909Z] [INFO] Tests run: 2, Failures: 0, Errors: 0, Skipped: 0, Time elapsed: 11.855 s - in org.apache.maven.surefire.its.jiras.Surefire839TestWithoutCategoriesIT
[2019-08-24T14:18:51.909Z] [INFO] Running org.apache.maven.surefire.its.jiras.Surefire847AdditionalFailureIT
[2019-08-24T14:18:56.770Z] [INFO] Tests run: 3, Failures: 0, Errors: 0, Skipped: 0, Time elapsed: 11.147 s - in org.apache.maven.surefire.its.jiras.Surefire772SpecifiedReportsIT
[2019-08-24T14:18:56.770Z] [INFO] Running org.apache.maven.surefire.its.jiras.Surefire801ForkModeNoneClassLoaderIT
[2019-08-24T14:18:57.178Z] [INFO] Tests run: 1, Failures: 0, Errors: 0, Skipped: 0, Time elapsed: 6.231 s - in org.apache.maven.surefire.its.jiras.Surefire847AdditionalFailureIT
[2019-08-24T14:18:57.178Z] [INFO] Running org.apache.maven.surefire.its.jiras.Surefire855AllowFailsafeUseArtifactFileIT
[2019-08-24T14:18:59.962Z] [INFO] Tests run: 1, Failures: 0, Errors: 0, Skipped: 0, Time elapsed: 4.049 s - in org.apache.maven.surefire.its.jiras.Surefire801ForkModeNoneClassLoaderIT
[2019-08-24T14:18:59.962Z] [INFO] Running org.apache.maven.surefire.its.jiras.Surefire803MultiFailsafeExecsIT
[2019-08-24T14:19:18.996Z] [INFO] Tests run: 2, Failures: 0, Errors: 0, Skipped: 0, Time elapsed: 17.752 s - in org.apache.maven.surefire.its.jiras.Surefire803MultiFailsafeExecsIT
[2019-08-24T14:19:18.996Z] [INFO] Running org.apache.maven.surefire.its.jiras.Surefire806SpecifiedTestControlsIT
[2019-08-24T14:19:21.353Z] [WARNING] Tests run: 3, Failures: 0, Errors: 0, Skipped: 2, Time elapsed: 4.491 s - in org.apache.maven.surefire.its.jiras.Surefire806SpecifiedTestControlsIT
[2019-08-24T14:19:21.353Z] [INFO] Running org.apache.maven.surefire.its.jiras.Surefire809GroupExpressionsIT
[2019-08-24T14:19:38.020Z] [INFO] Tests run: 4, Failures: 0, Errors: 0, Skipped: 0, Time elapsed: 40.964 s - in org.apache.maven.surefire.its.jiras.Surefire855AllowFailsafeUseArtifactFileIT
[2019-08-24T14:19:38.020Z] [INFO] Running org.apache.maven.surefire.its.jiras.Surefire901MIssingResultfileWhenNoTestsIT
[2019-08-24T14:19:41.610Z] [INFO] Tests run: 1, Failures: 0, Errors: 0, Skipped: 0, Time elapsed: 4.165 s - in org.apache.maven.surefire.its.jiras.Surefire901MIssingResultfileWhenNoTestsIT
[2019-08-24T14:19:41.610Z] [INFO] Running org.apache.maven.surefire.its.jiras.Surefire907PerThreadWithoutThreadCountIT
[2019-08-24T14:19:45.882Z] [INFO] Tests run: 1, Failures: 0, Errors: 0, Skipped: 0, Time elapsed: 3.692 s - in org.apache.maven.surefire.its.jiras.Surefire907PerThreadWithoutThreadCountIT
[2019-08-24T14:19:45.882Z] [INFO] Running org.apache.maven.surefire.its.jiras.Surefire920TestFailureIgnoreWithTimeoutIT
[2019-08-24T14:19:54.533Z] [INFO] Tests run: 6, Failures: 0, Errors: 0, Skipped: 0, Time elapsed: 30.468 s - in org.apache.maven.surefire.its.jiras.Surefire809GroupExpressionsIT
[2019-08-24T14:19:54.533Z] [INFO] Running org.apache.maven.surefire.its.jiras.Surefire812Log4JClassLoaderIT
[2019-08-24T14:19:57.815Z] [INFO] Tests run: 1, Failures: 0, Errors: 0, Skipped: 0, Time elapsed: 5.359 s - in org.apache.maven.surefire.its.jiras.Surefire812Log4JClassLoaderIT
[2019-08-24T14:19:57.815Z] [INFO] Running org.apache.maven.surefire.its.jiras.Surefire817SystemExitIT
[2019-08-24T14:19:59.240Z] [INFO] Tests run: 2, Failures: 0, Errors: 0, Skipped: 0, Time elapsed: 13.39 s - in org.apache.maven.surefire.its.jiras.Surefire920TestFailureIgnoreWithTimeoutIT
[2019-08-24T14:19:59.240Z] [INFO] Running org.apache.maven.surefire.its.jiras.Surefire926FailureWith2ProvidersIT
[2019-08-24T14:20:03.158Z] [INFO] Tests run: 1, Failures: 0, Errors: 0, Skipped: 0, Time elapsed: 4.971 s - in org.apache.maven.surefire.its.jiras.Surefire817SystemExitIT
[2019-08-24T14:20:03.158Z] [INFO] Running org.apache.maven.surefire.its.jiras.Surefire818NpeIgnoresTestsIT
[2019-08-24T14:20:03.458Z] [INFO] Tests run: 1, Failures: 0, Errors: 0, Skipped: 0, Time elapsed: 3.932 s - in org.apache.maven.surefire.its.jiras.Surefire926FailureWith2ProvidersIT
[2019-08-24T14:20:03.458Z] [INFO] Running org.apache.maven.surefire.its.jiras.Surefire930TestNgSuiteXmlIT
[2019-08-24T14:20:08.522Z] [INFO] Tests run: 1, Failures: 0, Errors: 0, Skipped: 0, Time elapsed: 5.299 s - in org.apache.maven.surefire.its.jiras.Surefire818NpeIgnoresTestsIT
[2019-08-24T14:20:08.522Z] [INFO] Running org.apache.maven.surefire.its.jiras.Surefire828EmptyGroupExprIT
[2019-08-24T14:20:08.879Z] [INFO] Tests run: 1, Failures: 0, Errors: 0, Skipped: 0, Time elapsed: 6.064 s - in org.apache.maven.surefire.its.jiras.Surefire930TestNgSuiteXmlIT
[2019-08-24T14:20:08.879Z] [INFO] Running org.apache.maven.surefire.its.jiras.Surefire943ReportContentIT
[2019-08-24T14:20:26.974Z] [INFO] Tests run: 4, Failures: 0, Errors: 0, Skipped: 0, Time elapsed: 18.649 s - in org.apache.maven.surefire.its.jiras.Surefire828EmptyGroupExprIT
[2019-08-24T14:20:26.974Z] [INFO] Running org.apache.maven.surefire.its.jiras.Surefire832ProviderSelectionIT
[2019-08-24T14:20:32.240Z] [INFO] Tests run: 1, Failures: 0, Errors: 0, Skipped: 0, Time elapsed: 5.283 s - in org.apache.maven.surefire.its.jiras.Surefire832ProviderSelectionIT
[2019-08-24T14:20:32.240Z] [INFO] Running org.apache.maven.surefire.its.jiras.Surefire839TestWithoutCategoriesIT
[2019-08-24T14:20:34.269Z] [INFO] Tests run: 2, Failures: 0, Errors: 0, Skipped: 0, Time elapsed: 25.077 s - in org.apache.maven.surefire.its.jiras.Surefire943ReportContentIT
[2019-08-24T14:20:34.269Z] [INFO] Running org.apache.maven.surefire.its.jiras.Surefire946KillMainProcessInReusableForkIT
[2019-08-24T14:20:43.358Z] [INFO] Tests run: 2, Failures: 0, Errors: 0, Skipped: 0, Time elapsed: 10.775 s - in org.apache.maven.surefire.its.jiras.Surefire839TestWithoutCategoriesIT
[2019-08-24T14:20:43.358Z] [INFO] Running org.apache.maven.surefire.its.jiras.Surefire847AdditionalFailureIT
[2019-08-24T14:20:48.619Z] [INFO] Tests run: 1, Failures: 0, Errors: 0, Skipped: 0, Time elapsed: 6.355 s - in org.apache.maven.surefire.its.jiras.Surefire847AdditionalFailureIT
[2019-08-24T14:20:48.619Z] [INFO] Running org.apache.maven.surefire.its.jiras.Surefire855AllowFailsafeUseArtifactFileIT
[2019-08-24T14:21:24.876Z] [INFO] Tests run: 6, Failures: 0, Errors: 0, Skipped: 0, Time elapsed: 43.5 s - in org.apache.maven.surefire.its.jiras.Surefire946KillMainProcessInReusableForkIT
[2019-08-24T14:21:24.876Z] [INFO] Running org.apache.maven.surefire.its.jiras.Surefire972BizarreNoClassDefIT
[2019-08-24T14:21:24.876Z] [INFO] Tests run: 1, Failures: 0, Errors: 0, Skipped: 0, Time elapsed: 7.481 s - in org.apache.maven.surefire.its.jiras.Surefire972BizarreNoClassDefIT
[2019-08-24T14:21:24.876Z] [INFO] Running org.apache.maven.surefire.its.jiras.Surefire975DefaultVMEncodingIT
[2019-08-24T14:21:31.348Z] [INFO] Tests run: 1, Failures: 0, Errors: 0, Skipped: 0, Time elapsed: 5.593 s - in org.apache.maven.surefire.its.jiras.Surefire975DefaultVMEncodingIT
[2019-08-24T14:21:31.348Z] [INFO] Running org.apache.maven.surefire.its.jiras.Surefire979WrongClassLoaderIT
[2019-08-24T14:21:35.829Z] [INFO] Tests run: 1, Failures: 0, Errors: 0, Skipped: 0, Time elapsed: 5.44 s - in org.apache.maven.surefire.its.jiras.Surefire979WrongClassLoaderIT
[2019-08-24T14:21:35.829Z] [INFO] Running org.apache.maven.surefire.its.jiras.Surefire985ParameterizedRunnerAndCategoriesIT
[2019-08-24T14:21:37.954Z] [INFO] Tests run: 4, Failures: 0, Errors: 0, Skipped: 0, Time elapsed: 46.454 s - in org.apache.maven.surefire.its.jiras.Surefire855AllowFailsafeUseArtifactFileIT
[2019-08-24T14:21:37.954Z] [INFO] Running org.apache.maven.surefire.its.jiras.Surefire901MIssingResultfileWhenNoTestsIT
[2019-08-24T14:21:39.432Z] [INFO] Tests run: 1, Failures: 0, Errors: 0, Skipped: 0, Time elapsed: 4.045 s - in org.apache.maven.surefire.its.jiras.Surefire901MIssingResultfileWhenNoTestsIT
[2019-08-24T14:21:39.432Z] [INFO] Running org.apache.maven.surefire.its.jiras.Surefire907PerThreadWithoutThreadCountIT
[2019-08-24T14:21:41.097Z] [INFO] Tests run: 1, Failures: 0, Errors: 0, Skipped: 0, Time elapsed: 5.089 s - in org.apache.maven.surefire.its.jiras.Surefire985ParameterizedRunnerAndCategoriesIT
[2019-08-24T14:21:41.097Z] [INFO] Running org.apache.maven.surefire.its.jiras.Surefire995CategoryInheritanceIT
[2019-08-24T14:21:42.626Z] [INFO] Tests run: 1, Failures: 0, Errors: 0, Skipped: 0, Time elapsed: 3.529 s - in org.apache.maven.surefire.its.jiras.Surefire907PerThreadWithoutThreadCountIT
[2019-08-24T14:21:42.626Z] [INFO] Running org.apache.maven.surefire.its.jiras.Surefire920TestFailureIgnoreWithTimeoutIT
[2019-08-24T14:21:55.903Z] [INFO] Tests run: 2, Failures: 0, Errors: 0, Skipped: 0, Time elapsed: 12.083 s - in org.apache.maven.surefire.its.jiras.Surefire920TestFailureIgnoreWithTimeoutIT
[2019-08-24T14:21:55.903Z] [INFO] Running org.apache.maven.surefire.its.jiras.Surefire926FailureWith2ProvidersIT
[2019-08-24T14:22:02.369Z] [INFO] Tests run: 1, Failures: 0, Errors: 0, Skipped: 0, Time elapsed: 7.531 s - in org.apache.maven.surefire.its.jiras.Surefire926FailureWith2ProvidersIT
[2019-08-24T14:22:02.369Z] [INFO] Running org.apache.maven.surefire.its.jiras.Surefire930TestNgSuiteXmlIT
[2019-08-24T14:22:06.020Z] [INFO] Tests run: 5, Failures: 0, Errors: 0, Skipped: 0, Time elapsed: 23.759 s - in org.apache.maven.surefire.its.jiras.Surefire995CategoryInheritanceIT
[2019-08-24T14:22:06.020Z] [INFO]
[2019-08-24T14:22:06.020Z] [INFO] Results:
[2019-08-24T14:22:06.020Z] [INFO]
[2019-08-24T14:22:06.020Z] [WARNING] Tests run: 846, Failures: 0, Errors: 0, Skipped: 134
[2019-08-24T14:22:06.020Z] [INFO]
[2019-08-24T14:22:06.020Z] [INFO]
[2019-08-24T14:22:06.020Z] [INFO] --- maven-checkstyle-plugin:3.0.0:check (checkstyle-check) @ surefire-its ---
[2019-08-24T14:22:06.020Z] [INFO]
[2019-08-24T14:22:06.020Z] [INFO] --- maven-failsafe-plugin:3.0.0-M3:verify (default) @ surefire-its ---
[2019-08-24T14:22:06.020Z] [INFO] Failsafe report directory: /home/jenkins/jenkins-slave/workspace/maven2surefire-jvm-communication@2/surefire-its/target/failsafe-reports
[2019-08-24T14:22:06.020Z] [INFO]
[2019-08-24T14:22:06.020Z] [INFO] --- maven-install-plugin:2.5.2:install (default-install) @ surefire-its ---
[2019-08-24T14:22:06.020Z] [INFO] Skipping artifact installation
[2019-08-24T14:22:06.020Z] [INFO] ------------------------------------------------------------------------
[2019-08-24T14:22:06.020Z] [INFO] Reactor Summary for Apache Maven Surefire 3.0.0-SNAPSHOT:
[2019-08-24T14:22:06.020Z] [INFO]
[2019-08-24T14:22:06.020Z] [INFO] Apache Maven Surefire .............................. SUCCESS [ 19.008 s]
[2019-08-24T14:22:06.020Z] [INFO] SureFire Logger API ................................ SUCCESS [ 10.070 s]
[2019-08-24T14:22:06.020Z] [INFO] SureFire API ....................................... SUCCESS [ 12.384 s]
[2019-08-24T14:22:06.020Z] [INFO] Surefire Extensions API ............................ SUCCESS [  2.064 s]
[2019-08-24T14:22:06.020Z] [INFO] Surefire Extensions SPI ............................ SUCCESS [  1.898 s]
[2019-08-24T14:22:06.021Z] [INFO] SureFire Booter .................................... SUCCESS [ 14.581 s]
[2019-08-24T14:22:06.021Z] [INFO] Maven Surefire Test-Grouping Support ............... SUCCESS [  5.362 s]
[2019-08-24T14:22:06.021Z] [INFO] SureFire Providers ................................. SUCCESS [  0.908 s]
[2019-08-24T14:22:06.021Z] [INFO] Shared JUnit3 Provider Code ........................ SUCCESS [  3.432 s]
[2019-08-24T14:22:06.021Z] [INFO] Shared Java 5 Provider Base ........................ SUCCESS [  4.575 s]
[2019-08-24T14:22:06.021Z] [INFO] Shared JUnit4 Provider Code ........................ SUCCESS [  4.117 s]
[2019-08-24T14:22:06.021Z] [INFO] Shared JUnit48 Provider Code ....................... SUCCESS [  5.171 s]
[2019-08-24T14:22:06.021Z] [INFO] SureFire JUnit Runner .............................. SUCCESS [  4.069 s]
[2019-08-24T14:22:06.021Z] [INFO] SureFire JUnit4 Runner ............................. SUCCESS [  3.842 s]
[2019-08-24T14:22:06.021Z] [INFO] Maven Surefire Common .............................. SUCCESS [ 40.238 s]
[2019-08-24T14:22:06.021Z] [INFO] SureFire JUnitCore Runner .......................... SUCCESS [02:13 min]
[2019-08-24T14:22:06.021Z] [INFO] SureFire JUnit Platform Runner ..................... SUCCESS [  9.022 s]
[2019-08-24T14:22:06.021Z] [INFO] SureFire TestNG Utils .............................. SUCCESS [  4.030 s]
[2019-08-24T14:22:06.021Z] [INFO] SureFire TestNG Runner ............................. SUCCESS [  4.579 s]
[2019-08-24T14:22:06.021Z] [INFO] ShadeFire JUnit3 Provider .......................... SUCCESS [  1.550 s]
[2019-08-24T14:22:06.021Z] [INFO] Surefire Report Parser ............................. SUCCESS [  5.560 s]
[2019-08-24T14:22:06.021Z] [INFO] Maven Surefire Plugin .............................. SUCCESS [  9.230 s]
[2019-08-24T14:22:06.021Z] [INFO] Maven Failsafe Plugin .............................. SUCCESS [01:02 min]
[2019-08-24T14:22:06.021Z] [INFO] Maven Surefire Report Plugin ....................... SUCCESS [ 14.708 s]
[2019-08-24T14:22:06.021Z] [INFO] Maven Surefire Integration Tests ................... SUCCESS [  01:03 h]
[2019-08-24T14:22:06.021Z] [INFO] ------------------------------------------------------------------------
[2019-08-24T14:22:06.021Z] [INFO] BUILD SUCCESS
[2019-08-24T14:22:06.021Z] [INFO] ------------------------------------------------------------------------
[2019-08-24T14:22:06.021Z] [INFO] Total time:  01:09 h
[2019-08-24T14:22:06.021Z] [INFO] Finished at: 2019-08-24T14:22:05Z
[2019-08-24T14:22:06.021Z] [INFO] ------------------------------------------------------------------------
[Pipeline] }
[Pipeline] // withEnv
[Pipeline] }
[Pipeline] // stage
[Pipeline] fileExists
[Pipeline] zip
[2019-08-24T14:22:07.089Z] Writing zip file of /home/jenkins/jenkins-slave/workspace/maven2surefire-jvm-communication@2/maven-failsafe-plugin/target/it to /home/jenkins/jenkins-slave/workspace/maven2surefire-jvm-communication@2/maven-failsafe-plugin--linux-jdk11-maven3.6.x.zip
[2019-08-24T14:22:07.336Z] Zipped 78 entries.
[2019-08-24T14:22:07.337Z] Archiving /home/jenkins/jenkins-slave/workspace/maven2surefire-jvm-communication@2/maven-failsafe-plugin--linux-jdk11-maven3.6.x.zip
[2019-08-24T14:22:07.338Z] [Fast Archiver] No artifacts from Maven TLP » maven-surefire » maven2surefire-jvm-communication #4 to compare, so performing full copy of artifacts
[Pipeline] fileExists
[Pipeline] zip
[2019-08-24T14:22:08.457Z] Writing zip file of /home/jenkins/jenkins-slave/workspace/maven2surefire-jvm-communication@2/surefire-its/target to /home/jenkins/jenkins-slave/workspace/maven2surefire-jvm-communication@2/surefire-its--linux-jdk11-maven3.6.x.zip
[2019-08-24T14:22:08.837Z] [INFO] Tests run: 1, Failures: 0, Errors: 0, Skipped: 0, Time elapsed: 5.683 s - in org.apache.maven.surefire.its.jiras.Surefire930TestNgSuiteXmlIT
[2019-08-24T14:22:08.837Z] [INFO] Running org.apache.maven.surefire.its.jiras.Surefire943ReportContentIT
[2019-08-24T14:22:19.786Z] Zipped 18106 entries.
[2019-08-24T14:22:19.786Z] Archiving /home/jenkins/jenkins-slave/workspace/maven2surefire-jvm-communication@2/surefire-its--linux-jdk11-maven3.6.x.zip
[2019-08-24T14:22:19.788Z] [Fast Archiver] No artifacts from Maven TLP » maven-surefire » maven2surefire-jvm-communication #4 to compare, so performing full copy of artifacts
[Pipeline] archiveArtifacts
[2019-08-24T14:22:24.671Z] Archiving artifacts
[2019-08-24T14:22:24.832Z] [Fast Archiver] No artifacts from Maven TLP » maven-surefire » maven2surefire-jvm-communication #4 to compare, so performing full copy of artifacts
[Pipeline] cleanWs
[2019-08-24T14:22:29.253Z] [WS-CLEANUP] Deleting project workspace...
[2019-08-24T14:22:29.253Z] [WS-CLEANUP] Deferred wipeout is used...
[2019-08-24T14:22:29.564Z] [WS-CLEANUP] done
[Pipeline] }
[Pipeline] // ws
[Pipeline] }
[Pipeline] // timestamps
[Pipeline] }
[Pipeline] // node
[Pipeline] }
[2019-08-24T14:22:33.743Z] [INFO] Tests run: 2, Failures: 0, Errors: 0, Skipped: 0, Time elapsed: 24.165 s - in org.apache.maven.surefire.its.jiras.Surefire943ReportContentIT
[2019-08-24T14:22:33.743Z] [INFO] Running org.apache.maven.surefire.its.jiras.Surefire946KillMainProcessInReusableForkIT
[2019-08-24T14:23:21.105Z] [INFO] Tests run: 6, Failures: 0, Errors: 0, Skipped: 0, Time elapsed: 45.053 s - in org.apache.maven.surefire.its.jiras.Surefire946KillMainProcessInReusableForkIT
[2019-08-24T14:23:21.105Z] [INFO] Running org.apache.maven.surefire.its.jiras.Surefire972BizarreNoClassDefIT
[2019-08-24T14:23:25.288Z] [INFO] Tests run: 1, Failures: 0, Errors: 0, Skipped: 0, Time elapsed: 7.357 s - in org.apache.maven.surefire.its.jiras.Surefire972BizarreNoClassDefIT
[2019-08-24T14:23:25.288Z] [INFO] Running org.apache.maven.surefire.its.jiras.Surefire975DefaultVMEncodingIT
[2019-08-24T14:23:31.809Z] [INFO] Tests run: 1, Failures: 0, Errors: 0, Skipped: 0, Time elapsed: 7.231 s - in org.apache.maven.surefire.its.jiras.Surefire975DefaultVMEncodingIT
[2019-08-24T14:23:31.809Z] [INFO] Running org.apache.maven.surefire.its.jiras.Surefire979WrongClassLoaderIT
[2019-08-24T14:23:38.413Z] [INFO] Tests run: 1, Failures: 0, Errors: 0, Skipped: 0, Time elapsed: 5.873 s - in org.apache.maven.surefire.its.jiras.Surefire979WrongClassLoaderIT
[2019-08-24T14:23:38.413Z] [INFO] Running org.apache.maven.surefire.its.jiras.Surefire985ParameterizedRunnerAndCategoriesIT
[2019-08-24T14:23:43.051Z] [INFO] Tests run: 1, Failures: 0, Errors: 0, Skipped: 0, Time elapsed: 4.758 s - in org.apache.maven.surefire.its.jiras.Surefire985ParameterizedRunnerAndCategoriesIT
[2019-08-24T14:23:43.051Z] [INFO] Running org.apache.maven.surefire.its.jiras.Surefire995CategoryInheritanceIT
[2019-08-24T14:24:07.970Z] [INFO] Tests run: 5, Failures: 0, Errors: 0, Skipped: 0, Time elapsed: 23.082 s - in org.apache.maven.surefire.its.jiras.Surefire995CategoryInheritanceIT
[2019-08-24T14:24:07.970Z] [INFO]
[2019-08-24T14:24:07.970Z] [INFO] Results:
[2019-08-24T14:24:07.970Z] [INFO]
[2019-08-24T14:24:07.970Z] [WARNING] Tests run: 846, Failures: 0, Errors: 0, Skipped: 214
[2019-08-24T14:24:07.970Z] [INFO]
[2019-08-24T14:24:07.970Z] [INFO]
[2019-08-24T14:24:07.970Z] [INFO] --- maven-checkstyle-plugin:3.0.0:check (checkstyle-check) @ surefire-its ---
[2019-08-24T14:24:10.270Z] [INFO]
[2019-08-24T14:24:10.270Z] [INFO] --- maven-failsafe-plugin:3.0.0-M3:verify (default) @ surefire-its ---
[2019-08-24T14:24:10.270Z] [INFO] Failsafe report directory: /home/jenkins/jenkins-slave/workspace/maven2surefire-jvm-communication@2/surefire-its/target/failsafe-reports
[2019-08-24T14:24:11.746Z] [INFO]
[2019-08-24T14:24:11.746Z] [INFO] --- maven-install-plugin:2.5.2:install (default-install) @ surefire-its ---
[2019-08-24T14:24:11.746Z] [INFO] Skipping artifact installation
[2019-08-24T14:24:11.746Z] [INFO] ------------------------------------------------------------------------
[2019-08-24T14:24:11.746Z] [INFO] Reactor Summary for Apache Maven Surefire 3.0.0-SNAPSHOT:
[2019-08-24T14:24:11.746Z] [INFO]
[2019-08-24T14:24:11.746Z] [INFO] Apache Maven Surefire .............................. SUCCESS [ 23.614 s]
[2019-08-24T14:24:11.746Z] [INFO] SureFire Logger API ................................ SUCCESS [ 13.144 s]
[2019-08-24T14:24:11.746Z] [INFO] SureFire API ....................................... SUCCESS [ 19.007 s]
[2019-08-24T14:24:11.746Z] [INFO] Surefire Extensions API ............................ SUCCESS [  3.845 s]
[2019-08-24T14:24:11.746Z] [INFO] Surefire Extensions SPI ............................ SUCCESS [  1.972 s]
[2019-08-24T14:24:11.746Z] [INFO] SureFire Booter .................................... SUCCESS [ 25.857 s]
[2019-08-24T14:24:11.746Z] [INFO] Maven Surefire Test-Grouping Support ............... SUCCESS [  8.734 s]
[2019-08-24T14:24:11.746Z] [INFO] SureFire Providers ................................. SUCCESS [  0.951 s]
[2019-08-24T14:24:11.746Z] [INFO] Shared JUnit3 Provider Code ........................ SUCCESS [  4.984 s]
[2019-08-24T14:24:11.747Z] [INFO] Shared Java 5 Provider Base ........................ SUCCESS [  5.094 s]
[2019-08-24T14:24:11.747Z] [INFO] Shared JUnit4 Provider Code ........................ SUCCESS [  6.267 s]
[2019-08-24T14:24:11.747Z] [INFO] Shared JUnit48 Provider Code ....................... SUCCESS [  5.684 s]
[2019-08-24T14:24:11.747Z] [INFO] SureFire JUnit Runner .............................. SUCCESS [  4.020 s]
[2019-08-24T14:24:11.747Z] [INFO] SureFire JUnit4 Runner ............................. SUCCESS [  3.917 s]
[2019-08-24T14:24:11.747Z] [INFO] Maven Surefire Common .............................. SUCCESS [ 41.486 s]
[2019-08-24T14:24:11.747Z] [INFO] SureFire JUnitCore Runner .......................... SUCCESS [02:20 min]
[2019-08-24T14:24:11.747Z] [INFO] SureFire JUnit Platform Runner ..................... SUCCESS [ 10.446 s]
[2019-08-24T14:24:11.747Z] [INFO] SureFire TestNG Utils .............................. SUCCESS [  4.608 s]
[2019-08-24T14:24:11.747Z] [INFO] SureFire TestNG Runner ............................. SUCCESS [  4.499 s]
[2019-08-24T14:24:11.747Z] [INFO] ShadeFire JUnit3 Provider .......................... SUCCESS [  1.788 s]
[2019-08-24T14:24:11.747Z] [INFO] Surefire Report Parser ............................. SUCCESS [  5.874 s]
[2019-08-24T14:24:11.747Z] [INFO] Maven Surefire Plugin .............................. SUCCESS [ 12.110 s]
[2019-08-24T14:24:11.747Z] [INFO] Maven Failsafe Plugin .............................. SUCCESS [01:05 min]
[2019-08-24T14:24:11.747Z] [INFO] Maven Surefire Report Plugin ....................... SUCCESS [ 29.243 s]
[2019-08-24T14:24:11.747Z] [INFO] Maven Surefire Integration Tests ................... SUCCESS [  01:00 h]
[2019-08-24T14:24:11.747Z] [INFO] ------------------------------------------------------------------------
[2019-08-24T14:24:11.747Z] [INFO] BUILD SUCCESS
[2019-08-24T14:24:11.747Z] [INFO] ------------------------------------------------------------------------
[2019-08-24T14:24:11.747Z] [INFO] Total time:  01:07 h
[2019-08-24T14:24:11.747Z] [INFO] Finished at: 2019-08-24T14:24:11Z
[2019-08-24T14:24:11.747Z] [INFO] ------------------------------------------------------------------------
[Pipeline] }
[Pipeline] // withEnv
[Pipeline] }
[Pipeline] // stage
[Pipeline] fileExists
[Pipeline] zip
[2019-08-24T14:24:12.787Z] Writing zip file of /home/jenkins/jenkins-slave/workspace/maven2surefire-jvm-communication@2/maven-failsafe-plugin/target/it to /home/jenkins/jenkins-slave/workspace/maven2surefire-jvm-communication@2/maven-failsafe-plugin--linux-jdk7-maven3.6.x.zip
[2019-08-24T14:24:14.601Z] Zipped 78 entries.
[2019-08-24T14:24:14.602Z] Archiving /home/jenkins/jenkins-slave/workspace/maven2surefire-jvm-communication@2/maven-failsafe-plugin--linux-jdk7-maven3.6.x.zip
[2019-08-24T14:24:14.603Z] [Fast Archiver] No artifacts from Maven TLP » maven-surefire » maven2surefire-jvm-communication #4 to compare, so performing full copy of artifacts
[Pipeline] fileExists
[Pipeline] zip
[2019-08-24T14:24:15.716Z] Writing zip file of /home/jenkins/jenkins-slave/workspace/maven2surefire-jvm-communication@2/surefire-its/target to /home/jenkins/jenkins-slave/workspace/maven2surefire-jvm-communication@2/surefire-its--linux-jdk7-maven3.6.x.zip
[2019-08-24T14:24:36.189Z] Zipped 17047 entries.
[2019-08-24T14:24:36.189Z] Archiving /home/jenkins/jenkins-slave/workspace/maven2surefire-jvm-communication@2/surefire-its--linux-jdk7-maven3.6.x.zip
[2019-08-24T14:24:36.190Z] [Fast Archiver] No artifacts from Maven TLP » maven-surefire » maven2surefire-jvm-communication #4 to compare, so performing full copy of artifacts
[Pipeline] archiveArtifacts
[2019-08-24T14:24:40.473Z] Archiving artifacts
[2019-08-24T14:24:40.644Z] [Fast Archiver] No artifacts from Maven TLP » maven-surefire » maven2surefire-jvm-communication #4 to compare, so performing full copy of artifacts
[Pipeline] cleanWs
[2019-08-24T14:24:44.508Z] [WS-CLEANUP] Deleting project workspace...
[2019-08-24T14:24:44.509Z] [WS-CLEANUP] Deferred wipeout is used...
[2019-08-24T14:24:44.856Z] [WS-CLEANUP] done
[Pipeline] }
[Pipeline] // ws
[Pipeline] }
[Pipeline] // timestamps
[Pipeline] }
[Pipeline] // node
[Pipeline] }
[Pipeline] // parallel
[Pipeline] echo
Build result: FAILURE
[Pipeline] jiraIssueSelector
[Pipeline] echo
The authors of changes [hboutemy, tibordigana, rfscholte].
[Pipeline] echo
Sending email ...
[Pipeline] emailext
Reply | Threaded
Open this post in threaded view
|

Build failed in Jenkins: Maven TLP » maven-surefire » maven2surefire-jvm-communication #6

Apache Jenkins Server-2
See https://builds.apache.org/job/maven-box/job/maven-surefire/job/maven2surefire-jvm-communication/6/

No changes.

All tests passed

Build log:
[...truncated 61244 lines...]
[2019-08-25T16:22:53.842Z] Writing zip file of C:\Users\jenkins\AppData\Local\Temp\2\jenkins-maven-box-maven-surefire-maven2surefire-jvm-communication-6\surefire-its\target to C:\Users\jenkins\AppData\Local\Temp\2\jenkins-maven-box-maven-surefire-maven2surefire-jvm-communication-6\surefire-its--windows-jdk12-maven3.6.x.zip
[2019-08-25T16:22:57.485Z] [INFO] Tests run: 3, Failures: 0, Errors: 0, Skipped: 0, Time elapsed: 12.936 s - in org.apache.maven.surefire.its.jiras.Surefire772SpecifiedReportsIT
[2019-08-25T16:22:57.485Z] [INFO] Running org.apache.maven.surefire.its.jiras.Surefire801ForkModeNoneClassLoaderIT
[2019-08-25T16:23:02.984Z] [INFO] Tests run: 1, Failures: 0, Errors: 0, Skipped: 0, Time elapsed: 5.533 s - in org.apache.maven.surefire.its.jiras.Surefire801ForkModeNoneClassLoaderIT
[2019-08-25T16:23:02.984Z] [INFO] Running org.apache.maven.surefire.its.jiras.Surefire803MultiFailsafeExecsIT
[2019-08-25T16:23:13.216Z] Zipped 17008 entries.
[2019-08-25T16:23:13.216Z] Archiving C:\Users\jenkins\AppData\Local\Temp\2\jenkins-maven-box-maven-surefire-maven2surefire-jvm-communication-6\surefire-its--windows-jdk12-maven3.6.x.zip
[2019-08-25T16:23:13.218Z] [Fast Archiver] No artifacts from Maven TLP » maven-surefire » maven2surefire-jvm-communication #4 to compare, so performing full copy of artifacts
[Pipeline] archiveArtifacts
[2019-08-25T16:23:14.592Z] Archiving artifacts
[2019-08-25T16:23:14.649Z] [Fast Archiver] No artifacts from Maven TLP » maven-surefire » maven2surefire-jvm-communication #4 to compare, so performing full copy of artifacts
[Pipeline] cleanWs
[2019-08-25T16:23:16.039Z] [WS-CLEANUP] Deleting project workspace...
[2019-08-25T16:23:16.040Z] [WS-CLEANUP] Deferred wipeout is used...
[2019-08-25T16:23:16.164Z] [WS-CLEANUP] done
[Pipeline] }
[Pipeline] // ws
[Pipeline] }
[Pipeline] // timestamps
[Pipeline] }
[Pipeline] // node
[Pipeline] }
[2019-08-25T16:23:29.813Z] [INFO] Tests run: 2, Failures: 0, Errors: 0, Skipped: 0, Time elapsed: 26.19 s - in org.apache.maven.surefire.its.jiras.Surefire803MultiFailsafeExecsIT
[2019-08-25T16:23:29.813Z] [INFO] Running org.apache.maven.surefire.its.jiras.Surefire806SpecifiedTestControlsIT
[2019-08-25T16:23:38.094Z] [WARNING] Tests run: 3, Failures: 0, Errors: 0, Skipped: 2, Time elapsed: 7.406 s - in org.apache.maven.surefire.its.jiras.Surefire806SpecifiedTestControlsIT
[2019-08-25T16:23:38.094Z] [INFO] Running org.apache.maven.surefire.its.jiras.Surefire809GroupExpressionsIT
[2019-08-25T16:24:25.058Z] [INFO] Tests run: 6, Failures: 0, Errors: 0, Skipped: 0, Time elapsed: 45.714 s - in org.apache.maven.surefire.its.jiras.Surefire809GroupExpressionsIT
[2019-08-25T16:24:25.058Z] [INFO] Running org.apache.maven.surefire.its.jiras.Surefire812Log4JClassLoaderIT
[2019-08-25T16:24:31.773Z] [INFO] Tests run: 1, Failures: 0, Errors: 0, Skipped: 0, Time elapsed: 8.289 s - in org.apache.maven.surefire.its.jiras.Surefire812Log4JClassLoaderIT
[2019-08-25T16:24:31.773Z] [INFO] Running org.apache.maven.surefire.its.jiras.Surefire817SystemExitIT
[2019-08-25T16:24:41.916Z] [INFO] Tests run: 1, Failures: 0, Errors: 0, Skipped: 0, Time elapsed: 10.26 s - in org.apache.maven.surefire.its.jiras.Surefire817SystemExitIT
[2019-08-25T16:24:41.916Z] [INFO] Running org.apache.maven.surefire.its.jiras.Surefire818NpeIgnoresTestsIT
[2019-08-25T16:24:50.212Z] [INFO] Tests run: 1, Failures: 0, Errors: 0, Skipped: 0, Time elapsed: 9.15 s - in org.apache.maven.surefire.its.jiras.Surefire818NpeIgnoresTestsIT
[2019-08-25T16:24:50.212Z] [INFO] Running org.apache.maven.surefire.its.jiras.Surefire828EmptyGroupExprIT
[2019-08-25T16:25:22.546Z] [INFO] Tests run: 4, Failures: 0, Errors: 0, Skipped: 0, Time elapsed: 30.81 s - in org.apache.maven.surefire.its.jiras.Surefire828EmptyGroupExprIT
[2019-08-25T16:25:22.546Z] [INFO] Running org.apache.maven.surefire.its.jiras.Surefire832ProviderSelectionIT
[2019-08-25T16:25:29.949Z] [INFO] Tests run: 1, Failures: 0, Errors: 0, Skipped: 0, Time elapsed: 7.923 s - in org.apache.maven.surefire.its.jiras.Surefire832ProviderSelectionIT
[2019-08-25T16:25:29.949Z] [INFO] Running org.apache.maven.surefire.its.jiras.Surefire839TestWithoutCategoriesIT
[2019-08-25T16:25:45.918Z] [INFO] Tests run: 2, Failures: 0, Errors: 0, Skipped: 0, Time elapsed: 16.483 s - in org.apache.maven.surefire.its.jiras.Surefire839TestWithoutCategoriesIT
[2019-08-25T16:25:45.918Z] [INFO] Running org.apache.maven.surefire.its.jiras.Surefire847AdditionalFailureIT
[2019-08-25T16:25:56.074Z] [INFO] Tests run: 1, Failures: 0, Errors: 0, Skipped: 0, Time elapsed: 9.188 s - in org.apache.maven.surefire.its.jiras.Surefire847AdditionalFailureIT
[2019-08-25T16:25:56.074Z] [INFO] Running org.apache.maven.surefire.its.jiras.Surefire855AllowFailsafeUseArtifactFileIT
[2019-08-25T16:27:32.874Z] [INFO] Tests run: 4, Failures: 0, Errors: 0, Skipped: 0, Time elapsed: 84.322 s - in org.apache.maven.surefire.its.jiras.Surefire855AllowFailsafeUseArtifactFileIT
[2019-08-25T16:27:32.874Z] [INFO] Running org.apache.maven.surefire.its.jiras.Surefire901MIssingResultfileWhenNoTestsIT
[2019-08-25T16:27:32.874Z] [INFO] Tests run: 1, Failures: 0, Errors: 0, Skipped: 0, Time elapsed: 5.859 s - in org.apache.maven.surefire.its.jiras.Surefire901MIssingResultfileWhenNoTestsIT
[2019-08-25T16:27:32.874Z] [INFO] Running org.apache.maven.surefire.its.jiras.Surefire907PerThreadWithoutThreadCountIT
[2019-08-25T16:27:32.874Z] [INFO] Tests run: 1, Failures: 0, Errors: 0, Skipped: 0, Time elapsed: 5.282 s - in org.apache.maven.surefire.its.jiras.Surefire907PerThreadWithoutThreadCountIT
[2019-08-25T16:27:32.874Z] [INFO] Running org.apache.maven.surefire.its.jiras.Surefire920TestFailureIgnoreWithTimeoutIT
[2019-08-25T16:27:51.177Z] [INFO] Tests run: 2, Failures: 0, Errors: 0, Skipped: 0, Time elapsed: 18.311 s - in org.apache.maven.surefire.its.jiras.Surefire920TestFailureIgnoreWithTimeoutIT
[2019-08-25T16:27:51.177Z] [INFO] Running org.apache.maven.surefire.its.jiras.Surefire926FailureWith2ProvidersIT
[2019-08-25T16:27:53.859Z] [INFO] Tests run: 1, Failures: 0, Errors: 0, Skipped: 0, Time elapsed: 4.933 s - in org.apache.maven.surefire.its.jiras.Surefire926FailureWith2ProvidersIT
[2019-08-25T16:27:53.859Z] [INFO] Running org.apache.maven.surefire.its.jiras.Surefire930TestNgSuiteXmlIT
[2019-08-25T16:28:04.006Z] [INFO] Tests run: 1, Failures: 0, Errors: 0, Skipped: 0, Time elapsed: 9.545 s - in org.apache.maven.surefire.its.jiras.Surefire930TestNgSuiteXmlIT
[2019-08-25T16:28:04.006Z] [INFO] Running org.apache.maven.surefire.its.jiras.Surefire943ReportContentIT
[2019-08-25T16:28:42.984Z] [INFO] Tests run: 2, Failures: 0, Errors: 0, Skipped: 0, Time elapsed: 34.795 s - in org.apache.maven.surefire.its.jiras.Surefire943ReportContentIT
[2019-08-25T16:28:42.984Z] [INFO] Running org.apache.maven.surefire.its.jiras.Surefire946KillMainProcessInReusableForkIT
[2019-08-25T16:30:04.836Z] [ERROR] Tests run: 6, Failures: 6, Errors: 0, Skipped: 0, Time elapsed: 83.113 s <<< FAILURE! - in org.apache.maven.surefire.its.jiras.Surefire946KillMainProcessInReusableForkIT
[2019-08-25T16:30:04.836Z] [ERROR] test[halt-kill](org.apache.maven.surefire.its.jiras.Surefire946KillMainProcessInReusableForkIT)  Time elapsed: 26.866 s  <<< FAILURE!
[2019-08-25T16:30:04.836Z] org.junit.ComparisonFailure: expected:<[tru]e> but was:<[fals]e>
[2019-08-25T16:30:04.836Z] at org.apache.maven.surefire.its.jiras.Surefire946KillMainProcessInReusableForkIT.test(Surefire946KillMainProcessInReusableForkIT.java:134)
[2019-08-25T16:30:04.836Z]
[2019-08-25T16:30:04.836Z] [ERROR] test[halt-exit](org.apache.maven.surefire.its.jiras.Surefire946KillMainProcessInReusableForkIT)  Time elapsed: 6.226 s  <<< FAILURE!
[2019-08-25T16:30:04.836Z] org.junit.ComparisonFailure: expected:<[tru]e> but was:<[fals]e>
[2019-08-25T16:30:04.836Z] at org.apache.maven.surefire.its.jiras.Surefire946KillMainProcessInReusableForkIT.test(Surefire946KillMainProcessInReusableForkIT.java:134)
[2019-08-25T16:30:04.836Z]
[2019-08-25T16:30:04.836Z] [ERROR] test[exit-exit](org.apache.maven.surefire.its.jiras.Surefire946KillMainProcessInReusableForkIT)  Time elapsed: 20.754 s  <<< FAILURE!
[2019-08-25T16:30:04.836Z] org.junit.ComparisonFailure: expected:<[tru]e> but was:<[fals]e>
[2019-08-25T16:30:04.836Z] at org.apache.maven.surefire.its.jiras.Surefire946KillMainProcessInReusableForkIT.test(Surefire946KillMainProcessInReusableForkIT.java:134)
[2019-08-25T16:30:04.836Z]
[2019-08-25T16:30:04.836Z] [ERROR] test[exit-kill](org.apache.maven.surefire.its.jiras.Surefire946KillMainProcessInReusableForkIT)  Time elapsed: 5.982 s  <<< FAILURE!
[2019-08-25T16:30:04.836Z] org.junit.ComparisonFailure: expected:<[tru]e> but was:<[fals]e>
[2019-08-25T16:30:04.836Z] at org.apache.maven.surefire.its.jiras.Surefire946KillMainProcessInReusableForkIT.test(Surefire946KillMainProcessInReusableForkIT.java:134)
[2019-08-25T16:30:04.836Z]
[2019-08-25T16:30:04.836Z] [ERROR] test[interrupt-exit](org.apache.maven.surefire.its.jiras.Surefire946KillMainProcessInReusableForkIT)  Time elapsed: 17.913 s  <<< FAILURE!
[2019-08-25T16:30:04.836Z] org.junit.ComparisonFailure: expected:<[tru]e> but was:<[fals]e>
[2019-08-25T16:30:04.836Z] at org.apache.maven.surefire.its.jiras.Surefire946KillMainProcessInReusableForkIT.test(Surefire946KillMainProcessInReusableForkIT.java:134)
[2019-08-25T16:30:04.836Z]
[2019-08-25T16:30:04.836Z] [ERROR] test[interrupt-kill](org.apache.maven.surefire.its.jiras.Surefire946KillMainProcessInReusableForkIT)  Time elapsed: 23.283 s  <<< FAILURE!
[2019-08-25T16:30:04.836Z] org.junit.ComparisonFailure: expected:<[tru]e> but was:<[fals]e>
[2019-08-25T16:30:04.836Z] at org.apache.maven.surefire.its.jiras.Surefire946KillMainProcessInReusableForkIT.test(Surefire946KillMainProcessInReusableForkIT.java:134)
[2019-08-25T16:30:04.836Z]
[2019-08-25T16:30:04.836Z] [INFO] Running org.apache.maven.surefire.its.jiras.Surefire972BizarreNoClassDefIT
[2019-08-25T16:30:14.987Z] [INFO] Tests run: 1, Failures: 0, Errors: 0, Skipped: 0, Time elapsed: 13.542 s - in org.apache.maven.surefire.its.jiras.Surefire972BizarreNoClassDefIT
[2019-08-25T16:30:14.987Z] [INFO] Running org.apache.maven.surefire.its.jiras.Surefire975DefaultVMEncodingIT
[2019-08-25T16:30:23.325Z] [INFO] Tests run: 1, Failures: 0, Errors: 0, Skipped: 0, Time elapsed: 7.194 s - in org.apache.maven.surefire.its.jiras.Surefire975DefaultVMEncodingIT
[2019-08-25T16:30:23.325Z] [INFO] Running org.apache.maven.surefire.its.jiras.Surefire979WrongClassLoaderIT
[2019-08-25T16:30:31.641Z] [INFO] Tests run: 1, Failures: 0, Errors: 0, Skipped: 0, Time elapsed: 7.932 s - in org.apache.maven.surefire.its.jiras.Surefire979WrongClassLoaderIT
[2019-08-25T16:30:31.641Z] [INFO] Running org.apache.maven.surefire.its.jiras.Surefire985ParameterizedRunnerAndCategoriesIT
[2019-08-25T16:30:37.048Z] [INFO] Tests run: 1, Failures: 0, Errors: 0, Skipped: 0, Time elapsed: 6.576 s - in org.apache.maven.surefire.its.jiras.Surefire985ParameterizedRunnerAndCategoriesIT
[2019-08-25T16:30:37.048Z] [INFO] Running org.apache.maven.surefire.its.jiras.Surefire995CategoryInheritanceIT
[2019-08-25T16:31:09.370Z] [INFO] Tests run: 5, Failures: 0, Errors: 0, Skipped: 0, Time elapsed: 31.946 s - in org.apache.maven.surefire.its.jiras.Surefire995CategoryInheritanceIT
[2019-08-25T16:31:09.370Z] [INFO]
[2019-08-25T16:31:09.370Z] [INFO] Results:
[2019-08-25T16:31:09.370Z] [INFO]
[2019-08-25T16:31:09.370Z] [ERROR] Failures:
[2019-08-25T16:31:09.371Z] [ERROR]   Surefire946KillMainProcessInReusableForkIT.test:134 expected:<[tru]e> but was:<[fals]e>
[2019-08-25T16:31:09.371Z] [ERROR]   Surefire946KillMainProcessInReusableForkIT.test:134 expected:<[tru]e> but was:<[fals]e>
[2019-08-25T16:31:09.371Z] [ERROR]   Surefire946KillMainProcessInReusableForkIT.test:134 expected:<[tru]e> but was:<[fals]e>
[2019-08-25T16:31:09.371Z] [ERROR]   Surefire946KillMainProcessInReusableForkIT.test:134 expected:<[tru]e> but was:<[fals]e>
[2019-08-25T16:31:09.371Z] [ERROR]   Surefire946KillMainProcessInReusableForkIT.test:134 expected:<[tru]e> but was:<[fals]e>
[2019-08-25T16:31:09.371Z] [ERROR]   Surefire946KillMainProcessInReusableForkIT.test:134 expected:<[tru]e> but was:<[fals]e>
[2019-08-25T16:31:09.371Z] [INFO]
[2019-08-25T16:31:09.371Z] [ERROR] Tests run: 846, Failures: 6, Errors: 0, Skipped: 143
[2019-08-25T16:31:09.371Z] [INFO]
[2019-08-25T16:31:09.371Z] [INFO]
[2019-08-25T16:31:09.371Z] [INFO] --- maven-checkstyle-plugin:3.0.0:check (checkstyle-check) @ surefire-its ---
[2019-08-25T16:31:10.801Z] [INFO]
[2019-08-25T16:31:10.801Z] [INFO] --- maven-failsafe-plugin:3.0.0-M3:verify (default) @ surefire-its ---
[2019-08-25T16:31:10.801Z] [INFO] Failsafe report directory: C:\Users\jenkins\AppData\Local\Temp\2\jenkins-maven-box-maven-surefire-maven2surefire-jvm-communication-6\surefire-its\target\failsafe-reports
[2019-08-25T16:31:10.801Z] [INFO] ------------------------------------------------------------------------
[2019-08-25T16:31:10.801Z] [INFO] Reactor Summary for Apache Maven Surefire 3.0.0-SNAPSHOT:
[2019-08-25T16:31:10.801Z] [INFO]
[2019-08-25T16:31:10.801Z] [INFO] Apache Maven Surefire .............................. SUCCESS [01:18 min]
[2019-08-25T16:31:10.801Z] [INFO] SureFire Logger API ................................ SUCCESS [ 29.784 s]
[2019-08-25T16:31:10.801Z] [INFO] SureFire API ....................................... SUCCESS [ 18.545 s]
[2019-08-25T16:31:10.801Z] [INFO] Surefire Extensions API ............................ SUCCESS [  3.623 s]
[2019-08-25T16:31:10.801Z] [INFO] Surefire Extensions SPI ............................ SUCCESS [  3.267 s]
[2019-08-25T16:31:10.801Z] [INFO] SureFire Booter .................................... SUCCESS [ 26.780 s]
[2019-08-25T16:31:10.801Z] [INFO] Maven Surefire Test-Grouping Support ............... SUCCESS [ 13.135 s]
[2019-08-25T16:31:10.801Z] [INFO] SureFire Providers ................................. SUCCESS [  1.078 s]
[2019-08-25T16:31:10.801Z] [INFO] Shared JUnit3 Provider Code ........................ SUCCESS [  7.093 s]
[2019-08-25T16:31:10.801Z] [INFO] Shared Java 5 Provider Base ........................ SUCCESS [  7.500 s]
[2019-08-25T16:31:10.801Z] [INFO] Shared JUnit4 Provider Code ........................ SUCCESS [  7.339 s]
[2019-08-25T16:31:10.801Z] [INFO] Shared JUnit48 Provider Code ....................... SUCCESS [  8.552 s]
[2019-08-25T16:31:10.801Z] [INFO] SureFire JUnit Runner .............................. SUCCESS [  6.392 s]
[2019-08-25T16:31:10.801Z] [INFO] SureFire JUnit4 Runner ............................. SUCCESS [  6.174 s]
[2019-08-25T16:31:10.801Z] [INFO] Maven Surefire Common .............................. SUCCESS [ 54.792 s]
[2019-08-25T16:31:10.801Z] [INFO] SureFire JUnitCore Runner .......................... SUCCESS [02:22 min]
[2019-08-25T16:31:10.801Z] [INFO] SureFire JUnit Platform Runner ..................... SUCCESS [ 20.669 s]
[2019-08-25T16:31:10.801Z] [INFO] SureFire TestNG Utils .............................. SUCCESS [ 14.591 s]
[2019-08-25T16:31:10.801Z] [INFO] SureFire TestNG Runner ............................. SUCCESS [  7.806 s]
[2019-08-25T16:31:10.801Z] [INFO] ShadeFire JUnit3 Provider .......................... SUCCESS [  3.287 s]
[2019-08-25T16:31:10.801Z] [INFO] Surefire Report Parser ............................. SUCCESS [ 11.176 s]
[2019-08-25T16:31:10.801Z] [INFO] Maven Surefire Plugin .............................. SUCCESS [ 25.389 s]
[2019-08-25T16:31:10.801Z] [INFO] Maven Failsafe Plugin .............................. SUCCESS [02:22 min]
[2019-08-25T16:31:10.801Z] [INFO] Maven Surefire Report Plugin ....................... SUCCESS [ 26.996 s]
[2019-08-25T16:31:10.801Z] [INFO] Maven Surefire Integration Tests ................... FAILURE [  01:32 h]
[2019-08-25T16:31:10.801Z] [INFO] ------------------------------------------------------------------------
[2019-08-25T16:31:10.801Z] [INFO] BUILD FAILURE
[2019-08-25T16:31:10.801Z] [INFO] ------------------------------------------------------------------------
[2019-08-25T16:31:10.801Z] [INFO] Total time:  01:44 h
[2019-08-25T16:31:10.801Z] [INFO] Finished at: 2019-08-25T09:31:10-07:00
[2019-08-25T16:31:10.801Z] [INFO] ------------------------------------------------------------------------
[2019-08-25T16:31:10.801Z] [ERROR] Failed to execute goal org.apache.maven.plugins:maven-failsafe-plugin:3.0.0-M3:verify (default) on project surefire-its: There are test failures.
[2019-08-25T16:31:10.801Z] [ERROR]
[2019-08-25T16:31:10.801Z] [ERROR] Please refer to C:\Users\jenkins\AppData\Local\Temp\2\jenkins-maven-box-maven-surefire-maven2surefire-jvm-communication-6\surefire-its\target\failsafe-reports for the individual test results.
[2019-08-25T16:31:10.801Z] [ERROR] Please refer to dump files (if any exist) [date].dump, [date]-jvmRun[N].dump and [date].dumpstream.
[2019-08-25T16:31:10.801Z] [ERROR] -> [Help 1]
[2019-08-25T16:31:10.801Z] org.apache.maven.lifecycle.LifecycleExecutionException: Failed to execute goal org.apache.maven.plugins:maven-failsafe-plugin:3.0.0-M3:verify (default) on project surefire-its: There are test failures.
[2019-08-25T16:31:10.801Z]
[2019-08-25T16:31:10.801Z] Please refer to C:\Users\jenkins\AppData\Local\Temp\2\jenkins-maven-box-maven-surefire-maven2surefire-jvm-communication-6\surefire-its\target\failsafe-reports for the individual test results.
[2019-08-25T16:31:10.801Z] Please refer to dump files (if any exist) [date].dump, [date]-jvmRun[N].dump and [date].dumpstream.
[2019-08-25T16:31:10.801Z]     at org.apache.maven.lifecycle.internal.MojoExecutor.execute (MojoExecutor.java:215)
[2019-08-25T16:31:10.801Z]     at org.apache.maven.lifecycle.internal.MojoExecutor.execute (MojoExecutor.java:156)
[2019-08-25T16:31:10.801Z]     at org.apache.maven.lifecycle.internal.MojoExecutor.execute (MojoExecutor.java:148)
[2019-08-25T16:31:10.801Z]     at org.apache.maven.lifecycle.internal.LifecycleModuleBuilder.buildProject (LifecycleModuleBuilder.java:117)
[2019-08-25T16:31:10.801Z]     at org.apache.maven.lifecycle.internal.LifecycleModuleBuilder.buildProject (LifecycleModuleBuilder.java:81)
[2019-08-25T16:31:10.801Z]     at org.apache.maven.lifecycle.internal.builder.singlethreaded.SingleThreadedBuilder.build (SingleThreadedBuilder.java:56)
[2019-08-25T16:31:10.801Z]     at org.apache.maven.lifecycle.internal.LifecycleStarter.execute (LifecycleStarter.java:128)
[2019-08-25T16:31:10.801Z]     at org.apache.maven.DefaultMaven.doExecute (DefaultMaven.java:305)
[2019-08-25T16:31:10.802Z]     at org.apache.maven.DefaultMaven.doExecute (DefaultMaven.java:192)
[2019-08-25T16:31:10.802Z]     at org.apache.maven.DefaultMaven.execute (DefaultMaven.java:105)
[2019-08-25T16:31:10.802Z]     at org.apache.maven.cli.MavenCli.execute (MavenCli.java:956)
[2019-08-25T16:31:10.802Z]     at org.apache.maven.cli.MavenCli.doMain (MavenCli.java:288)
[2019-08-25T16:31:10.802Z]     at org.apache.maven.cli.MavenCli.main (MavenCli.java:192)
[2019-08-25T16:31:10.802Z]     at sun.reflect.NativeMethodAccessorImpl.invoke0 (Native Method)
[2019-08-25T16:31:10.802Z]     at sun.reflect.NativeMethodAccessorImpl.invoke (NativeMethodAccessorImpl.java:62)
[2019-08-25T16:31:10.802Z]     at sun.reflect.DelegatingMethodAccessorImpl.invoke (DelegatingMethodAccessorImpl.java:43)
[2019-08-25T16:31:10.802Z]     at java.lang.reflect.Method.invoke (Method.java:498)
[2019-08-25T16:31:10.802Z]     at org.codehaus.plexus.classworlds.launcher.Launcher.launchEnhanced (Launcher.java:289)
[2019-08-25T16:31:10.802Z]     at org.codehaus.plexus.classworlds.launcher.Launcher.launch (Launcher.java:229)
[2019-08-25T16:31:10.802Z]     at org.codehaus.plexus.classworlds.launcher.Launcher.mainWithExitCode (Launcher.java:415)
[2019-08-25T16:31:10.802Z]     at org.codehaus.plexus.classworlds.launcher.Launcher.main (Launcher.java:356)
[2019-08-25T16:31:10.802Z] Caused by: org.apache.maven.plugin.MojoFailureException: There are test failures.
[2019-08-25T16:31:10.802Z]
[2019-08-25T16:31:10.802Z] Please refer to C:\Users\jenkins\AppData\Local\Temp\2\jenkins-maven-box-maven-surefire-maven2surefire-jvm-communication-6\surefire-its\target\failsafe-reports for the individual test results.
[2019-08-25T16:31:10.802Z] Please refer to dump files (if any exist) [date].dump, [date]-jvmRun[N].dump and [date].dumpstream.
[2019-08-25T16:31:10.802Z]     at org.apache.maven.plugin.surefire.SurefireHelper.throwException (SurefireHelper.java:271)
[2019-08-25T16:31:10.802Z]     at org.apache.maven.plugin.surefire.SurefireHelper.reportExecution (SurefireHelper.java:159)
[2019-08-25T16:31:10.802Z]     at org.apache.maven.plugin.failsafe.VerifyMojo.execute (VerifyMojo.java:192)
[2019-08-25T16:31:10.802Z]     at org.apache.maven.plugin.DefaultBuildPluginManager.executeMojo (DefaultBuildPluginManager.java:137)
[2019-08-25T16:31:10.802Z]     at org.apache.maven.lifecycle.internal.MojoExecutor.execute (MojoExecutor.java:210)
[2019-08-25T16:31:10.802Z]     at org.apache.maven.lifecycle.internal.MojoExecutor.execute (MojoExecutor.java:156)
[2019-08-25T16:31:10.802Z]     at org.apache.maven.lifecycle.internal.MojoExecutor.execute (MojoExecutor.java:148)
[2019-08-25T16:31:10.802Z]     at org.apache.maven.lifecycle.internal.LifecycleModuleBuilder.buildProject (LifecycleModuleBuilder.java:117)
[2019-08-25T16:31:10.802Z]     at org.apache.maven.lifecycle.internal.LifecycleModuleBuilder.buildProject (LifecycleModuleBuilder.java:81)
[2019-08-25T16:31:10.802Z]     at org.apache.maven.lifecycle.internal.builder.singlethreaded.SingleThreadedBuilder.build (SingleThreadedBuilder.java:56)
[2019-08-25T16:31:10.802Z]     at org.apache.maven.lifecycle.internal.LifecycleStarter.execute (LifecycleStarter.java:128)
[2019-08-25T16:31:10.802Z]     at org.apache.maven.DefaultMaven.doExecute (DefaultMaven.java:305)
[2019-08-25T16:31:10.802Z]     at org.apache.maven.DefaultMaven.doExecute (DefaultMaven.java:192)
[2019-08-25T16:31:10.802Z]     at org.apache.maven.DefaultMaven.execute (DefaultMaven.java:105)
[2019-08-25T16:31:10.802Z]     at org.apache.maven.cli.MavenCli.execute (MavenCli.java:956)
[2019-08-25T16:31:10.802Z]     at org.apache.maven.cli.MavenCli.doMain (MavenCli.java:288)
[2019-08-25T16:31:10.802Z]     at org.apache.maven.cli.MavenCli.main (MavenCli.java:192)
[2019-08-25T16:31:10.802Z]     at sun.reflect.NativeMethodAccessorImpl.invoke0 (Native Method)
[2019-08-25T16:31:10.802Z]     at sun.reflect.NativeMethodAccessorImpl.invoke (NativeMethodAccessorImpl.java:62)
[2019-08-25T16:31:10.802Z]     at sun.reflect.DelegatingMethodAccessorImpl.invoke (DelegatingMethodAccessorImpl.java:43)
[2019-08-25T16:31:10.802Z]     at java.lang.reflect.Method.invoke (Method.java:498)
[2019-08-25T16:31:10.802Z]     at org.codehaus.plexus.classworlds.launcher.Launcher.launchEnhanced (Launcher.java:289)
[2019-08-25T16:31:10.802Z]     at org.codehaus.plexus.classworlds.launcher.Launcher.launch (Launcher.java:229)
[2019-08-25T16:31:10.802Z]     at org.codehaus.plexus.classworlds.launcher.Launcher.mainWithExitCode (Launcher.java:415)
[2019-08-25T16:31:10.802Z]     at org.codehaus.plexus.classworlds.launcher.Launcher.main (Launcher.java:356)
[2019-08-25T16:31:10.802Z] [ERROR]
[2019-08-25T16:31:10.803Z] [ERROR] Re-run Maven using the -X switch to enable full debug logging.
[2019-08-25T16:31:10.803Z] [ERROR]
[2019-08-25T16:31:10.803Z] [ERROR] For more information about the errors and possible solutions, please read the following articles:
[2019-08-25T16:31:10.803Z] [ERROR] [Help 1] http://cwiki.apache.org/confluence/display/MAVEN/MojoFailureException
[2019-08-25T16:31:10.803Z] [ERROR]
[2019-08-25T16:31:10.803Z] [ERROR] After correcting the problems, you can resume the build with the command
[2019-08-25T16:31:10.803Z] [ERROR]   mvn <goals> -rf :surefire-its
[Pipeline] }
[Pipeline] // withEnv
[Pipeline] }
[Pipeline] // stage
[Pipeline] fileExists
[Pipeline] zip
[2019-08-25T16:31:10.990Z] Writing zip file of C:\Users\jenkins\AppData\Local\Temp\2\jenkins-maven-box-maven-surefire-maven2surefire-jvm-communication-6\maven-failsafe-plugin\target\it to C:\Users\jenkins\AppData\Local\Temp\2\jenkins-maven-box-maven-surefire-maven2surefire-jvm-communication-6\maven-failsafe-plugin--windows-jdk11-maven3.6.x.zip
[2019-08-25T16:31:11.136Z] Zipped 78 entries.
[2019-08-25T16:31:11.136Z] Archiving C:\Users\jenkins\AppData\Local\Temp\2\jenkins-maven-box-maven-surefire-maven2surefire-jvm-communication-6\maven-failsafe-plugin--windows-jdk11-maven3.6.x.zip
[2019-08-25T16:31:11.138Z] [Fast Archiver] No artifacts from Maven TLP » maven-surefire » maven2surefire-jvm-communication #4 to compare, so performing full copy of artifacts
[Pipeline] fileExists
[Pipeline] zip
[2019-08-25T16:31:11.219Z] Writing zip file of C:\Users\jenkins\AppData\Local\Temp\2\jenkins-maven-box-maven-surefire-maven2surefire-jvm-communication-6\surefire-its\target to C:\Users\jenkins\AppData\Local\Temp\2\jenkins-maven-box-maven-surefire-maven2surefire-jvm-communication-6\surefire-its--windows-jdk11-maven3.6.x.zip
[2019-08-25T16:31:33.188Z] Zipped 17019 entries.
[2019-08-25T16:31:33.188Z] Archiving C:\Users\jenkins\AppData\Local\Temp\2\jenkins-maven-box-maven-surefire-maven2surefire-jvm-communication-6\surefire-its--windows-jdk11-maven3.6.x.zip
[2019-08-25T16:31:33.190Z] [Fast Archiver] No artifacts from Maven TLP » maven-surefire » maven2surefire-jvm-communication #4 to compare, so performing full copy of artifacts
[Pipeline] archiveArtifacts
[2019-08-25T16:31:35.147Z] Archiving artifacts
[2019-08-25T16:31:35.164Z] [Fast Archiver] No artifacts from Maven TLP » maven-surefire » maven2surefire-jvm-communication #4 to compare, so performing full copy of artifacts
[Pipeline] cleanWs
[2019-08-25T16:31:37.079Z] [WS-CLEANUP] Deleting project workspace...
[2019-08-25T16:31:37.079Z] [WS-CLEANUP] Deferred wipeout is used...
[2019-08-25T16:31:37.201Z] [WS-CLEANUP] done
[Pipeline] }
[Pipeline] // ws
[Pipeline] }
[Pipeline] // timestamps
[Pipeline] }
[Pipeline] // node
[Pipeline] }
[Pipeline] // parallel
[Pipeline] echo
Build result: FAILURE
[Pipeline] jiraIssueSelector
[Pipeline] echo
The authors of changes [].
[Pipeline] echo
Sending email ...
[Pipeline] emailext
Reply | Threaded
Open this post in threaded view
|

Build failed in Jenkins: Maven TLP » maven-surefire » maven2surefire-jvm-communication #7

Apache Jenkins Server-2
See https://builds.apache.org/job/maven-box/job/maven-surefire/job/maven2surefire-jvm-communication/7/

No changes.

All tests passed

Build log:
[...truncated 61256 lines...]
[2019-08-28T07:08:37.083Z]     at sun.reflect.DelegatingMethodAccessorImpl.invoke (DelegatingMethodAccessorImpl.java:43)
[2019-08-28T07:08:37.083Z]     at java.lang.reflect.Method.invoke (Method.java:498)
[2019-08-28T07:08:37.083Z]     at org.codehaus.plexus.classworlds.launcher.Launcher.launchEnhanced (Launcher.java:289)
[2019-08-28T07:08:37.083Z]     at org.codehaus.plexus.classworlds.launcher.Launcher.launch (Launcher.java:229)
[2019-08-28T07:08:37.083Z]     at org.codehaus.plexus.classworlds.launcher.Launcher.mainWithExitCode (Launcher.java:415)
[2019-08-28T07:08:37.083Z]     at org.codehaus.plexus.classworlds.launcher.Launcher.main (Launcher.java:356)
[2019-08-28T07:08:37.083Z] [ERROR]
[2019-08-28T07:08:37.083Z] [ERROR] Re-run Maven using the -X switch to enable full debug logging.
[2019-08-28T07:08:37.083Z] [ERROR]
[2019-08-28T07:08:37.083Z] [ERROR] For more information about the errors and possible solutions, please read the following articles:
[2019-08-28T07:08:37.083Z] [ERROR] [Help 1] http://cwiki.apache.org/confluence/display/MAVEN/MojoFailureException
[2019-08-28T07:08:37.083Z] [ERROR]
[2019-08-28T07:08:37.083Z] [ERROR] After correcting the problems, you can resume the build with the command
[2019-08-28T07:08:37.083Z] [ERROR]   mvn <goals> -rf :surefire-its
[Pipeline] zip
[2019-08-28T07:08:37.123Z] Writing zip file of C:\Users\jenkins\AppData\Local\Temp\3\jenkins-maven-box-maven-surefire-maven2surefire-jvm-communication-7@2\maven-failsafe-plugin\target\it to C:\Users\jenkins\AppData\Local\Temp\3\jenkins-maven-box-maven-surefire-maven2surefire-jvm-communication-7@2\maven-failsafe-plugin--windows-jdk12-maven3.6.x.zip
[Pipeline] }
[Pipeline] // withEnv
[Pipeline] }
[Pipeline] // stage
[Pipeline] fileExists
[2019-08-28T07:08:37.224Z] Zipped 78 entries.
[2019-08-28T07:08:37.224Z] Archiving C:\Users\jenkins\AppData\Local\Temp\3\jenkins-maven-box-maven-surefire-maven2surefire-jvm-communication-7@2\maven-failsafe-plugin--windows-jdk12-maven3.6.x.zip
[2019-08-28T07:08:37.225Z] [Fast Archiver] No artifacts from Maven TLP » maven-surefire » maven2surefire-jvm-communication #4 to compare, so performing full copy of artifacts
[Pipeline] zip
[2019-08-28T07:08:37.249Z] Writing zip file of C:\Users\jenkins\AppData\Local\Temp\3\jenkins-maven-box-maven-surefire-maven2surefire-jvm-communication-7\maven-failsafe-plugin\target\it to C:\Users\jenkins\AppData\Local\Temp\3\jenkins-maven-box-maven-surefire-maven2surefire-jvm-communication-7\maven-failsafe-plugin--windows-jdk13-maven3.6.x.zip
[Pipeline] fileExists
[Pipeline] zip
[2019-08-28T07:08:37.305Z] Writing zip file of C:\Users\jenkins\AppData\Local\Temp\3\jenkins-maven-box-maven-surefire-maven2surefire-jvm-communication-7@2\surefire-its\target to C:\Users\jenkins\AppData\Local\Temp\3\jenkins-maven-box-maven-surefire-maven2surefire-jvm-communication-7@2\surefire-its--windows-jdk12-maven3.6.x.zip
[2019-08-28T07:08:37.341Z] Zipped 78 entries.
[2019-08-28T07:08:37.341Z] Archiving C:\Users\jenkins\AppData\Local\Temp\3\jenkins-maven-box-maven-surefire-maven2surefire-jvm-communication-7\maven-failsafe-plugin--windows-jdk13-maven3.6.x.zip
[2019-08-28T07:08:37.342Z] [Fast Archiver] No artifacts from Maven TLP » maven-surefire » maven2surefire-jvm-communication #4 to compare, so performing full copy of artifacts
[Pipeline] fileExists
[Pipeline] zip
[2019-08-28T07:08:37.422Z] Writing zip file of C:\Users\jenkins\AppData\Local\Temp\3\jenkins-maven-box-maven-surefire-maven2surefire-jvm-communication-7\surefire-its\target to C:\Users\jenkins\AppData\Local\Temp\3\jenkins-maven-box-maven-surefire-maven2surefire-jvm-communication-7\surefire-its--windows-jdk13-maven3.6.x.zip
[2019-08-28T07:08:45.850Z] [INFO] Tests run: 2, Failures: 0, Errors: 0, Skipped: 0, Time elapsed: 34.842 s - in org.apache.maven.surefire.its.jiras.Surefire943ReportContentIT
[2019-08-28T07:08:45.850Z] [INFO] Running org.apache.maven.surefire.its.jiras.Surefire946KillMainProcessInReusableForkIT
[2019-08-28T07:08:57.583Z] Zipped 17013 entries.
[2019-08-28T07:08:57.583Z] Archiving C:\Users\jenkins\AppData\Local\Temp\3\jenkins-maven-box-maven-surefire-maven2surefire-jvm-communication-7@2\surefire-its--windows-jdk12-maven3.6.x.zip
[2019-08-28T07:08:57.584Z] [Fast Archiver] No artifacts from Maven TLP » maven-surefire » maven2surefire-jvm-communication #4 to compare, so performing full copy of artifacts
[2019-08-28T07:08:57.711Z] Zipped 17010 entries.
[2019-08-28T07:08:57.711Z] Archiving C:\Users\jenkins\AppData\Local\Temp\3\jenkins-maven-box-maven-surefire-maven2surefire-jvm-communication-7\surefire-its--windows-jdk13-maven3.6.x.zip
[2019-08-28T07:08:57.712Z] [Fast Archiver] No artifacts from Maven TLP » maven-surefire » maven2surefire-jvm-communication #4 to compare, so performing full copy of artifacts
[Pipeline] archiveArtifacts
[2019-08-28T07:08:59.941Z] Archiving artifacts
[2019-08-28T07:08:59.959Z] [Fast Archiver] No artifacts from Maven TLP » maven-surefire » maven2surefire-jvm-communication #4 to compare, so performing full copy of artifacts
[Pipeline] archiveArtifacts
[2019-08-28T07:09:00.166Z] Archiving artifacts
[2019-08-28T07:09:00.217Z] [Fast Archiver] No artifacts from Maven TLP » maven-surefire » maven2surefire-jvm-communication #4 to compare, so performing full copy of artifacts
[Pipeline] cleanWs
[2019-08-28T07:09:02.583Z] [WS-CLEANUP] Deleting project workspace...
[2019-08-28T07:09:02.583Z] [WS-CLEANUP] Deferred wipeout is used...
[2019-08-28T07:09:02.710Z] [WS-CLEANUP] done
[Pipeline] }
[Pipeline] // ws
[Pipeline] }
[Pipeline] // timestamps
[Pipeline] cleanWs
[Pipeline] }
[2019-08-28T07:09:02.869Z] [WS-CLEANUP] Deleting project workspace...
[2019-08-28T07:09:02.869Z] [WS-CLEANUP] Deferred wipeout is used...
[Pipeline] // node
[Pipeline] }
[2019-08-28T07:09:03.003Z] [WS-CLEANUP] done
[Pipeline] }
[Pipeline] // ws
[Pipeline] }
[Pipeline] // timestamps
[Pipeline] }
[Pipeline] // node
[Pipeline] }
[2019-08-28T07:09:53.784Z] [ERROR] Tests run: 6, Failures: 3, Errors: 0, Skipped: 0, Time elapsed: 64.707 s <<< FAILURE! - in org.apache.maven.surefire.its.jiras.Surefire946KillMainProcessInReusableForkIT
[2019-08-28T07:09:53.784Z] [ERROR] test[halt-exit](org.apache.maven.surefire.its.jiras.Surefire946KillMainProcessInReusableForkIT)  Time elapsed: 25.826 s  <<< FAILURE!
[2019-08-28T07:09:53.784Z] org.junit.ComparisonFailure: expected:<[tru]e> but was:<[fals]e>
[2019-08-28T07:09:53.784Z] at org.apache.maven.surefire.its.jiras.Surefire946KillMainProcessInReusableForkIT.test(Surefire946KillMainProcessInReusableForkIT.java:134)
[2019-08-28T07:09:53.784Z]
[2019-08-28T07:09:53.784Z] [ERROR] test[halt-kill](org.apache.maven.surefire.its.jiras.Surefire946KillMainProcessInReusableForkIT)  Time elapsed: 5.541 s  <<< FAILURE!
[2019-08-28T07:09:53.784Z] org.junit.ComparisonFailure: expected:<[tru]e> but was:<[fals]e>
[2019-08-28T07:09:53.784Z] at org.apache.maven.surefire.its.jiras.Surefire946KillMainProcessInReusableForkIT.test(Surefire946KillMainProcessInReusableForkIT.java:134)
[2019-08-28T07:09:53.784Z]
[2019-08-28T07:09:53.784Z] [ERROR] test[exit-exit](org.apache.maven.surefire.its.jiras.Surefire946KillMainProcessInReusableForkIT)  Time elapsed: 3.564 s  <<< FAILURE!
[2019-08-28T07:09:53.784Z] org.junit.ComparisonFailure: expected:<[tru]e> but was:<[fals]e>
[2019-08-28T07:09:53.784Z] at org.apache.maven.surefire.its.jiras.Surefire946KillMainProcessInReusableForkIT.test(Surefire946KillMainProcessInReusableForkIT.java:134)
[2019-08-28T07:09:53.784Z]
[2019-08-28T07:09:53.784Z] [INFO] Running org.apache.maven.surefire.its.jiras.Surefire972BizarreNoClassDefIT
[2019-08-28T07:09:55.209Z] [INFO] Tests run: 1, Failures: 0, Errors: 0, Skipped: 0, Time elapsed: 9.974 s - in org.apache.maven.surefire.its.jiras.Surefire972BizarreNoClassDefIT
[2019-08-28T07:09:55.209Z] [INFO] Running org.apache.maven.surefire.its.jiras.Surefire975DefaultVMEncodingIT
[2019-08-28T07:10:02.045Z] [INFO] Tests run: 1, Failures: 0, Errors: 0, Skipped: 0, Time elapsed: 5.908 s - in org.apache.maven.surefire.its.jiras.Surefire975DefaultVMEncodingIT
[2019-08-28T07:10:02.045Z] [INFO] Running org.apache.maven.surefire.its.jiras.Surefire979WrongClassLoaderIT
[2019-08-28T07:10:07.406Z] [INFO] Tests run: 1, Failures: 0, Errors: 0, Skipped: 0, Time elapsed: 6.004 s - in org.apache.maven.surefire.its.jiras.Surefire979WrongClassLoaderIT
[2019-08-28T07:10:07.406Z] [INFO] Running org.apache.maven.surefire.its.jiras.Surefire985ParameterizedRunnerAndCategoriesIT
[2019-08-28T07:10:12.799Z] [INFO] Tests run: 1, Failures: 0, Errors: 0, Skipped: 0, Time elapsed: 4.994 s - in org.apache.maven.surefire.its.jiras.Surefire985ParameterizedRunnerAndCategoriesIT
[2019-08-28T07:10:12.799Z] [INFO] Running org.apache.maven.surefire.its.jiras.Surefire995CategoryInheritanceIT
[2019-08-28T07:10:39.508Z] [INFO] Tests run: 5, Failures: 0, Errors: 0, Skipped: 0, Time elapsed: 24.58 s - in org.apache.maven.surefire.its.jiras.Surefire995CategoryInheritanceIT
[2019-08-28T07:10:39.508Z] [INFO]
[2019-08-28T07:10:39.508Z] [INFO] Results:
[2019-08-28T07:10:39.508Z] [INFO]
[2019-08-28T07:10:39.508Z] [ERROR] Failures:
[2019-08-28T07:10:39.508Z] [ERROR]   Surefire946KillMainProcessInReusableForkIT.test:134 expected:<[tru]e> but was:<[fals]e>
[2019-08-28T07:10:39.508Z] [ERROR]   Surefire946KillMainProcessInReusableForkIT.test:134 expected:<[tru]e> but was:<[fals]e>
[2019-08-28T07:10:39.508Z] [ERROR]   Surefire946KillMainProcessInReusableForkIT.test:134 expected:<[tru]e> but was:<[fals]e>
[2019-08-28T07:10:39.508Z] [INFO]
[2019-08-28T07:10:39.508Z] [ERROR] Tests run: 846, Failures: 3, Errors: 0, Skipped: 152
[2019-08-28T07:10:39.508Z] [INFO]
[2019-08-28T07:10:39.508Z] [INFO]
[2019-08-28T07:10:39.508Z] [INFO] --- maven-checkstyle-plugin:3.0.0:check (checkstyle-check) @ surefire-its ---
[2019-08-28T07:10:39.508Z] [INFO]
[2019-08-28T07:10:39.508Z] [INFO] --- maven-failsafe-plugin:3.0.0-M3:verify (default) @ surefire-its ---
[2019-08-28T07:10:39.508Z] [INFO] Failsafe report directory: C:\Users\jenkins\AppData\Local\Temp\2\jenkins-maven-box-maven-surefire-maven2surefire-jvm-communication-7\surefire-its\target\failsafe-reports
[2019-08-28T07:10:39.508Z] [INFO] ------------------------------------------------------------------------
[2019-08-28T07:10:39.508Z] [INFO] Reactor Summary for Apache Maven Surefire 3.0.0-SNAPSHOT:
[2019-08-28T07:10:39.508Z] [INFO]
[2019-08-28T07:10:39.508Z] [INFO] Apache Maven Surefire .............................. SUCCESS [01:29 min]
[2019-08-28T07:10:39.508Z] [INFO] SureFire Logger API ................................ SUCCESS [ 25.509 s]
[2019-08-28T07:10:39.508Z] [INFO] SureFire API ....................................... SUCCESS [ 19.673 s]
[2019-08-28T07:10:39.508Z] [INFO] Surefire Extensions API ............................ SUCCESS [  3.638 s]
[2019-08-28T07:10:39.508Z] [INFO] Surefire Extensions SPI ............................ SUCCESS [  2.599 s]
[2019-08-28T07:10:39.508Z] [INFO] SureFire Booter .................................... SUCCESS [ 23.517 s]
[2019-08-28T07:10:39.508Z] [INFO] Maven Surefire Test-Grouping Support ............... SUCCESS [ 14.436 s]
[2019-08-28T07:10:39.508Z] [INFO] SureFire Providers ................................. SUCCESS [  1.502 s]
[2019-08-28T07:10:39.508Z] [INFO] Shared JUnit3 Provider Code ........................ SUCCESS [  5.901 s]
[2019-08-28T07:10:39.508Z] [INFO] Shared Java 5 Provider Base ........................ SUCCESS [  9.492 s]
[2019-08-28T07:10:39.508Z] [INFO] Shared JUnit4 Provider Code ........................ SUCCESS [  7.517 s]
[2019-08-28T07:10:39.508Z] [INFO] Shared JUnit48 Provider Code ....................... SUCCESS [ 14.989 s]
[2019-08-28T07:10:39.508Z] [INFO] SureFire JUnit Runner .............................. SUCCESS [  5.348 s]
[2019-08-28T07:10:39.508Z] [INFO] SureFire JUnit4 Runner ............................. SUCCESS [  6.919 s]
[2019-08-28T07:10:39.508Z] [INFO] Maven Surefire Common .............................. SUCCESS [ 46.967 s]
[2019-08-28T07:10:39.508Z] [INFO] SureFire JUnitCore Runner .......................... SUCCESS [02:26 min]
[2019-08-28T07:10:39.508Z] [INFO] SureFire JUnit Platform Runner ..................... SUCCESS [ 12.654 s]
[2019-08-28T07:10:39.508Z] [INFO] SureFire TestNG Utils .............................. SUCCESS [  5.433 s]
[2019-08-28T07:10:39.508Z] [INFO] SureFire TestNG Runner ............................. SUCCESS [  7.069 s]
[2019-08-28T07:10:39.508Z] [INFO] ShadeFire JUnit3 Provider .......................... SUCCESS [  2.335 s]
[2019-08-28T07:10:39.508Z] [INFO] Surefire Report Parser ............................. SUCCESS [  8.857 s]
[2019-08-28T07:10:39.508Z] [INFO] Maven Surefire Plugin .............................. SUCCESS [ 19.743 s]
[2019-08-28T07:10:39.508Z] [INFO] Maven Failsafe Plugin .............................. SUCCESS [02:07 min]
[2019-08-28T07:10:39.508Z] [INFO] Maven Surefire Report Plugin ....................... SUCCESS [ 21.561 s]
[2019-08-28T07:10:39.508Z] [INFO] Maven Surefire Integration Tests ................... FAILURE [  01:11 h]
[2019-08-28T07:10:39.508Z] [INFO] ------------------------------------------------------------------------
[2019-08-28T07:10:39.508Z] [INFO] BUILD FAILURE
[2019-08-28T07:10:39.508Z] [INFO] ------------------------------------------------------------------------
[2019-08-28T07:10:39.508Z] [INFO] Total time:  01:22 h
[2019-08-28T07:10:39.508Z] [INFO] Finished at: 2019-08-28T00:10:38-07:00
[2019-08-28T07:10:39.508Z] [INFO] ------------------------------------------------------------------------
[2019-08-28T07:10:39.508Z] [ERROR] Failed to execute goal org.apache.maven.plugins:maven-failsafe-plugin:3.0.0-M3:verify (default) on project surefire-its: There are test failures.
[2019-08-28T07:10:39.508Z] [ERROR]
[2019-08-28T07:10:39.508Z] [ERROR] Please refer to C:\Users\jenkins\AppData\Local\Temp\2\jenkins-maven-box-maven-surefire-maven2surefire-jvm-communication-7\surefire-its\target\failsafe-reports for the individual test results.
[2019-08-28T07:10:39.508Z] [ERROR] Please refer to dump files (if any exist) [date].dump, [date]-jvmRun[N].dump and [date].dumpstream.
[2019-08-28T07:10:39.508Z] [ERROR] -> [Help 1]
[2019-08-28T07:10:39.508Z] org.apache.maven.lifecycle.LifecycleExecutionException: Failed to execute goal org.apache.maven.plugins:maven-failsafe-plugin:3.0.0-M3:verify (default) on project surefire-its: There are test failures.
[2019-08-28T07:10:39.508Z]
[2019-08-28T07:10:39.508Z] Please refer to C:\Users\jenkins\AppData\Local\Temp\2\jenkins-maven-box-maven-surefire-maven2surefire-jvm-communication-7\surefire-its\target\failsafe-reports for the individual test results.
[2019-08-28T07:10:39.508Z] Please refer to dump files (if any exist) [date].dump, [date]-jvmRun[N].dump and [date].dumpstream.
[2019-08-28T07:10:39.508Z]     at org.apache.maven.lifecycle.internal.MojoExecutor.execute (MojoExecutor.java:215)
[2019-08-28T07:10:39.508Z]     at org.apache.maven.lifecycle.internal.MojoExecutor.execute (MojoExecutor.java:156)
[2019-08-28T07:10:39.508Z]     at org.apache.maven.lifecycle.internal.MojoExecutor.execute (MojoExecutor.java:148)
[2019-08-28T07:10:39.508Z]     at org.apache.maven.lifecycle.internal.LifecycleModuleBuilder.buildProject (LifecycleModuleBuilder.java:117)
[2019-08-28T07:10:39.508Z]     at org.apache.maven.lifecycle.internal.LifecycleModuleBuilder.buildProject (LifecycleModuleBuilder.java:81)
[2019-08-28T07:10:39.508Z]     at org.apache.maven.lifecycle.internal.builder.singlethreaded.SingleThreadedBuilder.build (SingleThreadedBuilder.java:56)
[2019-08-28T07:10:39.508Z]     at org.apache.maven.lifecycle.internal.LifecycleStarter.execute (LifecycleStarter.java:128)
[2019-08-28T07:10:39.508Z]     at org.apache.maven.DefaultMaven.doExecute (DefaultMaven.java:305)
[2019-08-28T07:10:39.508Z]     at org.apache.maven.DefaultMaven.doExecute (DefaultMaven.java:192)
[2019-08-28T07:10:39.508Z]     at org.apache.maven.DefaultMaven.execute (DefaultMaven.java:105)
[2019-08-28T07:10:39.508Z]     at org.apache.maven.cli.MavenCli.execute (MavenCli.java:956)
[2019-08-28T07:10:39.508Z]     at org.apache.maven.cli.MavenCli.doMain (MavenCli.java:288)
[2019-08-28T07:10:39.508Z]     at org.apache.maven.cli.MavenCli.main (MavenCli.java:192)
[2019-08-28T07:10:39.508Z]     at sun.reflect.NativeMethodAccessorImpl.invoke0 (Native Method)
[2019-08-28T07:10:39.508Z]     at sun.reflect.NativeMethodAccessorImpl.invoke (NativeMethodAccessorImpl.java:62)
[2019-08-28T07:10:39.508Z]     at sun.reflect.DelegatingMethodAccessorImpl.invoke (DelegatingMethodAccessorImpl.java:43)
[2019-08-28T07:10:39.508Z]     at java.lang.reflect.Method.invoke (Method.java:498)
[2019-08-28T07:10:39.508Z]     at org.codehaus.plexus.classworlds.launcher.Launcher.launchEnhanced (Launcher.java:289)
[2019-08-28T07:10:39.508Z]     at org.codehaus.plexus.classworlds.launcher.Launcher.launch (Launcher.java:229)
[2019-08-28T07:10:39.508Z]     at org.codehaus.plexus.classworlds.launcher.Launcher.mainWithExitCode (Launcher.java:415)
[2019-08-28T07:10:39.508Z]     at org.codehaus.plexus.classworlds.launcher.Launcher.main (Launcher.java:356)
[2019-08-28T07:10:39.508Z] Caused by: org.apache.maven.plugin.MojoFailureException: There are test failures.
[2019-08-28T07:10:39.508Z]
[2019-08-28T07:10:39.509Z] Please refer to C:\Users\jenkins\AppData\Local\Temp\2\jenkins-maven-box-maven-surefire-maven2surefire-jvm-communication-7\surefire-its\target\failsafe-reports for the individual test results.
[2019-08-28T07:10:39.509Z] Please refer to dump files (if any exist) [date].dump, [date]-jvmRun[N].dump and [date].dumpstream.
[2019-08-28T07:10:39.509Z]     at org.apache.maven.plugin.surefire.SurefireHelper.throwException (SurefireHelper.java:271)
[2019-08-28T07:10:39.509Z]     at org.apache.maven.plugin.surefire.SurefireHelper.reportExecution (SurefireHelper.java:159)
[2019-08-28T07:10:39.509Z]     at org.apache.maven.plugin.failsafe.VerifyMojo.execute (VerifyMojo.java:192)
[2019-08-28T07:10:39.509Z]     at org.apache.maven.plugin.DefaultBuildPluginManager.executeMojo (DefaultBuildPluginManager.java:137)
[2019-08-28T07:10:39.509Z]     at org.apache.maven.lifecycle.internal.MojoExecutor.execute (MojoExecutor.java:210)
[2019-08-28T07:10:39.509Z]     at org.apache.maven.lifecycle.internal.MojoExecutor.execute (MojoExecutor.java:156)
[2019-08-28T07:10:39.509Z]     at org.apache.maven.lifecycle.internal.MojoExecutor.execute (MojoExecutor.java:148)
[2019-08-28T07:10:39.509Z]     at org.apache.maven.lifecycle.internal.LifecycleModuleBuilder.buildProject (LifecycleModuleBuilder.java:117)
[2019-08-28T07:10:39.509Z]     at org.apache.maven.lifecycle.internal.LifecycleModuleBuilder.buildProject (LifecycleModuleBuilder.java:81)
[2019-08-28T07:10:39.509Z]     at org.apache.maven.lifecycle.internal.builder.singlethreaded.SingleThreadedBuilder.build (SingleThreadedBuilder.java:56)
[2019-08-28T07:10:39.509Z]     at org.apache.maven.lifecycle.internal.LifecycleStarter.execute (LifecycleStarter.java:128)
[2019-08-28T07:10:39.509Z]     at org.apache.maven.DefaultMaven.doExecute (DefaultMaven.java:305)
[2019-08-28T07:10:39.509Z]     at org.apache.maven.DefaultMaven.doExecute (DefaultMaven.java:192)
[2019-08-28T07:10:39.509Z]     at org.apache.maven.DefaultMaven.execute (DefaultMaven.java:105)
[2019-08-28T07:10:39.509Z]     at org.apache.maven.cli.MavenCli.execute (MavenCli.java:956)
[2019-08-28T07:10:39.509Z]     at org.apache.maven.cli.MavenCli.doMain (MavenCli.java:288)
[2019-08-28T07:10:39.509Z]     at org.apache.maven.cli.MavenCli.main (MavenCli.java:192)
[2019-08-28T07:10:39.509Z]     at sun.reflect.NativeMethodAccessorImpl.invoke0 (Native Method)
[2019-08-28T07:10:39.509Z]     at sun.reflect.NativeMethodAccessorImpl.invoke (NativeMethodAccessorImpl.java:62)
[2019-08-28T07:10:39.509Z]     at sun.reflect.DelegatingMethodAccessorImpl.invoke (DelegatingMethodAccessorImpl.java:43)
[2019-08-28T07:10:39.509Z]     at java.lang.reflect.Method.invoke (Method.java:498)
[2019-08-28T07:10:39.509Z]     at org.codehaus.plexus.classworlds.launcher.Launcher.launchEnhanced (Launcher.java:289)
[2019-08-28T07:10:39.509Z]     at org.codehaus.plexus.classworlds.launcher.Launcher.launch (Launcher.java:229)
[2019-08-28T07:10:39.509Z]     at org.codehaus.plexus.classworlds.launcher.Launcher.mainWithExitCode (Launcher.java:415)
[2019-08-28T07:10:39.509Z]     at org.codehaus.plexus.classworlds.launcher.Launcher.main (Launcher.java:356)
[2019-08-28T07:10:39.509Z] [ERROR]
[2019-08-28T07:10:39.509Z] [ERROR] Re-run Maven using the -X switch to enable full debug logging.
[2019-08-28T07:10:39.509Z] [ERROR]
[2019-08-28T07:10:39.509Z] [ERROR] For more information about the errors and possible solutions, please read the following articles:
[2019-08-28T07:10:39.509Z] [ERROR] [Help 1] http://cwiki.apache.org/confluence/display/MAVEN/MojoFailureException
[2019-08-28T07:10:39.509Z] [ERROR]
[2019-08-28T07:10:39.509Z] [ERROR] After correcting the problems, you can resume the build with the command
[2019-08-28T07:10:39.509Z] [ERROR]   mvn <goals> -rf :surefire-its
[Pipeline] }
[Pipeline] // withEnv
[Pipeline] }
[Pipeline] // stage
[Pipeline] fileExists
[Pipeline] zip
[2019-08-28T07:10:39.651Z] Writing zip file of C:\Users\jenkins\AppData\Local\Temp\2\jenkins-maven-box-maven-surefire-maven2surefire-jvm-communication-7\maven-failsafe-plugin\target\it to C:\Users\jenkins\AppData\Local\Temp\2\jenkins-maven-box-maven-surefire-maven2surefire-jvm-communication-7\maven-failsafe-plugin--windows-jdk8-maven3.6.x.zip
[2019-08-28T07:10:39.823Z] Zipped 78 entries.
[2019-08-28T07:10:39.823Z] Archiving C:\Users\jenkins\AppData\Local\Temp\2\jenkins-maven-box-maven-surefire-maven2surefire-jvm-communication-7\maven-failsafe-plugin--windows-jdk8-maven3.6.x.zip
[2019-08-28T07:10:39.824Z] [Fast Archiver] No artifacts from Maven TLP » maven-surefire » maven2surefire-jvm-communication #4 to compare, so performing full copy of artifacts
[Pipeline] fileExists
[Pipeline] zip
[2019-08-28T07:10:39.889Z] Writing zip file of C:\Users\jenkins\AppData\Local\Temp\2\jenkins-maven-box-maven-surefire-maven2surefire-jvm-communication-7\surefire-its\target to C:\Users\jenkins\AppData\Local\Temp\2\jenkins-maven-box-maven-surefire-maven2surefire-jvm-communication-7\surefire-its--windows-jdk8-maven3.6.x.zip
[2019-08-28T07:10:58.299Z] Zipped 16694 entries.
[2019-08-28T07:10:58.299Z] Archiving C:\Users\jenkins\AppData\Local\Temp\2\jenkins-maven-box-maven-surefire-maven2surefire-jvm-communication-7\surefire-its--windows-jdk8-maven3.6.x.zip
[2019-08-28T07:10:58.301Z] [Fast Archiver] No artifacts from Maven TLP » maven-surefire » maven2surefire-jvm-communication #4 to compare, so performing full copy of artifacts
[Pipeline] archiveArtifacts
[2019-08-28T07:10:59.699Z] Archiving artifacts
[2019-08-28T07:10:59.713Z] [Fast Archiver] No artifacts from Maven TLP » maven-surefire » maven2surefire-jvm-communication #4 to compare, so performing full copy of artifacts
[Pipeline] cleanWs
[2019-08-28T07:11:00.940Z] [WS-CLEANUP] Deleting project workspace...
[2019-08-28T07:11:00.940Z] [WS-CLEANUP] Deferred wipeout is used...
[2019-08-28T07:11:01.048Z] [WS-CLEANUP] done
[Pipeline] }
[Pipeline] // ws
[Pipeline] }
[Pipeline] // timestamps
[Pipeline] }
[Pipeline] // node
[Pipeline] }
[Pipeline] // parallel
[Pipeline] echo
Build result: FAILURE
[Pipeline] jiraIssueSelector
[Pipeline] echo
The authors of changes [].
[Pipeline] echo
Sending email ...
[Pipeline] emailext
Reply | Threaded
Open this post in threaded view
|

Build failed in Jenkins: Maven TLP » maven-surefire » maven2surefire-jvm-communication #8

Apache Jenkins Server-2
See https://builds.apache.org/job/maven-box/job/maven-surefire/job/maven2surefire-jvm-communication/8/

Changes:

* proposed abstraction for Enrico's implementation
* proposed abstraction for Enrico's implementation
* proposed abstraction for Enrico's implementation
* proposed abstraction for Enrico's implementation
* proposed abstraction for Enrico's implementation

All tests passed

Build log:
[...truncated 38893 lines...]
[2019-08-29T17:44:19.762Z] [INFO] -------------------------------------------------------
[2019-08-29T17:44:19.762Z] [INFO]  T E S T S
[2019-08-29T17:44:19.762Z] [INFO] -------------------------------------------------------
[2019-08-29T17:44:20.474Z] [INFO] Running org.apache.maven.surefire.junit4.JUnit4SuiteTest
[2019-08-29T17:44:20.474Z] [INFO] Tests run: 2, Failures: 0, Errors: 0, Skipped: 0, Time elapsed: 0.073 s - in org.apache.maven.surefire.junit4.JUnit4SuiteTest
[2019-08-29T17:44:20.474Z] [INFO]
[2019-08-29T17:44:20.474Z] [INFO] Results:
[2019-08-29T17:44:20.474Z] [INFO]
[2019-08-29T17:44:20.474Z] [INFO] Tests run: 2, Failures: 0, Errors: 0, Skipped: 0
[2019-08-29T17:44:20.474Z] [INFO]
[2019-08-29T17:44:20.474Z] [INFO]
[2019-08-29T17:44:20.474Z] [INFO] --- maven-jar-plugin:3.1.0:jar (default-jar) @ surefire-junit4 ---
[2019-08-29T17:44:20.474Z] [INFO] Building jar: /home/jenkins/jenkins-slave/workspace/maven2surefire-jvm-communication@2/surefire-providers/surefire-junit4/target/surefire-junit4-3.0.0-SNAPSHOT.jar
[2019-08-29T17:44:20.474Z] [INFO]
[2019-08-29T17:44:20.474Z] [INFO] --- maven-site-plugin:3.8.2:attach-descriptor (attach-descriptor) @ surefire-junit4 ---
[2019-08-29T17:44:20.474Z] [INFO] Skipping because packaging 'jar' is not pom.
[2019-08-29T17:44:20.474Z] [INFO]
[2019-08-29T17:44:20.474Z] [INFO] --- maven-checkstyle-plugin:3.0.0:check (checkstyle-check) @ surefire-junit4 ---
[2019-08-29T17:44:21.187Z] [INFO]
[2019-08-29T17:44:21.187Z] [INFO] --- maven-install-plugin:2.5.2:install (default-install) @ surefire-junit4 ---
[2019-08-29T17:44:21.187Z] [INFO] Installing /home/jenkins/jenkins-slave/workspace/maven2surefire-jvm-communication@2/surefire-providers/surefire-junit4/target/surefire-junit4-3.0.0-SNAPSHOT.jar to /home/jenkins/jenkins-slave/workspace/maven2surefire-jvm-communication@2/.m2/org/apache/maven/surefire/surefire-junit4/3.0.0-SNAPSHOT/surefire-junit4-3.0.0-SNAPSHOT.jar
[2019-08-29T17:44:21.187Z] [INFO] Installing /home/jenkins/jenkins-slave/workspace/maven2surefire-jvm-communication@2/surefire-providers/surefire-junit4/pom.xml to /home/jenkins/jenkins-slave/workspace/maven2surefire-jvm-communication@2/.m2/org/apache/maven/surefire/surefire-junit4/3.0.0-SNAPSHOT/surefire-junit4-3.0.0-SNAPSHOT.pom
[2019-08-29T17:44:21.187Z] [INFO]
[2019-08-29T17:44:21.187Z] [INFO] ----------< org.apache.maven.surefire:maven-surefire-common >-----------
[2019-08-29T17:44:21.187Z] [INFO] Building Maven Surefire Common 3.0.0-SNAPSHOT                    [15/25]
[2019-08-29T17:44:21.187Z] [INFO] --------------------------------[ jar ]---------------------------------
[2019-08-29T17:44:21.187Z] [INFO] Downloading from central: https://repo.maven.apache.org/maven2/org/apache/maven/shared/maven-common-artifact-filters/3.1.0/maven-common-artifact-filters-3.1.0.pom
[2019-08-29T17:44:21.187Z] [INFO] Downloaded from central: https://repo.maven.apache.org/maven2/org/apache/maven/shared/maven-common-artifact-filters/3.1.0/maven-common-artifact-filters-3.1.0.pom (5.3 kB at 352 kB/s)
[2019-08-29T17:44:21.187Z] [INFO] Downloading from central: https://repo.maven.apache.org/maven2/org/apache/maven/shared/maven-shared-components/33/maven-shared-components-33.pom
[2019-08-29T17:44:21.187Z] [INFO] Downloaded from central: https://repo.maven.apache.org/maven2/org/apache/maven/shared/maven-shared-components/33/maven-shared-components-33.pom (5.1 kB at 463 kB/s)
[2019-08-29T17:44:21.187Z] [INFO] Downloading from central: https://repo.maven.apache.org/maven2/org/apache/maven/shared/maven-artifact-transfer/0.11.0/maven-artifact-transfer-0.11.0.pom
[2019-08-29T17:44:21.187Z] [INFO] Downloaded from central: https://repo.maven.apache.org/maven2/org/apache/maven/shared/maven-artifact-transfer/0.11.0/maven-artifact-transfer-0.11.0.pom (11 kB at 881 kB/s)
[2019-08-29T17:44:21.187Z] [INFO] Downloading from central: https://repo.maven.apache.org/maven2/org/codehaus/plexus/plexus-java/1.0.3/plexus-java-1.0.3.pom
[2019-08-29T17:44:21.187Z] [INFO] Downloaded from central: https://repo.maven.apache.org/maven2/org/codehaus/plexus/plexus-java/1.0.3/plexus-java-1.0.3.pom (4.8 kB at 367 kB/s)
[2019-08-29T17:44:21.187Z] [INFO] Downloading from central: https://repo.maven.apache.org/maven2/org/codehaus/plexus/plexus-languages/1.0.3/plexus-languages-1.0.3.pom
[2019-08-29T17:44:21.187Z] [INFO] Downloaded from central: https://repo.maven.apache.org/maven2/org/codehaus/plexus/plexus-languages/1.0.3/plexus-languages-1.0.3.pom (4.2 kB at 352 kB/s)
[2019-08-29T17:44:21.187Z] [INFO] Downloading from central: https://repo.maven.apache.org/maven2/org/ow2/asm/asm/7.0/asm-7.0.pom
[2019-08-29T17:44:21.187Z] [INFO] Downloaded from central: https://repo.maven.apache.org/maven2/org/ow2/asm/asm/7.0/asm-7.0.pom (2.9 kB at 267 kB/s)
[2019-08-29T17:44:21.187Z] [INFO] Downloading from central: https://repo.maven.apache.org/maven2/org/fusesource/jansi/jansi/1.13/jansi-1.13.pom
[2019-08-29T17:44:21.187Z] [INFO] Downloaded from central: https://repo.maven.apache.org/maven2/org/fusesource/jansi/jansi/1.13/jansi-1.13.pom (3.7 kB at 286 kB/s)
[2019-08-29T17:44:21.187Z] [INFO] Downloading from central: https://repo.maven.apache.org/maven2/org/fusesource/jansi/jansi-project/1.13/jansi-project-1.13.pom
[2019-08-29T17:44:21.187Z] [INFO] Downloaded from central: https://repo.maven.apache.org/maven2/org/fusesource/jansi/jansi-project/1.13/jansi-project-1.13.pom (12 kB at 909 kB/s)
[2019-08-29T17:44:21.187Z] [INFO] Downloading from central: https://repo.maven.apache.org/maven2/org/fusesource/fusesource-pom/1.11/fusesource-pom-1.11.pom
[2019-08-29T17:44:21.187Z] [INFO] Downloaded from central: https://repo.maven.apache.org/maven2/org/fusesource/fusesource-pom/1.11/fusesource-pom-1.11.pom (15 kB at 1.1 MB/s)
[2019-08-29T17:44:21.187Z] [INFO] Downloading from central: https://repo.maven.apache.org/maven2/org/apache/maven/shared/maven-common-artifact-filters/3.1.0/maven-common-artifact-filters-3.1.0.jar
[2019-08-29T17:44:21.187Z] [INFO] Downloading from central: https://repo.maven.apache.org/maven2/org/apache/maven/shared/maven-artifact-transfer/0.11.0/maven-artifact-transfer-0.11.0.jar
[2019-08-29T17:44:21.187Z] [INFO] Downloading from central: https://repo.maven.apache.org/maven2/org/fusesource/jansi/jansi/1.13/jansi-1.13.jar
[2019-08-29T17:44:21.187Z] [INFO] Downloading from central: https://repo.maven.apache.org/maven2/org/ow2/asm/asm/7.0/asm-7.0.jar
[2019-08-29T17:44:21.187Z] [INFO] Downloading from central: https://repo.maven.apache.org/maven2/org/codehaus/plexus/plexus-java/1.0.3/plexus-java-1.0.3.jar
[2019-08-29T17:44:21.187Z] [INFO] Downloaded from central: https://repo.maven.apache.org/maven2/org/apache/maven/shared/maven-common-artifact-filters/3.1.0/maven-common-artifact-filters-3.1.0.jar (61 kB at 2.9 MB/s)
[2019-08-29T17:44:21.187Z] [INFO] Downloaded from central: https://repo.maven.apache.org/maven2/org/codehaus/plexus/plexus-java/1.0.3/plexus-java-1.0.3.jar (51 kB at 2.6 MB/s)
[2019-08-29T17:44:21.187Z] [INFO] Downloaded from central: https://repo.maven.apache.org/maven2/org/ow2/asm/asm/7.0/asm-7.0.jar (114 kB at 4.9 MB/s)
[2019-08-29T17:44:21.187Z] [INFO] Downloaded from central: https://repo.maven.apache.org/maven2/org/apache/maven/shared/maven-artifact-transfer/0.11.0/maven-artifact-transfer-0.11.0.jar (128 kB at 4.9 MB/s)
[2019-08-29T17:44:21.187Z] [INFO] Downloaded from central: https://repo.maven.apache.org/maven2/org/fusesource/jansi/jansi/1.13/jansi-1.13.jar (152 kB at 5.4 MB/s)
[2019-08-29T17:44:21.187Z] [INFO]
[2019-08-29T17:44:21.187Z] [INFO] --- maven-clean-plugin:3.1.0:clean (default-clean) @ maven-surefire-common ---
[2019-08-29T17:44:21.187Z] [INFO]
[2019-08-29T17:44:21.187Z] [INFO] --- maven-enforcer-plugin:3.0.0-M2:enforce (enforce-maven-version) @ maven-surefire-common ---
[2019-08-29T17:44:21.187Z] [INFO]
[2019-08-29T17:44:21.187Z] [INFO] --- maven-enforcer-plugin:3.0.0-M2:enforce (enforce-bytecode-version) @ maven-surefire-common ---
[2019-08-29T17:44:21.900Z] [WARNING] Invalid bytecodeVersion for module-info.class: expected 51, but was 53
[2019-08-29T17:44:21.900Z] [INFO]
[2019-08-29T17:44:21.900Z] [INFO] --- maven-enforcer-plugin:3.0.0-M2:enforce (ban-known-bad-maven-versions) @ maven-surefire-common ---
[2019-08-29T17:44:21.900Z] [INFO]
[2019-08-29T17:44:21.900Z] [INFO] --- maven-enforcer-plugin:3.0.0-M2:enforce (enforce-java) @ maven-surefire-common ---
[2019-08-29T17:44:21.900Z] [INFO]
[2019-08-29T17:44:21.900Z] [INFO] --- maven-enforcer-plugin:3.0.0-M2:enforce (enforce-maven) @ maven-surefire-common ---
[2019-08-29T17:44:21.900Z] [INFO]
[2019-08-29T17:44:21.900Z] [INFO] --- apache-rat-plugin:0.12:check (rat-check) @ maven-surefire-common ---
[2019-08-29T17:44:21.900Z] [INFO] Enabled default license matchers.
[2019-08-29T17:44:21.900Z] [INFO] Will parse SCM ignores for exclusions...
[2019-08-29T17:44:21.900Z] [INFO] Finished adding exclusions from SCM ignore files.
[2019-08-29T17:44:21.900Z] [INFO] 61 implicit excludes (use -debug for more details).
[2019-08-29T17:44:21.900Z] [INFO] Exclude: .repository/**
[2019-08-29T17:44:21.900Z] [INFO] Exclude: .maven/spy.log
[2019-08-29T17:44:21.900Z] [INFO] Exclude: dependency-reduced-pom.xml
[2019-08-29T17:44:21.900Z] [INFO] Exclude: .java-version
[2019-08-29T17:44:21.900Z] [INFO] Exclude: Jenkinsfile
[2019-08-29T17:44:21.900Z] [INFO] Exclude: README.md
[2019-08-29T17:44:21.900Z] [INFO] Exclude: .gitignore
[2019-08-29T17:44:21.900Z] [INFO] Exclude: .git/**/*
[2019-08-29T17:44:21.900Z] [INFO] Exclude: **/.idea
[2019-08-29T17:44:21.900Z] [INFO] Exclude: **/.svn/**/*
[2019-08-29T17:44:21.900Z] [INFO] Exclude: **/*.iml
[2019-08-29T17:44:21.900Z] [INFO] Exclude: **/*.ipr
[2019-08-29T17:44:21.900Z] [INFO] Exclude: **/*.iws
[2019-08-29T17:44:21.900Z] [INFO] Exclude: **/*.versionsBackup
[2019-08-29T17:44:21.900Z] [INFO] Exclude: **/dependency-reduced-pom.xml
[2019-08-29T17:44:21.900Z] [INFO] Exclude: .repository/**
[2019-08-29T17:44:21.900Z] [INFO] Exclude: src/test/resources/**/*
[2019-08-29T17:44:21.900Z] [INFO] Exclude: src/test/resources/**/*.css
[2019-08-29T17:44:21.900Z] [INFO] Exclude: **/*.jj
[2019-08-29T17:44:21.900Z] [INFO] Exclude: src/main/resources/META-INF/services/org.apache.maven.surefire.providerapi.SurefireProvider
[2019-08-29T17:44:21.900Z] [INFO] Exclude: DEPENDENCIES
[2019-08-29T17:44:21.900Z] [INFO] Exclude: .m2/**
[2019-08-29T17:44:21.900Z] [INFO] Exclude: .m2
[2019-08-29T17:44:21.900Z] [INFO] Exclude: .travis.yml
[2019-08-29T17:44:21.900Z] [INFO] 143 resources included (use -debug for more details)
[2019-08-29T17:44:21.900Z] [INFO] Rat check: Summary over all files. Unapproved: 0, unknown: 0, generated: 0, approved: 143 licenses.
[2019-08-29T17:44:21.900Z] [INFO]
[2019-08-29T17:44:21.900Z] [INFO] --- maven-compiler-plugin:3.7.0:compile (compile-generated) @ maven-surefire-common ---
[2019-08-29T17:44:21.900Z] [INFO] Nothing to compile - all classes are up to date
[2019-08-29T17:44:21.900Z] [INFO]
[2019-08-29T17:44:21.901Z] [INFO] --- maven-remote-resources-plugin:1.5:process (process-resource-bundles) @ maven-surefire-common ---
[2019-08-29T17:44:22.614Z] [INFO]
[2019-08-29T17:44:22.614Z] [INFO] --- maven-resources-plugin:3.1.0:resources (default-resources) @ maven-surefire-common ---
[2019-08-29T17:44:22.614Z] [INFO] Using 'UTF-8' encoding to copy filtered resources.
[2019-08-29T17:44:22.614Z] [INFO] skip non existing resourceDirectory /home/jenkins/jenkins-slave/workspace/maven2surefire-jvm-communication@2/maven-surefire-common/src/main/resources
[2019-08-29T17:44:22.614Z] [INFO] Copying 3 resources
[2019-08-29T17:44:22.614Z] [INFO]
[2019-08-29T17:44:22.614Z] [INFO] --- maven-compiler-plugin:3.7.0:compile (default-compile) @ maven-surefire-common ---
[2019-08-29T17:44:22.614Z] [INFO] Changes detected - recompiling the module!
[2019-08-29T17:44:22.614Z] [INFO] Compiling 92 source files to /home/jenkins/jenkins-slave/workspace/maven2surefire-jvm-communication@2/maven-surefire-common/target/classes
[2019-08-29T17:44:25.812Z] [INFO] -------------------------------------------------------------
[2019-08-29T17:44:25.812Z] [ERROR] COMPILATION ERROR :
[2019-08-29T17:44:25.812Z] [INFO] -------------------------------------------------------------
[2019-08-29T17:44:25.812Z] [ERROR] /home/jenkins/jenkins-slave/workspace/maven2surefire-jvm-communication@2/maven-surefire-common/src/main/java/org/apache/maven/plugin/surefire/booterclient/lazytestprovider/DefaultCommandReader.java:[78,4] error: method does not override or implement a method from a supertype
[2019-08-29T17:44:25.812Z] [ERROR] /home/jenkins/jenkins-slave/workspace/maven2surefire-jvm-communication@2/maven-surefire-common/src/main/java/org/apache/maven/plugin/surefire/booterclient/lazytestprovider/TestLessInputStream.java:[47,13] error: TestLessInputStream is not abstract and does not override abstract method readNextCommand() in AbstractCommandReader
[2019-08-29T17:44:25.812Z] [ERROR] /home/jenkins/jenkins-slave/workspace/maven2surefire-jvm-communication@2/maven-surefire-common/src/main/java/org/apache/maven/plugin/surefire/booterclient/ForkStarter.java:[620,52] error: cannot find symbol
[2019-08-29T17:44:25.812Z]   symbol:   variable stdOut
[2019-08-29T17:44:25.812Z]   location: class ForkStarter
[2019-08-29T17:44:25.812Z] [ERROR] /home/jenkins/jenkins-slave/workspace/maven2surefire-jvm-communication@2/maven-surefire-common/src/main/java/org/apache/maven/plugin/surefire/booterclient/lazytestprovider/TestProvidingInputStream.java:[53,13] error: TestProvidingInputStream is not abstract and does not override abstract method readNextCommand() in AbstractCommandReader
[2019-08-29T17:44:25.812Z] [INFO] 4 errors
[2019-08-29T17:44:25.812Z] [INFO] -------------------------------------------------------------
[2019-08-29T17:44:25.812Z] [INFO] ------------------------------------------------------------------------
[2019-08-29T17:44:25.812Z] [INFO] Reactor Summary for Apache Maven Surefire 3.0.0-SNAPSHOT:
[2019-08-29T17:44:25.812Z] [INFO]
[2019-08-29T17:44:25.812Z] [INFO] Apache Maven Surefire .............................. SUCCESS [ 15.109 s]
[2019-08-29T17:44:25.812Z] [INFO] SureFire Logger API ................................ SUCCESS [  8.800 s]
[2019-08-29T17:44:25.812Z] [INFO] SureFire API ....................................... SUCCESS [  7.464 s]
[2019-08-29T17:44:25.812Z] [INFO] Surefire Extensions API ............................ SUCCESS [  1.767 s]
[2019-08-29T17:44:25.812Z] [INFO] Surefire Extensions SPI ............................ SUCCESS [  1.578 s]
[2019-08-29T17:44:25.812Z] [INFO] SureFire Booter .................................... SUCCESS [ 11.612 s]
[2019-08-29T17:44:25.812Z] [INFO] Maven Surefire Test-Grouping Support ............... SUCCESS [  4.354 s]
[2019-08-29T17:44:25.812Z] [INFO] SureFire Providers ................................. SUCCESS [  0.780 s]
[2019-08-29T17:44:25.812Z] [INFO] Shared JUnit3 Provider Code ........................ SUCCESS [  2.832 s]
[2019-08-29T17:44:25.812Z] [INFO] Shared Java 5 Provider Base ........................ SUCCESS [  3.406 s]
[2019-08-29T17:44:25.812Z] [INFO] Shared JUnit4 Provider Code ........................ SUCCESS [  3.598 s]
[2019-08-29T17:44:25.812Z] [INFO] Shared JUnit48 Provider Code ....................... SUCCESS [  4.110 s]
[2019-08-29T17:44:25.812Z] [INFO] SureFire JUnit Runner .............................. SUCCESS [  2.924 s]
[2019-08-29T17:44:25.812Z] [INFO] SureFire JUnit4 Runner ............................. SUCCESS [  3.245 s]
[2019-08-29T17:44:25.812Z] [INFO] Maven Surefire Common .............................. FAILURE [  4.340 s]
[2019-08-29T17:44:25.812Z] [INFO] SureFire JUnitCore Runner .......................... SKIPPED
[2019-08-29T17:44:25.812Z] [INFO] SureFire JUnit Platform Runner ..................... SKIPPED
[2019-08-29T17:44:25.812Z] [INFO] SureFire TestNG Utils .............................. SKIPPED
[2019-08-29T17:44:25.812Z] [INFO] SureFire TestNG Runner ............................. SKIPPED
[2019-08-29T17:44:25.812Z] [INFO] ShadeFire JUnit3 Provider .......................... SKIPPED
[2019-08-29T17:44:25.812Z] [INFO] Surefire Report Parser ............................. SKIPPED
[2019-08-29T17:44:25.812Z] [INFO] Maven Surefire Plugin .............................. SKIPPED
[2019-08-29T17:44:25.812Z] [INFO] Maven Failsafe Plugin .............................. SKIPPED
[2019-08-29T17:44:25.812Z] [INFO] Maven Surefire Report Plugin ....................... SKIPPED
[2019-08-29T17:44:25.812Z] [INFO] Maven Surefire Integration Tests ................... SKIPPED
[2019-08-29T17:44:25.812Z] [INFO] ------------------------------------------------------------------------
[2019-08-29T17:44:25.812Z] [INFO] BUILD FAILURE
[2019-08-29T17:44:25.812Z] [INFO] ------------------------------------------------------------------------
[2019-08-29T17:44:25.812Z] [INFO] Total time:  01:17 min
[2019-08-29T17:44:25.812Z] [INFO] Finished at: 2019-08-29T17:44:24Z
[2019-08-29T17:44:25.812Z] [INFO] ------------------------------------------------------------------------
[2019-08-29T17:44:25.812Z] [ERROR] Failed to execute goal org.apache.maven.plugins:maven-compiler-plugin:3.7.0:compile (default-compile) on project maven-surefire-common: Compilation failure: Compilation failure:
[2019-08-29T17:44:25.812Z] [ERROR] /home/jenkins/jenkins-slave/workspace/maven2surefire-jvm-communication@2/maven-surefire-common/src/main/java/org/apache/maven/plugin/surefire/booterclient/lazytestprovider/DefaultCommandReader.java:[78,4] error: method does not override or implement a method from a supertype
[2019-08-29T17:44:25.812Z] [ERROR] /home/jenkins/jenkins-slave/workspace/maven2surefire-jvm-communication@2/maven-surefire-common/src/main/java/org/apache/maven/plugin/surefire/booterclient/lazytestprovider/TestLessInputStream.java:[47,13] error: TestLessInputStream is not abstract and does not override abstract method readNextCommand() in AbstractCommandReader
[2019-08-29T17:44:25.812Z] [ERROR] /home/jenkins/jenkins-slave/workspace/maven2surefire-jvm-communication@2/maven-surefire-common/src/main/java/org/apache/maven/plugin/surefire/booterclient/ForkStarter.java:[620,52] error: cannot find symbol
[2019-08-29T17:44:25.812Z] [ERROR]   symbol:   variable stdOut
[2019-08-29T17:44:25.812Z] [ERROR]   location: class ForkStarter
[2019-08-29T17:44:25.812Z] [ERROR] /home/jenkins/jenkins-slave/workspace/maven2surefire-jvm-communication@2/maven-surefire-common/src/main/java/org/apache/maven/plugin/surefire/booterclient/lazytestprovider/TestProvidingInputStream.java:[53,13] error: TestProvidingInputStream is not abstract and does not override abstract method readNextCommand() in AbstractCommandReader
[2019-08-29T17:44:25.812Z] [ERROR] -> [Help 1]
[2019-08-29T17:44:25.813Z] org.apache.maven.lifecycle.LifecycleExecutionException: Failed to execute goal org.apache.maven.plugins:maven-compiler-plugin:3.7.0:compile (default-compile) on project maven-surefire-common: Compilation failure
[2019-08-29T17:44:25.813Z]     at org.apache.maven.lifecycle.internal.MojoExecutor.execute (MojoExecutor.java:215)
[2019-08-29T17:44:25.813Z]     at org.apache.maven.lifecycle.internal.MojoExecutor.execute (MojoExecutor.java:156)
[2019-08-29T17:44:25.813Z]     at org.apache.maven.lifecycle.internal.MojoExecutor.execute (MojoExecutor.java:148)
[2019-08-29T17:44:25.813Z]     at org.apache.maven.lifecycle.internal.LifecycleModuleBuilder.buildProject (LifecycleModuleBuilder.java:117)
[2019-08-29T17:44:25.813Z]     at org.apache.maven.lifecycle.internal.LifecycleModuleBuilder.buildProject (LifecycleModuleBuilder.java:81)
[2019-08-29T17:44:25.813Z]     at org.apache.maven.lifecycle.internal.builder.singlethreaded.SingleThreadedBuilder.build (SingleThreadedBuilder.java:56)
[2019-08-29T17:44:25.813Z]     at org.apache.maven.lifecycle.internal.LifecycleStarter.execute (LifecycleStarter.java:128)
[2019-08-29T17:44:25.813Z]     at org.apache.maven.DefaultMaven.doExecute (DefaultMaven.java:305)
[2019-08-29T17:44:25.813Z]     at org.apache.maven.DefaultMaven.doExecute (DefaultMaven.java:192)
[2019-08-29T17:44:25.813Z]     at org.apache.maven.DefaultMaven.execute (DefaultMaven.java:105)
[2019-08-29T17:44:25.813Z]     at org.apache.maven.cli.MavenCli.execute (MavenCli.java:956)
[2019-08-29T17:44:25.813Z]     at org.apache.maven.cli.MavenCli.doMain (MavenCli.java:288)
[2019-08-29T17:44:25.813Z]     at org.apache.maven.cli.MavenCli.main (MavenCli.java:192)
[2019-08-29T17:44:25.813Z]     at sun.reflect.NativeMethodAccessorImpl.invoke0 (Native Method)
[2019-08-29T17:44:25.813Z]     at sun.reflect.NativeMethodAccessorImpl.invoke (NativeMethodAccessorImpl.java:62)
[2019-08-29T17:44:25.813Z]     at sun.reflect.DelegatingMethodAccessorImpl.invoke (DelegatingMethodAccessorImpl.java:43)
[2019-08-29T17:44:25.813Z]     at java.lang.reflect.Method.invoke (Method.java:498)
[2019-08-29T17:44:25.813Z]     at org.codehaus.plexus.classworlds.launcher.Launcher.launchEnhanced (Launcher.java:289)
[2019-08-29T17:44:25.813Z]     at org.codehaus.plexus.classworlds.launcher.Launcher.launch (Launcher.java:229)
[2019-08-29T17:44:25.813Z]     at org.codehaus.plexus.classworlds.launcher.Launcher.mainWithExitCode (Launcher.java:415)
[2019-08-29T17:44:25.813Z]     at org.codehaus.plexus.classworlds.launcher.Launcher.main (Launcher.java:356)
[2019-08-29T17:44:25.813Z] Caused by: org.apache.maven.plugin.compiler.CompilationFailureException: Compilation failure
[2019-08-29T17:44:25.813Z]     at org.apache.maven.plugin.compiler.AbstractCompilerMojo.execute (AbstractCompilerMojo.java:1161)
[2019-08-29T17:44:25.813Z]     at org.apache.maven.plugin.compiler.CompilerMojo.execute (CompilerMojo.java:168)
[2019-08-29T17:44:25.813Z]     at org.apache.maven.plugin.DefaultBuildPluginManager.executeMojo (DefaultBuildPluginManager.java:137)
[2019-08-29T17:44:25.813Z]     at org.apache.maven.lifecycle.internal.MojoExecutor.execute (MojoExecutor.java:210)
[2019-08-29T17:44:25.813Z]     at org.apache.maven.lifecycle.internal.MojoExecutor.execute (MojoExecutor.java:156)
[2019-08-29T17:44:25.813Z]     at org.apache.maven.lifecycle.internal.MojoExecutor.execute (MojoExecutor.java:148)
[2019-08-29T17:44:25.813Z]     at org.apache.maven.lifecycle.internal.LifecycleModuleBuilder.buildProject (LifecycleModuleBuilder.java:117)
[2019-08-29T17:44:25.813Z]     at org.apache.maven.lifecycle.internal.LifecycleModuleBuilder.buildProject (LifecycleModuleBuilder.java:81)
[2019-08-29T17:44:25.813Z]     at org.apache.maven.lifecycle.internal.builder.singlethreaded.SingleThreadedBuilder.build (SingleThreadedBuilder.java:56)
[2019-08-29T17:44:25.813Z]     at org.apache.maven.lifecycle.internal.LifecycleStarter.execute (LifecycleStarter.java:128)
[2019-08-29T17:44:25.813Z]     at org.apache.maven.DefaultMaven.doExecute (DefaultMaven.java:305)
[2019-08-29T17:44:25.813Z]     at org.apache.maven.DefaultMaven.doExecute (DefaultMaven.java:192)
[2019-08-29T17:44:25.813Z]     at org.apache.maven.DefaultMaven.execute (DefaultMaven.java:105)
[2019-08-29T17:44:25.813Z]     at org.apache.maven.cli.MavenCli.execute (MavenCli.java:956)
[2019-08-29T17:44:25.813Z]     at org.apache.maven.cli.MavenCli.doMain (MavenCli.java:288)
[2019-08-29T17:44:25.813Z]     at org.apache.maven.cli.MavenCli.main (MavenCli.java:192)
[2019-08-29T17:44:25.813Z]     at sun.reflect.NativeMethodAccessorImpl.invoke0 (Native Method)
[2019-08-29T17:44:25.813Z]     at sun.reflect.NativeMethodAccessorImpl.invoke (NativeMethodAccessorImpl.java:62)
[2019-08-29T17:44:25.813Z]     at sun.reflect.DelegatingMethodAccessorImpl.invoke (DelegatingMethodAccessorImpl.java:43)
[2019-08-29T17:44:25.813Z]     at java.lang.reflect.Method.invoke (Method.java:498)
[2019-08-29T17:44:25.813Z]     at org.codehaus.plexus.classworlds.launcher.Launcher.launchEnhanced (Launcher.java:289)
[2019-08-29T17:44:25.813Z]     at org.codehaus.plexus.classworlds.launcher.Launcher.launch (Launcher.java:229)
[2019-08-29T17:44:25.813Z]     at org.codehaus.plexus.classworlds.launcher.Launcher.mainWithExitCode (Launcher.java:415)
[2019-08-29T17:44:25.813Z]     at org.codehaus.plexus.classworlds.launcher.Launcher.main (Launcher.java:356)
[2019-08-29T17:44:25.813Z] [ERROR]
[2019-08-29T17:44:25.813Z] [ERROR] Re-run Maven using the -X switch to enable full debug logging.
[2019-08-29T17:44:25.813Z] [ERROR]
[2019-08-29T17:44:25.813Z] [ERROR] For more information about the errors and possible solutions, please read the following articles:
[2019-08-29T17:44:25.813Z] [ERROR] [Help 1] http://cwiki.apache.org/confluence/display/MAVEN/MojoFailureException
[2019-08-29T17:44:25.813Z] [ERROR]
[2019-08-29T17:44:25.813Z] [ERROR] After correcting the problems, you can resume the build with the command
[2019-08-29T17:44:25.813Z] [ERROR]   mvn <goals> -rf :maven-surefire-common
[Pipeline] }
[Pipeline] // withEnv
[Pipeline] }
[Pipeline] // stage
[Pipeline] fileExists
[Pipeline] fileExists
[Pipeline] archiveArtifacts
[2019-08-29T17:44:26.713Z] Archiving artifacts
[Pipeline] cleanWs
[2019-08-29T17:44:27.199Z] [WS-CLEANUP] Deleting project workspace...
[2019-08-29T17:44:27.199Z] [WS-CLEANUP] Deferred wipeout is used...
[2019-08-29T17:44:27.558Z] [WS-CLEANUP] done
[Pipeline] }
[Pipeline] // ws
[Pipeline] }
[Pipeline] // timestamps
[Pipeline] }
[Pipeline] // node
[Pipeline] }
[Pipeline] // parallel
[Pipeline] echo
Build result: FAILURE
[Pipeline] jiraIssueSelector
[Pipeline] echo
The authors of changes [tibordigana].
[Pipeline] echo
Sending email ...
[Pipeline] emailext
Reply | Threaded
Open this post in threaded view
|

Build failed in Jenkins: Maven TLP » maven-surefire » maven2surefire-jvm-communication #9

Apache Jenkins Server-2
See https://builds.apache.org/job/maven-box/job/maven-surefire/job/maven2surefire-jvm-communication/9/

Changes:

* Log unique commits
* Other attempt due to 'Scripts not permitted to use staticMethod
* Revert "Log unique commits"

No tests ran.

Build log:
[...truncated 23758 lines...]
[2019-09-23T11:29:34.289Z] [INFO] -------------------------------------------------------
[2019-09-23T11:29:34.610Z] [INFO] Running org.apache.maven.surefire.junit4.JUnit4SuiteTest
[2019-09-23T11:29:34.919Z] [INFO] Tests run: 2, Failures: 0, Errors: 0, Skipped: 0, Time elapsed: 0.124 s - in org.apache.maven.surefire.junit4.JUnit4SuiteTest
[2019-09-23T11:29:35.256Z] [INFO]
[2019-09-23T11:29:35.256Z] [INFO] Results:
[2019-09-23T11:29:35.256Z] [INFO]
[2019-09-23T11:29:35.256Z] [INFO] Tests run: 2, Failures: 0, Errors: 0, Skipped: 0
[2019-09-23T11:29:35.256Z] [INFO]
[2019-09-23T11:29:35.256Z] [INFO]
[2019-09-23T11:29:35.256Z] [INFO] --- maven-jar-plugin:3.1.0:jar (default-jar) @ surefire-junit4 ---
[2019-09-23T11:29:35.256Z] [INFO] Building jar: C:\Users\jenkins\AppData\Local\Temp\3\jenkins-maven-box-maven-surefire-maven2surefire-jvm-communication-9\surefire-providers\surefire-junit4\target\surefire-junit4-3.0.0-SNAPSHOT.jar
[2019-09-23T11:29:35.565Z] [INFO]
[2019-09-23T11:29:35.565Z] [INFO] --- maven-site-plugin:3.8.2:attach-descriptor (attach-descriptor) @ surefire-junit4 ---
[2019-09-23T11:29:35.565Z] [INFO] Skipping because packaging 'jar' is not pom.
[2019-09-23T11:29:35.565Z] [INFO]
[2019-09-23T11:29:35.565Z] [INFO] --- maven-checkstyle-plugin:3.0.0:check (checkstyle-check) @ surefire-junit4 ---
[2019-09-23T11:29:36.183Z] [INFO]
[2019-09-23T11:29:36.183Z] [INFO] --- maven-install-plugin:2.5.2:install (default-install) @ surefire-junit4 ---
[2019-09-23T11:29:36.183Z] [INFO] Installing C:\Users\jenkins\AppData\Local\Temp\3\jenkins-maven-box-maven-surefire-maven2surefire-jvm-communication-9\surefire-providers\surefire-junit4\target\surefire-junit4-3.0.0-SNAPSHOT.jar to C:\Users\jenkins\AppData\Local\Temp\3\jenkins-maven-box-maven-surefire-maven2surefire-jvm-communication-9\.m2\org\apache\maven\surefire\surefire-junit4\3.0.0-SNAPSHOT\surefire-junit4-3.0.0-SNAPSHOT.jar
[2019-09-23T11:29:36.463Z] [INFO] Installing C:\Users\jenkins\AppData\Local\Temp\3\jenkins-maven-box-maven-surefire-maven2surefire-jvm-communication-9\surefire-providers\surefire-junit4\pom.xml to C:\Users\jenkins\AppData\Local\Temp\3\jenkins-maven-box-maven-surefire-maven2surefire-jvm-communication-9\.m2\org\apache\maven\surefire\surefire-junit4\3.0.0-SNAPSHOT\surefire-junit4-3.0.0-SNAPSHOT.pom
[2019-09-23T11:29:36.464Z] [INFO]
[2019-09-23T11:29:36.464Z] [INFO] ----------< org.apache.maven.surefire:maven-surefire-common >-----------
[2019-09-23T11:29:36.464Z] [INFO] Building Maven Surefire Common 3.0.0-SNAPSHOT                    [15/25]
[2019-09-23T11:29:36.464Z] [INFO] --------------------------------[ jar ]---------------------------------
[2019-09-23T11:29:36.464Z] [INFO] Downloading from central: https://repo.maven.apache.org/maven2/org/apache/maven/shared/maven-common-artifact-filters/3.1.0/maven-common-artifact-filters-3.1.0.pom
[2019-09-23T11:29:36.464Z] [INFO] Downloaded from central: https://repo.maven.apache.org/maven2/org/apache/maven/shared/maven-common-artifact-filters/3.1.0/maven-common-artifact-filters-3.1.0.pom (5.3 kB at 132 kB/s)
[2019-09-23T11:29:36.464Z] [INFO] Downloading from central: https://repo.maven.apache.org/maven2/org/apache/maven/shared/maven-shared-components/33/maven-shared-components-33.pom
[2019-09-23T11:29:36.464Z] [INFO] Downloaded from central: https://repo.maven.apache.org/maven2/org/apache/maven/shared/maven-shared-components/33/maven-shared-components-33.pom (5.1 kB at 119 kB/s)
[2019-09-23T11:29:36.464Z] [INFO] Downloading from central: https://repo.maven.apache.org/maven2/org/apache/maven/shared/maven-artifact-transfer/0.11.0/maven-artifact-transfer-0.11.0.pom
[2019-09-23T11:29:36.464Z] [INFO] Downloaded from central: https://repo.maven.apache.org/maven2/org/apache/maven/shared/maven-artifact-transfer/0.11.0/maven-artifact-transfer-0.11.0.pom (11 kB at 260 kB/s)
[2019-09-23T11:29:36.464Z] [INFO] Downloading from central: https://repo.maven.apache.org/maven2/org/codehaus/plexus/plexus-java/1.0.3/plexus-java-1.0.3.pom
[2019-09-23T11:29:36.743Z] [INFO] Downloaded from central: https://repo.maven.apache.org/maven2/org/codehaus/plexus/plexus-java/1.0.3/plexus-java-1.0.3.pom (4.8 kB at 113 kB/s)
[2019-09-23T11:29:36.743Z] [INFO] Downloading from central: https://repo.maven.apache.org/maven2/org/codehaus/plexus/plexus-languages/1.0.3/plexus-languages-1.0.3.pom
[2019-09-23T11:29:36.743Z] [INFO] Downloaded from central: https://repo.maven.apache.org/maven2/org/codehaus/plexus/plexus-languages/1.0.3/plexus-languages-1.0.3.pom (4.2 kB at 106 kB/s)
[2019-09-23T11:29:36.743Z] [INFO] Downloading from central: https://repo.maven.apache.org/maven2/org/ow2/asm/asm/7.0/asm-7.0.pom
[2019-09-23T11:29:36.743Z] [INFO] Downloaded from central: https://repo.maven.apache.org/maven2/org/ow2/asm/asm/7.0/asm-7.0.pom (2.9 kB at 82 kB/s)
[2019-09-23T11:29:37.022Z] [INFO] Downloading from central: https://repo.maven.apache.org/maven2/org/fusesource/jansi/jansi/1.13/jansi-1.13.pom
[2019-09-23T11:29:37.022Z] [INFO] Downloaded from central: https://repo.maven.apache.org/maven2/org/fusesource/jansi/jansi/1.13/jansi-1.13.pom (3.7 kB at 95 kB/s)
[2019-09-23T11:29:37.022Z] [INFO] Downloading from central: https://repo.maven.apache.org/maven2/org/fusesource/jansi/jansi-project/1.13/jansi-project-1.13.pom
[2019-09-23T11:29:37.023Z] [INFO] Downloaded from central: https://repo.maven.apache.org/maven2/org/fusesource/jansi/jansi-project/1.13/jansi-project-1.13.pom (12 kB at 319 kB/s)
[2019-09-23T11:29:37.023Z] [INFO] Downloading from central: https://repo.maven.apache.org/maven2/org/fusesource/fusesource-pom/1.11/fusesource-pom-1.11.pom
[2019-09-23T11:29:37.023Z] [INFO] Downloaded from central: https://repo.maven.apache.org/maven2/org/fusesource/fusesource-pom/1.11/fusesource-pom-1.11.pom (15 kB at 442 kB/s)
[2019-09-23T11:29:37.023Z] [INFO] Downloading from central: https://repo.maven.apache.org/maven2/org/apache/maven/shared/maven-common-artifact-filters/3.1.0/maven-common-artifact-filters-3.1.0.jar
[2019-09-23T11:29:37.023Z] [INFO] Downloading from central: https://repo.maven.apache.org/maven2/org/ow2/asm/asm/7.0/asm-7.0.jar
[2019-09-23T11:29:37.023Z] [INFO] Downloading from central: https://repo.maven.apache.org/maven2/org/fusesource/jansi/jansi/1.13/jansi-1.13.jar
[2019-09-23T11:29:37.023Z] [INFO] Downloading from central: https://repo.maven.apache.org/maven2/org/codehaus/plexus/plexus-java/1.0.3/plexus-java-1.0.3.jar
[2019-09-23T11:29:37.023Z] [INFO] Downloading from central: https://repo.maven.apache.org/maven2/org/apache/maven/shared/maven-artifact-transfer/0.11.0/maven-artifact-transfer-0.11.0.jar
[2019-09-23T11:29:37.023Z] [INFO] Downloaded from central: https://repo.maven.apache.org/maven2/org/codehaus/plexus/plexus-java/1.0.3/plexus-java-1.0.3.jar (51 kB at 1.3 MB/s)
[2019-09-23T11:29:37.315Z] [INFO] Downloaded from central: https://repo.maven.apache.org/maven2/org/apache/maven/shared/maven-common-artifact-filters/3.1.0/maven-common-artifact-filters-3.1.0.jar (61 kB at 385 kB/s)
[2019-09-23T11:29:37.315Z] [INFO] Downloaded from central: https://repo.maven.apache.org/maven2/org/fusesource/jansi/jansi/1.13/jansi-1.13.jar (152 kB at 915 kB/s)
[2019-09-23T11:29:37.315Z] [INFO] Downloaded from central: https://repo.maven.apache.org/maven2/org/ow2/asm/asm/7.0/asm-7.0.jar (114 kB at 499 kB/s)
[2019-09-23T11:29:37.315Z] [INFO] Downloaded from central: https://repo.maven.apache.org/maven2/org/apache/maven/shared/maven-artifact-transfer/0.11.0/maven-artifact-transfer-0.11.0.jar (128 kB at 540 kB/s)
[2019-09-23T11:29:37.315Z] [INFO]
[2019-09-23T11:29:37.315Z] [INFO] --- maven-clean-plugin:3.1.0:clean (default-clean) @ maven-surefire-common ---
[2019-09-23T11:29:37.315Z] [INFO]
[2019-09-23T11:29:37.315Z] [INFO] --- maven-enforcer-plugin:3.0.0-M2:enforce (enforce-maven-version) @ maven-surefire-common ---
[2019-09-23T11:29:37.315Z] [INFO]
[2019-09-23T11:29:37.315Z] [INFO] --- maven-enforcer-plugin:3.0.0-M2:enforce (enforce-bytecode-version) @ maven-surefire-common ---
[2019-09-23T11:29:38.227Z] [WARNING] Invalid bytecodeVersion for module-info.class: expected 51, but was 53
[2019-09-23T11:29:38.227Z] [INFO]
[2019-09-23T11:29:38.227Z] [INFO] --- maven-enforcer-plugin:3.0.0-M2:enforce (ban-known-bad-maven-versions) @ maven-surefire-common ---
[2019-09-23T11:29:38.227Z] [INFO]
[2019-09-23T11:29:38.227Z] [INFO] --- maven-enforcer-plugin:3.0.0-M2:enforce (enforce-java) @ maven-surefire-common ---
[2019-09-23T11:29:38.227Z] [INFO]
[2019-09-23T11:29:38.227Z] [INFO] --- maven-enforcer-plugin:3.0.0-M2:enforce (enforce-maven) @ maven-surefire-common ---
[2019-09-23T11:29:38.227Z] [INFO]
[2019-09-23T11:29:38.227Z] [INFO] --- apache-rat-plugin:0.12:check (rat-check) @ maven-surefire-common ---
[2019-09-23T11:29:38.227Z] [INFO] Enabled default license matchers.
[2019-09-23T11:29:38.227Z] [INFO] Will parse SCM ignores for exclusions...
[2019-09-23T11:29:38.227Z] [INFO] Finished adding exclusions from SCM ignore files.
[2019-09-23T11:29:38.227Z] [INFO] 61 implicit excludes (use -debug for more details).
[2019-09-23T11:29:38.227Z] [INFO] Exclude: .repository/**
[2019-09-23T11:29:38.227Z] [INFO] Exclude: .maven/spy.log
[2019-09-23T11:29:38.228Z] [INFO] Exclude: dependency-reduced-pom.xml
[2019-09-23T11:29:38.228Z] [INFO] Exclude: .java-version
[2019-09-23T11:29:38.228Z] [INFO] Exclude: Jenkinsfile
[2019-09-23T11:29:38.228Z] [INFO] Exclude: README.md
[2019-09-23T11:29:38.228Z] [INFO] Exclude: .gitignore
[2019-09-23T11:29:38.228Z] [INFO] Exclude: .git/**/*
[2019-09-23T11:29:38.228Z] [INFO] Exclude: **/.idea
[2019-09-23T11:29:38.228Z] [INFO] Exclude: **/.svn/**/*
[2019-09-23T11:29:38.228Z] [INFO] Exclude: **/*.iml
[2019-09-23T11:29:38.228Z] [INFO] Exclude: **/*.ipr
[2019-09-23T11:29:38.228Z] [INFO] Exclude: **/*.iws
[2019-09-23T11:29:38.228Z] [INFO] Exclude: **/*.versionsBackup
[2019-09-23T11:29:38.228Z] [INFO] Exclude: **/dependency-reduced-pom.xml
[2019-09-23T11:29:38.228Z] [INFO] Exclude: .repository/**
[2019-09-23T11:29:38.228Z] [INFO] Exclude: src/test/resources/**/*
[2019-09-23T11:29:38.228Z] [INFO] Exclude: src/test/resources/**/*.css
[2019-09-23T11:29:38.228Z] [INFO] Exclude: **/*.jj
[2019-09-23T11:29:38.228Z] [INFO] Exclude: src/main/resources/META-INF/services/org.apache.maven.surefire.providerapi.SurefireProvider
[2019-09-23T11:29:38.228Z] [INFO] Exclude: DEPENDENCIES
[2019-09-23T11:29:38.228Z] [INFO] Exclude: .m2/**
[2019-09-23T11:29:38.228Z] [INFO] Exclude: .m2
[2019-09-23T11:29:38.228Z] [INFO] Exclude: .travis.yml
[2019-09-23T11:29:38.228Z] [INFO] 143 resources included (use -debug for more details)
[2019-09-23T11:29:40.860Z] [INFO] Rat check: Summary over all files. Unapproved: 0, unknown: 0, generated: 0, approved: 143 licenses.
[2019-09-23T11:29:40.860Z] [INFO]
[2019-09-23T11:29:40.860Z] [INFO] --- maven-compiler-plugin:3.7.0:compile (compile-generated) @ maven-surefire-common ---
[2019-09-23T11:29:40.860Z] [INFO] Nothing to compile - all classes are up to date
[2019-09-23T11:29:40.860Z] [INFO]
[2019-09-23T11:29:40.860Z] [INFO] --- maven-remote-resources-plugin:1.5:process (process-resource-bundles) @ maven-surefire-common ---
[2019-09-23T11:29:41.481Z] [INFO]
[2019-09-23T11:29:41.481Z] [INFO] --- maven-resources-plugin:3.1.0:resources (default-resources) @ maven-surefire-common ---
[2019-09-23T11:29:41.481Z] [INFO] Using 'UTF-8' encoding to copy filtered resources.
[2019-09-23T11:29:41.481Z] [INFO] skip non existing resourceDirectory C:\Users\jenkins\AppData\Local\Temp\3\jenkins-maven-box-maven-surefire-maven2surefire-jvm-communication-9\maven-surefire-common\src\main\resources
[2019-09-23T11:29:41.481Z] [INFO] Copying 3 resources
[2019-09-23T11:29:41.481Z] [INFO]
[2019-09-23T11:29:41.481Z] [INFO] --- maven-compiler-plugin:3.7.0:compile (default-compile) @ maven-surefire-common ---
[2019-09-23T11:29:41.481Z] [INFO] Changes detected - recompiling the module!
[2019-09-23T11:29:41.481Z] [INFO] Compiling 92 source files to C:\Users\jenkins\AppData\Local\Temp\3\jenkins-maven-box-maven-surefire-maven2surefire-jvm-communication-9\maven-surefire-common\target\classes
[2019-09-23T11:29:46.867Z] [INFO] -------------------------------------------------------------
[2019-09-23T11:29:46.867Z] [ERROR] COMPILATION ERROR :
[2019-09-23T11:29:46.867Z] [INFO] -------------------------------------------------------------
[2019-09-23T11:29:46.867Z] [ERROR] C:\Users\jenkins\AppData\Local\Temp\3\jenkins-maven-box-maven-surefire-maven2surefire-jvm-communication-9\maven-surefire-common\src\main\java\org\apache\maven\plugin\surefire\booterclient\lazytestprovider\DefaultCommandReader.java:[78,4] error: method does not override or implement a method from a supertype
[2019-09-23T11:29:46.867Z] [ERROR] C:\Users\jenkins\AppData\Local\Temp\3\jenkins-maven-box-maven-surefire-maven2surefire-jvm-communication-9\maven-surefire-common\src\main\java\org\apache\maven\plugin\surefire\booterclient\lazytestprovider\TestProvidingInputStream.java:[53,13] error: TestProvidingInputStream is not abstract and does not override abstract method readNextCommand() in AbstractCommandReader
[2019-09-23T11:29:46.867Z] [ERROR] C:\Users\jenkins\AppData\Local\Temp\3\jenkins-maven-box-maven-surefire-maven2surefire-jvm-communication-9\maven-surefire-common\src\main\java\org\apache\maven\plugin\surefire\booterclient\lazytestprovider\TestLessInputStream.java:[47,13] error: TestLessInputStream is not abstract and does not override abstract method readNextCommand() in AbstractCommandReader
[2019-09-23T11:29:46.867Z] [ERROR] C:\Users\jenkins\AppData\Local\Temp\3\jenkins-maven-box-maven-surefire-maven2surefire-jvm-communication-9\maven-surefire-common\src\main\java\org\apache\maven\plugin\surefire\booterclient\ForkStarter.java:[620,52] error: cannot find symbol
[2019-09-23T11:29:46.867Z]   symbol:   variable stdOut
[2019-09-23T11:29:46.867Z]   location: class ForkStarter
[2019-09-23T11:29:46.867Z] [INFO] 4 errors
[2019-09-23T11:29:46.867Z] [INFO] -------------------------------------------------------------
[2019-09-23T11:29:46.867Z] [INFO] ------------------------------------------------------------------------
[2019-09-23T11:29:46.867Z] [INFO] Reactor Summary for Apache Maven Surefire 3.0.0-SNAPSHOT:
[2019-09-23T11:29:46.867Z] [INFO]
[2019-09-23T11:29:46.867Z] [INFO] Apache Maven Surefire .............................. SUCCESS [01:12 min]
[2019-09-23T11:29:46.867Z] [INFO] SureFire Logger API ................................ SUCCESS [ 22.880 s]
[2019-09-23T11:29:46.867Z] [INFO] SureFire API ....................................... SUCCESS [ 18.205 s]
[2019-09-23T11:29:46.867Z] [INFO] Surefire Extensions API ............................ SUCCESS [  3.364 s]
[2019-09-23T11:29:46.867Z] [INFO] Surefire Extensions SPI ............................ SUCCESS [  3.308 s]
[2019-09-23T11:29:46.867Z] [INFO] SureFire Booter .................................... SUCCESS [ 24.663 s]
[2019-09-23T11:29:46.867Z] [INFO] Maven Surefire Test-Grouping Support ............... SUCCESS [ 17.131 s]
[2019-09-23T11:29:46.867Z] [INFO] SureFire Providers ................................. SUCCESS [  1.559 s]
[2019-09-23T11:29:46.867Z] [INFO] Shared JUnit3 Provider Code ........................ SUCCESS [  5.548 s]
[2019-09-23T11:29:46.867Z] [INFO] Shared Java 5 Provider Base ........................ SUCCESS [  8.083 s]
[2019-09-23T11:29:46.867Z] [INFO] Shared JUnit4 Provider Code ........................ SUCCESS [  9.089 s]
[2019-09-23T11:29:46.867Z] [INFO] Shared JUnit48 Provider Code ....................... SUCCESS [  8.431 s]
[2019-09-23T11:29:46.867Z] [INFO] SureFire JUnit Runner .............................. SUCCESS [  5.865 s]
[2019-09-23T11:29:46.867Z] [INFO] SureFire JUnit4 Runner ............................. SUCCESS [  5.682 s]
[2019-09-23T11:29:46.867Z] [INFO] Maven Surefire Common .............................. FAILURE [  9.896 s]
[2019-09-23T11:29:46.867Z] [INFO] SureFire JUnitCore Runner .......................... SKIPPED
[2019-09-23T11:29:46.867Z] [INFO] SureFire JUnit Platform Runner ..................... SKIPPED
[2019-09-23T11:29:46.867Z] [INFO] SureFire TestNG Utils .............................. SKIPPED
[2019-09-23T11:29:46.867Z] [INFO] SureFire TestNG Runner ............................. SKIPPED
[2019-09-23T11:29:46.867Z] [INFO] ShadeFire JUnit3 Provider .......................... SKIPPED
[2019-09-23T11:29:46.867Z] [INFO] Surefire Report Parser ............................. SKIPPED
[2019-09-23T11:29:46.867Z] [INFO] Maven Surefire Plugin .............................. SKIPPED
[2019-09-23T11:29:46.867Z] [INFO] Maven Failsafe Plugin .............................. SKIPPED
[2019-09-23T11:29:46.867Z] [INFO] Maven Surefire Report Plugin ....................... SKIPPED
[2019-09-23T11:29:46.867Z] [INFO] Maven Surefire Integration Tests ................... SKIPPED
[2019-09-23T11:29:46.867Z] [INFO] ------------------------------------------------------------------------
[2019-09-23T11:29:46.867Z] [INFO] BUILD FAILURE
[2019-09-23T11:29:46.867Z] [INFO] ------------------------------------------------------------------------
[2019-09-23T11:29:46.867Z] [INFO] Total time:  03:38 min
[2019-09-23T11:29:46.867Z] [INFO] Finished at: 2019-09-23T04:29:46-07:00
[2019-09-23T11:29:46.867Z] [INFO] ------------------------------------------------------------------------
[2019-09-23T11:29:46.867Z] [ERROR] Failed to execute goal org.apache.maven.plugins:maven-compiler-plugin:3.7.0:compile (default-compile) on project maven-surefire-common: Compilation failure: Compilation failure:
[2019-09-23T11:29:46.867Z] [ERROR] C:\Users\jenkins\AppData\Local\Temp\3\jenkins-maven-box-maven-surefire-maven2surefire-jvm-communication-9\maven-surefire-common\src\main\java\org\apache\maven\plugin\surefire\booterclient\lazytestprovider\DefaultCommandReader.java:[78,4] error: method does not override or implement a method from a supertype
[2019-09-23T11:29:46.867Z] [ERROR] C:\Users\jenkins\AppData\Local\Temp\3\jenkins-maven-box-maven-surefire-maven2surefire-jvm-communication-9\maven-surefire-common\src\main\java\org\apache\maven\plugin\surefire\booterclient\lazytestprovider\TestProvidingInputStream.java:[53,13] error: TestProvidingInputStream is not abstract and does not override abstract method readNextCommand() in AbstractCommandReader
[2019-09-23T11:29:46.867Z] [ERROR] C:\Users\jenkins\AppData\Local\Temp\3\jenkins-maven-box-maven-surefire-maven2surefire-jvm-communication-9\maven-surefire-common\src\main\java\org\apache\maven\plugin\surefire\booterclient\lazytestprovider\TestLessInputStream.java:[47,13] error: TestLessInputStream is not abstract and does not override abstract method readNextCommand() in AbstractCommandReader
[2019-09-23T11:29:46.867Z] [ERROR] C:\Users\jenkins\AppData\Local\Temp\3\jenkins-maven-box-maven-surefire-maven2surefire-jvm-communication-9\maven-surefire-common\src\main\java\org\apache\maven\plugin\surefire\booterclient\ForkStarter.java:[620,52] error: cannot find symbol
[2019-09-23T11:29:46.867Z] [ERROR]   symbol:   variable stdOut
[2019-09-23T11:29:46.867Z] [ERROR]   location: class ForkStarter
[2019-09-23T11:29:46.868Z] [ERROR] -> [Help 1]
[2019-09-23T11:29:46.868Z] org.apache.maven.lifecycle.LifecycleExecutionException: Failed to execute goal org.apache.maven.plugins:maven-compiler-plugin:3.7.0:compile (default-compile) on project maven-surefire-common: Compilation failure
[2019-09-23T11:29:46.868Z]     at org.apache.maven.lifecycle.internal.MojoExecutor.execute (MojoExecutor.java:215)
[2019-09-23T11:29:46.868Z]     at org.apache.maven.lifecycle.internal.MojoExecutor.execute (MojoExecutor.java:156)
[2019-09-23T11:29:46.868Z]     at org.apache.maven.lifecycle.internal.MojoExecutor.execute (MojoExecutor.java:148)
[2019-09-23T11:29:46.868Z]     at org.apache.maven.lifecycle.internal.LifecycleModuleBuilder.buildProject (LifecycleModuleBuilder.java:117)
[2019-09-23T11:29:46.868Z]     at org.apache.maven.lifecycle.internal.LifecycleModuleBuilder.buildProject (LifecycleModuleBuilder.java:81)
[2019-09-23T11:29:46.868Z]     at org.apache.maven.lifecycle.internal.builder.singlethreaded.SingleThreadedBuilder.build (SingleThreadedBuilder.java:56)
[2019-09-23T11:29:46.868Z]     at org.apache.maven.lifecycle.internal.LifecycleStarter.execute (LifecycleStarter.java:128)
[2019-09-23T11:29:46.868Z]     at org.apache.maven.DefaultMaven.doExecute (DefaultMaven.java:305)
[2019-09-23T11:29:46.868Z]     at org.apache.maven.DefaultMaven.doExecute (DefaultMaven.java:192)
[2019-09-23T11:29:46.868Z]     at org.apache.maven.DefaultMaven.execute (DefaultMaven.java:105)
[2019-09-23T11:29:46.868Z]     at org.apache.maven.cli.MavenCli.execute (MavenCli.java:956)
[2019-09-23T11:29:46.868Z]     at org.apache.maven.cli.MavenCli.doMain (MavenCli.java:288)
[2019-09-23T11:29:46.868Z]     at org.apache.maven.cli.MavenCli.main (MavenCli.java:192)
[2019-09-23T11:29:46.868Z]     at sun.reflect.NativeMethodAccessorImpl.invoke0 (Native Method)
[2019-09-23T11:29:46.868Z]     at sun.reflect.NativeMethodAccessorImpl.invoke (NativeMethodAccessorImpl.java:62)
[2019-09-23T11:29:46.868Z]     at sun.reflect.DelegatingMethodAccessorImpl.invoke (DelegatingMethodAccessorImpl.java:43)
[2019-09-23T11:29:46.868Z]     at java.lang.reflect.Method.invoke (Method.java:498)
[2019-09-23T11:29:46.868Z]     at org.codehaus.plexus.classworlds.launcher.Launcher.launchEnhanced (Launcher.java:289)
[2019-09-23T11:29:46.868Z]     at org.codehaus.plexus.classworlds.launcher.Launcher.launch (Launcher.java:229)
[2019-09-23T11:29:46.868Z]     at org.codehaus.plexus.classworlds.launcher.Launcher.mainWithExitCode (Launcher.java:415)
[2019-09-23T11:29:46.868Z]     at org.codehaus.plexus.classworlds.launcher.Launcher.main (Launcher.java:356)
[2019-09-23T11:29:46.868Z] Caused by: org.apache.maven.plugin.compiler.CompilationFailureException: Compilation failure
[2019-09-23T11:29:46.868Z]     at org.apache.maven.plugin.compiler.AbstractCompilerMojo.execute (AbstractCompilerMojo.java:1161)
[2019-09-23T11:29:46.868Z]     at org.apache.maven.plugin.compiler.CompilerMojo.execute (CompilerMojo.java:168)
[2019-09-23T11:29:46.868Z]     at org.apache.maven.plugin.DefaultBuildPluginManager.executeMojo (DefaultBuildPluginManager.java:137)
[2019-09-23T11:29:46.868Z]     at org.apache.maven.lifecycle.internal.MojoExecutor.execute (MojoExecutor.java:210)
[2019-09-23T11:29:46.868Z]     at org.apache.maven.lifecycle.internal.MojoExecutor.execute (MojoExecutor.java:156)
[2019-09-23T11:29:46.868Z]     at org.apache.maven.lifecycle.internal.MojoExecutor.execute (MojoExecutor.java:148)
[2019-09-23T11:29:46.868Z]     at org.apache.maven.lifecycle.internal.LifecycleModuleBuilder.buildProject (LifecycleModuleBuilder.java:117)
[2019-09-23T11:29:46.868Z]     at org.apache.maven.lifecycle.internal.LifecycleModuleBuilder.buildProject (LifecycleModuleBuilder.java:81)
[2019-09-23T11:29:46.868Z]     at org.apache.maven.lifecycle.internal.builder.singlethreaded.SingleThreadedBuilder.build (SingleThreadedBuilder.java:56)
[2019-09-23T11:29:46.868Z]     at org.apache.maven.lifecycle.internal.LifecycleStarter.execute (LifecycleStarter.java:128)
[2019-09-23T11:29:46.868Z]     at org.apache.maven.DefaultMaven.doExecute (DefaultMaven.java:305)
[2019-09-23T11:29:46.868Z]     at org.apache.maven.DefaultMaven.doExecute (DefaultMaven.java:192)
[2019-09-23T11:29:46.868Z]     at org.apache.maven.DefaultMaven.execute (DefaultMaven.java:105)
[2019-09-23T11:29:46.868Z]     at org.apache.maven.cli.MavenCli.execute (MavenCli.java:956)
[2019-09-23T11:29:46.868Z]     at org.apache.maven.cli.MavenCli.doMain (MavenCli.java:288)
[2019-09-23T11:29:46.868Z]     at org.apache.maven.cli.MavenCli.main (MavenCli.java:192)
[2019-09-23T11:29:46.868Z]     at sun.reflect.NativeMethodAccessorImpl.invoke0 (Native Method)
[2019-09-23T11:29:46.868Z]     at sun.reflect.NativeMethodAccessorImpl.invoke (NativeMethodAccessorImpl.java:62)
[2019-09-23T11:29:46.868Z]     at sun.reflect.DelegatingMethodAccessorImpl.invoke (DelegatingMethodAccessorImpl.java:43)
[2019-09-23T11:29:46.868Z]     at java.lang.reflect.Method.invoke (Method.java:498)
[2019-09-23T11:29:46.868Z]     at org.codehaus.plexus.classworlds.launcher.Launcher.launchEnhanced (Launcher.java:289)
[2019-09-23T11:29:46.868Z]     at org.codehaus.plexus.classworlds.launcher.Launcher.launch (Launcher.java:229)
[2019-09-23T11:29:46.868Z]     at org.codehaus.plexus.classworlds.launcher.Launcher.mainWithExitCode (Launcher.java:415)
[2019-09-23T11:29:46.868Z]     at org.codehaus.plexus.classworlds.launcher.Launcher.main (Launcher.java:356)
[2019-09-23T11:29:46.868Z] [ERROR]
[2019-09-23T11:29:46.868Z] [ERROR] Re-run Maven using the -X switch to enable full debug logging.
[2019-09-23T11:29:46.868Z] [ERROR]
[2019-09-23T11:29:46.868Z] [ERROR] For more information about the errors and possible solutions, please read the following articles:
[2019-09-23T11:29:46.868Z] [ERROR] [Help 1] http://cwiki.apache.org/confluence/display/MAVEN/MojoFailureException
[2019-09-23T11:29:46.868Z] [ERROR]
[2019-09-23T11:29:46.868Z] [ERROR] After correcting the problems, you can resume the build with the command
[2019-09-23T11:29:46.868Z] [ERROR]   mvn <goals> -rf :maven-surefire-common
[Pipeline] }
[Pipeline] // withEnv
[Pipeline] }
[Pipeline] // stage
[Pipeline] fileExists
[Pipeline] fileExists
[Pipeline] archiveArtifacts
[2019-09-23T11:29:47.039Z] Archiving artifacts
[Pipeline] cleanWs
[2019-09-23T11:29:47.090Z] [WS-CLEANUP] Deleting project workspace...
[2019-09-23T11:29:47.090Z] [WS-CLEANUP] Deferred wipeout is used...
[2019-09-23T11:29:47.162Z] [WS-CLEANUP] done
[Pipeline] }
[Pipeline] // ws
[Pipeline] }
[Pipeline] // timestamps
[Pipeline] }
[Pipeline] // node
[Pipeline] }
[Pipeline] // parallel
[Pipeline] echo
hudson.AbortException: hudson.AbortException: script returned exit code -2
[Pipeline] echo
Build result: FAILURE
[Pipeline] jiraIssueSelector
[Pipeline] echo
The authors of changes [rfscholte].
[Pipeline] echo
Sending email ...
[Pipeline] emailext
Reply | Threaded
Open this post in threaded view
|

Build failed in Jenkins: Maven TLP » maven-surefire » maven2surefire-jvm-communication #10

Apache Jenkins Server-2
See https://builds.apache.org/job/maven-box/job/maven-surefire/job/maven2surefire-jvm-communication/10/

Changes:

* Apply Maven 3.6.2
* H29 has checkout issues...
* Issues with H28 too
* Seems like Maven 3.6.2 is not available on all Linux nodes yet
* Java 13 released: drop 12 + include 14 (-ea)

All tests passed

Build log:
[...truncated 38903 lines...]
[2019-10-01T05:49:20.920Z] [INFO] -------------------------------------------------------
[2019-10-01T05:49:20.920Z] [INFO]  T E S T S
[2019-10-01T05:49:20.920Z] [INFO] -------------------------------------------------------
[2019-10-01T05:49:21.221Z] [INFO] Running org.apache.maven.surefire.junit4.JUnit4SuiteTest
[2019-10-01T05:49:21.521Z] [INFO] Tests run: 2, Failures: 0, Errors: 0, Skipped: 0, Time elapsed: 0.27 s - in org.apache.maven.surefire.junit4.JUnit4SuiteTest
[2019-10-01T05:49:21.827Z] [INFO]
[2019-10-01T05:49:21.827Z] [INFO] Results:
[2019-10-01T05:49:21.827Z] [INFO]
[2019-10-01T05:49:21.827Z] [INFO] Tests run: 2, Failures: 0, Errors: 0, Skipped: 0
[2019-10-01T05:49:21.827Z] [INFO]
[2019-10-01T05:49:21.827Z] [INFO]
[2019-10-01T05:49:21.827Z] [INFO] --- maven-jar-plugin:3.1.0:jar (default-jar) @ surefire-junit4 ---
[2019-10-01T05:49:21.827Z] [INFO] Building jar: C:\Users\jenkins\AppData\Local\Temp\2\jenkins-maven-box-maven-surefire-maven2surefire-jvm-communication-10@2\surefire-providers\surefire-junit4\target\surefire-junit4-3.0.0-SNAPSHOT.jar
[2019-10-01T05:49:22.119Z] [INFO]
[2019-10-01T05:49:22.119Z] [INFO] --- maven-site-plugin:3.8.2:attach-descriptor (attach-descriptor) @ surefire-junit4 ---
[2019-10-01T05:49:22.119Z] [INFO] Skipping because packaging 'jar' is not pom.
[2019-10-01T05:49:22.119Z] [INFO]
[2019-10-01T05:49:22.119Z] [INFO] --- maven-checkstyle-plugin:3.0.0:check (checkstyle-check) @ surefire-junit4 ---
[2019-10-01T05:49:22.717Z] [INFO]
[2019-10-01T05:49:22.717Z] [INFO] --- maven-install-plugin:2.5.2:install (default-install) @ surefire-junit4 ---
[2019-10-01T05:49:22.717Z] [INFO] Installing C:\Users\jenkins\AppData\Local\Temp\2\jenkins-maven-box-maven-surefire-maven2surefire-jvm-communication-10@2\surefire-providers\surefire-junit4\target\surefire-junit4-3.0.0-SNAPSHOT.jar to C:\Users\jenkins\AppData\Local\Temp\2\jenkins-maven-box-maven-surefire-maven2surefire-jvm-communication-10@2\.m2\org\apache\maven\surefire\surefire-junit4\3.0.0-SNAPSHOT\surefire-junit4-3.0.0-SNAPSHOT.jar
[2019-10-01T05:49:22.717Z] [INFO] Installing C:\Users\jenkins\AppData\Local\Temp\2\jenkins-maven-box-maven-surefire-maven2surefire-jvm-communication-10@2\surefire-providers\surefire-junit4\pom.xml to C:\Users\jenkins\AppData\Local\Temp\2\jenkins-maven-box-maven-surefire-maven2surefire-jvm-communication-10@2\.m2\org\apache\maven\surefire\surefire-junit4\3.0.0-SNAPSHOT\surefire-junit4-3.0.0-SNAPSHOT.pom
[2019-10-01T05:49:22.717Z] [INFO]
[2019-10-01T05:49:22.717Z] [INFO] ----------< org.apache.maven.surefire:maven-surefire-common >-----------
[2019-10-01T05:49:22.717Z] [INFO] Building Maven Surefire Common 3.0.0-SNAPSHOT                    [15/25]
[2019-10-01T05:49:22.717Z] [INFO] --------------------------------[ jar ]---------------------------------
[2019-10-01T05:49:22.717Z] [INFO] Downloading from central: https://repo.maven.apache.org/maven2/org/apache/maven/shared/maven-common-artifact-filters/3.1.0/maven-common-artifact-filters-3.1.0.pom
[2019-10-01T05:49:22.717Z] [INFO] Downloaded from central: https://repo.maven.apache.org/maven2/org/apache/maven/shared/maven-common-artifact-filters/3.1.0/maven-common-artifact-filters-3.1.0.pom (5.3 kB at 129 kB/s)
[2019-10-01T05:49:22.999Z] [INFO] Downloading from central: https://repo.maven.apache.org/maven2/org/apache/maven/shared/maven-shared-components/33/maven-shared-components-33.pom
[2019-10-01T05:49:22.999Z] [INFO] Downloaded from central: https://repo.maven.apache.org/maven2/org/apache/maven/shared/maven-shared-components/33/maven-shared-components-33.pom (5.1 kB at 40 kB/s)
[2019-10-01T05:49:23.000Z] [INFO] Downloading from central: https://repo.maven.apache.org/maven2/org/apache/maven/shared/maven-artifact-transfer/0.11.0/maven-artifact-transfer-0.11.0.pom
[2019-10-01T05:49:23.000Z] [INFO] Downloaded from central: https://repo.maven.apache.org/maven2/org/apache/maven/shared/maven-artifact-transfer/0.11.0/maven-artifact-transfer-0.11.0.pom (11 kB at 249 kB/s)
[2019-10-01T05:49:23.000Z] [INFO] Downloading from central: https://repo.maven.apache.org/maven2/org/codehaus/plexus/plexus-java/1.0.3/plexus-java-1.0.3.pom
[2019-10-01T05:49:23.278Z] [INFO] Downloaded from central: https://repo.maven.apache.org/maven2/org/codehaus/plexus/plexus-java/1.0.3/plexus-java-1.0.3.pom (4.8 kB at 113 kB/s)
[2019-10-01T05:49:23.278Z] [INFO] Downloading from central: https://repo.maven.apache.org/maven2/org/codehaus/plexus/plexus-languages/1.0.3/plexus-languages-1.0.3.pom
[2019-10-01T05:49:23.278Z] [INFO] Downloaded from central: https://repo.maven.apache.org/maven2/org/codehaus/plexus/plexus-languages/1.0.3/plexus-languages-1.0.3.pom (4.2 kB at 111 kB/s)
[2019-10-01T05:49:23.278Z] [INFO] Downloading from central: https://repo.maven.apache.org/maven2/org/ow2/asm/asm/7.0/asm-7.0.pom
[2019-10-01T05:49:23.278Z] [INFO] Downloaded from central: https://repo.maven.apache.org/maven2/org/ow2/asm/asm/7.0/asm-7.0.pom (2.9 kB at 77 kB/s)
[2019-10-01T05:49:23.278Z] [INFO] Downloading from central: https://repo.maven.apache.org/maven2/org/fusesource/jansi/jansi/1.13/jansi-1.13.pom
[2019-10-01T05:49:23.278Z] [INFO] Downloaded from central: https://repo.maven.apache.org/maven2/org/fusesource/jansi/jansi/1.13/jansi-1.13.pom (3.7 kB at 98 kB/s)
[2019-10-01T05:49:23.278Z] [INFO] Downloading from central: https://repo.maven.apache.org/maven2/org/fusesource/jansi/jansi-project/1.13/jansi-project-1.13.pom
[2019-10-01T05:49:23.278Z] [INFO] Downloaded from central: https://repo.maven.apache.org/maven2/org/fusesource/jansi/jansi-project/1.13/jansi-project-1.13.pom (12 kB at 288 kB/s)
[2019-10-01T05:49:23.571Z] [INFO] Downloading from central: https://repo.maven.apache.org/maven2/org/fusesource/fusesource-pom/1.11/fusesource-pom-1.11.pom
[2019-10-01T05:49:23.571Z] [INFO] Downloaded from central: https://repo.maven.apache.org/maven2/org/fusesource/fusesource-pom/1.11/fusesource-pom-1.11.pom (15 kB at 355 kB/s)
[2019-10-01T05:49:23.571Z] [INFO] Downloading from central: https://repo.maven.apache.org/maven2/org/apache/maven/shared/maven-common-artifact-filters/3.1.0/maven-common-artifact-filters-3.1.0.jar
[2019-10-01T05:49:23.571Z] [INFO] Downloading from central: https://repo.maven.apache.org/maven2/org/fusesource/jansi/jansi/1.13/jansi-1.13.jar
[2019-10-01T05:49:23.571Z] [INFO] Downloading from central: https://repo.maven.apache.org/maven2/org/ow2/asm/asm/7.0/asm-7.0.jar
[2019-10-01T05:49:23.571Z] [INFO] Downloading from central: https://repo.maven.apache.org/maven2/org/codehaus/plexus/plexus-java/1.0.3/plexus-java-1.0.3.jar
[2019-10-01T05:49:23.571Z] [INFO] Downloading from central: https://repo.maven.apache.org/maven2/org/apache/maven/shared/maven-artifact-transfer/0.11.0/maven-artifact-transfer-0.11.0.jar
[2019-10-01T05:49:23.571Z] [INFO] Downloaded from central: https://repo.maven.apache.org/maven2/org/codehaus/plexus/plexus-java/1.0.3/plexus-java-1.0.3.jar (51 kB at 858 kB/s)
[2019-10-01T05:49:23.850Z] [INFO] Downloaded from central: https://repo.maven.apache.org/maven2/org/apache/maven/shared/maven-common-artifact-filters/3.1.0/maven-common-artifact-filters-3.1.0.jar (61 kB at 293 kB/s)
[2019-10-01T05:49:23.850Z] [INFO] Downloaded from central: https://repo.maven.apache.org/maven2/org/fusesource/jansi/jansi/1.13/jansi-1.13.jar (152 kB at 589 kB/s)
[2019-10-01T05:49:23.850Z] [INFO] Downloaded from central: https://repo.maven.apache.org/maven2/org/ow2/asm/asm/7.0/asm-7.0.jar (114 kB at 346 kB/s)
[2019-10-01T05:49:23.850Z] [INFO] Downloaded from central: https://repo.maven.apache.org/maven2/org/apache/maven/shared/maven-artifact-transfer/0.11.0/maven-artifact-transfer-0.11.0.jar (128 kB at 365 kB/s)
[2019-10-01T05:49:24.153Z] [INFO]
[2019-10-01T05:49:24.154Z] [INFO] --- maven-clean-plugin:3.1.0:clean (default-clean) @ maven-surefire-common ---
[2019-10-01T05:49:24.154Z] [INFO]
[2019-10-01T05:49:24.154Z] [INFO] --- maven-enforcer-plugin:3.0.0-M2:enforce (enforce-maven-version) @ maven-surefire-common ---
[2019-10-01T05:49:24.154Z] [INFO]
[2019-10-01T05:49:24.154Z] [INFO] --- maven-enforcer-plugin:3.0.0-M2:enforce (enforce-bytecode-version) @ maven-surefire-common ---
[2019-10-01T05:49:26.214Z] [WARNING] Invalid bytecodeVersion for module-info.class: expected 51, but was 53
[2019-10-01T05:49:26.214Z] [INFO]
[2019-10-01T05:49:26.214Z] [INFO] --- maven-enforcer-plugin:3.0.0-M2:enforce (ban-known-bad-maven-versions) @ maven-surefire-common ---
[2019-10-01T05:49:26.214Z] [INFO]
[2019-10-01T05:49:26.214Z] [INFO] --- maven-enforcer-plugin:3.0.0-M2:enforce (enforce-java) @ maven-surefire-common ---
[2019-10-01T05:49:26.214Z] [INFO]
[2019-10-01T05:49:26.215Z] [INFO] --- maven-enforcer-plugin:3.0.0-M2:enforce (enforce-maven) @ maven-surefire-common ---
[2019-10-01T05:49:26.215Z] [INFO]
[2019-10-01T05:49:26.215Z] [INFO] --- apache-rat-plugin:0.12:check (rat-check) @ maven-surefire-common ---
[2019-10-01T05:49:26.215Z] [INFO] Enabled default license matchers.
[2019-10-01T05:49:26.215Z] [INFO] Will parse SCM ignores for exclusions...
[2019-10-01T05:49:26.215Z] [INFO] Finished adding exclusions from SCM ignore files.
[2019-10-01T05:49:26.215Z] [INFO] 61 implicit excludes (use -debug for more details).
[2019-10-01T05:49:26.215Z] [INFO] Exclude: .repository/**
[2019-10-01T05:49:26.215Z] [INFO] Exclude: .maven/spy.log
[2019-10-01T05:49:26.215Z] [INFO] Exclude: dependency-reduced-pom.xml
[2019-10-01T05:49:26.215Z] [INFO] Exclude: .java-version
[2019-10-01T05:49:26.215Z] [INFO] Exclude: Jenkinsfile
[2019-10-01T05:49:26.215Z] [INFO] Exclude: README.md
[2019-10-01T05:49:26.215Z] [INFO] Exclude: .gitignore
[2019-10-01T05:49:26.215Z] [INFO] Exclude: .git/**/*
[2019-10-01T05:49:26.215Z] [INFO] Exclude: **/.idea
[2019-10-01T05:49:26.215Z] [INFO] Exclude: **/.svn/**/*
[2019-10-01T05:49:26.215Z] [INFO] Exclude: **/*.iml
[2019-10-01T05:49:26.215Z] [INFO] Exclude: **/*.ipr
[2019-10-01T05:49:26.215Z] [INFO] Exclude: **/*.iws
[2019-10-01T05:49:26.215Z] [INFO] Exclude: **/*.versionsBackup
[2019-10-01T05:49:26.215Z] [INFO] Exclude: **/dependency-reduced-pom.xml
[2019-10-01T05:49:26.215Z] [INFO] Exclude: .repository/**
[2019-10-01T05:49:26.215Z] [INFO] Exclude: src/test/resources/**/*
[2019-10-01T05:49:26.215Z] [INFO] Exclude: src/test/resources/**/*.css
[2019-10-01T05:49:26.215Z] [INFO] Exclude: **/*.jj
[2019-10-01T05:49:26.215Z] [INFO] Exclude: src/main/resources/META-INF/services/org.apache.maven.surefire.providerapi.SurefireProvider
[2019-10-01T05:49:26.215Z] [INFO] Exclude: DEPENDENCIES
[2019-10-01T05:49:26.215Z] [INFO] Exclude: .m2/**
[2019-10-01T05:49:26.215Z] [INFO] Exclude: .m2
[2019-10-01T05:49:26.215Z] [INFO] Exclude: .travis.yml
[2019-10-01T05:49:26.215Z] [INFO] 143 resources included (use -debug for more details)
[2019-10-01T05:49:26.215Z] [INFO] Rat check: Summary over all files. Unapproved: 0, unknown: 0, generated: 0, approved: 143 licenses.
[2019-10-01T05:49:26.215Z] [INFO]
[2019-10-01T05:49:26.215Z] [INFO] --- maven-compiler-plugin:3.7.0:compile (compile-generated) @ maven-surefire-common ---
[2019-10-01T05:49:26.215Z] [INFO] Nothing to compile - all classes are up to date
[2019-10-01T05:49:26.215Z] [INFO]
[2019-10-01T05:49:26.215Z] [INFO] --- maven-remote-resources-plugin:1.5:process (process-resource-bundles) @ maven-surefire-common ---
[2019-10-01T05:49:26.500Z] [INFO]
[2019-10-01T05:49:26.500Z] [INFO] --- maven-resources-plugin:3.1.0:resources (default-resources) @ maven-surefire-common ---
[2019-10-01T05:49:26.500Z] [INFO] Using 'UTF-8' encoding to copy filtered resources.
[2019-10-01T05:49:26.500Z] [INFO] skip non existing resourceDirectory C:\Users\jenkins\AppData\Local\Temp\2\jenkins-maven-box-maven-surefire-maven2surefire-jvm-communication-10@2\maven-surefire-common\src\main\resources
[2019-10-01T05:49:26.500Z] [INFO] Copying 3 resources
[2019-10-01T05:49:26.501Z] [INFO]
[2019-10-01T05:49:26.501Z] [INFO] --- maven-compiler-plugin:3.7.0:compile (default-compile) @ maven-surefire-common ---
[2019-10-01T05:49:26.767Z] [INFO] Changes detected - recompiling the module!
[2019-10-01T05:49:26.767Z] [INFO] Compiling 92 source files to C:\Users\jenkins\AppData\Local\Temp\2\jenkins-maven-box-maven-surefire-maven2surefire-jvm-communication-10@2\maven-surefire-common\target\classes
[2019-10-01T05:49:33.500Z] [INFO] -------------------------------------------------------------
[2019-10-01T05:49:33.500Z] [ERROR] COMPILATION ERROR :
[2019-10-01T05:49:33.500Z] [INFO] -------------------------------------------------------------
[2019-10-01T05:49:33.500Z] [ERROR] C:\Users\jenkins\AppData\Local\Temp\2\jenkins-maven-box-maven-surefire-maven2surefire-jvm-communication-10@2\maven-surefire-common\src\main\java\org\apache\maven\plugin\surefire\booterclient\lazytestprovider\DefaultCommandReader.java:[78,4] error: method does not override or implement a method from a supertype
[2019-10-01T05:49:33.500Z] [ERROR] C:\Users\jenkins\AppData\Local\Temp\2\jenkins-maven-box-maven-surefire-maven2surefire-jvm-communication-10@2\maven-surefire-common\src\main\java\org\apache\maven\plugin\surefire\booterclient\lazytestprovider\TestLessInputStream.java:[47,13] error: TestLessInputStream is not abstract and does not override abstract method readNextCommand() in AbstractCommandReader
[2019-10-01T05:49:33.500Z] [ERROR] C:\Users\jenkins\AppData\Local\Temp\2\jenkins-maven-box-maven-surefire-maven2surefire-jvm-communication-10@2\maven-surefire-common\src\main\java\org\apache\maven\plugin\surefire\booterclient\ForkStarter.java:[620,52] error: cannot find symbol
[2019-10-01T05:49:33.500Z]   symbol:   variable stdOut
[2019-10-01T05:49:33.500Z]   location: class ForkStarter
[2019-10-01T05:49:33.501Z] [ERROR] C:\Users\jenkins\AppData\Local\Temp\2\jenkins-maven-box-maven-surefire-maven2surefire-jvm-communication-10@2\maven-surefire-common\src\main\java\org\apache\maven\plugin\surefire\booterclient\lazytestprovider\TestProvidingInputStream.java:[53,13] error: TestProvidingInputStream is not abstract and does not override abstract method readNextCommand() in AbstractCommandReader
[2019-10-01T05:49:33.501Z] [INFO] 4 errors
[2019-10-01T05:49:33.501Z] [INFO] -------------------------------------------------------------
[2019-10-01T05:49:33.501Z] [INFO] ------------------------------------------------------------------------
[2019-10-01T05:49:33.501Z] [INFO] Reactor Summary for Apache Maven Surefire 3.0.0-SNAPSHOT:
[2019-10-01T05:49:33.501Z] [INFO]
[2019-10-01T05:49:33.501Z] [INFO] Apache Maven Surefire .............................. SUCCESS [01:12 min]
[2019-10-01T05:49:33.501Z] [INFO] SureFire Logger API ................................ SUCCESS [ 38.598 s]
[2019-10-01T05:49:33.501Z] [INFO] SureFire API ....................................... SUCCESS [ 17.245 s]
[2019-10-01T05:49:33.501Z] [INFO] Surefire Extensions API ............................ SUCCESS [  4.023 s]
[2019-10-01T05:49:33.501Z] [INFO] Surefire Extensions SPI ............................ SUCCESS [  5.394 s]
[2019-10-01T05:49:33.501Z] [INFO] SureFire Booter .................................... SUCCESS [ 22.866 s]
[2019-10-01T05:49:33.501Z] [INFO] Maven Surefire Test-Grouping Support ............... SUCCESS [ 13.835 s]
[2019-10-01T05:49:33.501Z] [INFO] SureFire Providers ................................. SUCCESS [  1.311 s]
[2019-10-01T05:49:33.501Z] [INFO] Shared JUnit3 Provider Code ........................ SUCCESS [  4.832 s]
[2019-10-01T05:49:33.501Z] [INFO] Shared Java 5 Provider Base ........................ SUCCESS [  7.960 s]
[2019-10-01T05:49:33.501Z] [INFO] Shared JUnit4 Provider Code ........................ SUCCESS [  6.898 s]
[2019-10-01T05:49:33.501Z] [INFO] Shared JUnit48 Provider Code ....................... SUCCESS [  8.743 s]
[2019-10-01T05:49:33.501Z] [INFO] SureFire JUnit Runner .............................. SUCCESS [  5.420 s]
[2019-10-01T05:49:33.501Z] [INFO] SureFire JUnit4 Runner ............................. SUCCESS [  5.323 s]
[2019-10-01T05:49:33.501Z] [INFO] Maven Surefire Common .............................. FAILURE [  9.752 s]
[2019-10-01T05:49:33.501Z] [INFO] SureFire JUnitCore Runner .......................... SKIPPED
[2019-10-01T05:49:33.501Z] [INFO] SureFire JUnit Platform Runner ..................... SKIPPED
[2019-10-01T05:49:33.501Z] [INFO] SureFire TestNG Utils .............................. SKIPPED
[2019-10-01T05:49:33.501Z] [INFO] SureFire TestNG Runner ............................. SKIPPED
[2019-10-01T05:49:33.501Z] [INFO] ShadeFire JUnit3 Provider .......................... SKIPPED
[2019-10-01T05:49:33.501Z] [INFO] Surefire Report Parser ............................. SKIPPED
[2019-10-01T05:49:33.501Z] [INFO] Maven Surefire Plugin .............................. SKIPPED
[2019-10-01T05:49:33.501Z] [INFO] Maven Failsafe Plugin .............................. SKIPPED
[2019-10-01T05:49:33.501Z] [INFO] Maven Surefire Report Plugin ....................... SKIPPED
[2019-10-01T05:49:33.501Z] [INFO] Maven Surefire Integration Tests ................... SKIPPED
[2019-10-01T05:49:33.501Z] [INFO] ------------------------------------------------------------------------
[2019-10-01T05:49:33.501Z] [INFO] BUILD FAILURE
[2019-10-01T05:49:33.501Z] [INFO] ------------------------------------------------------------------------
[2019-10-01T05:49:33.501Z] [INFO] Total time:  03:46 min
[2019-10-01T05:49:33.501Z] [INFO] Finished at: 2019-09-30T22:49:32-07:00
[2019-10-01T05:49:33.501Z] [INFO] ------------------------------------------------------------------------
[2019-10-01T05:49:33.501Z] [ERROR] Failed to execute goal org.apache.maven.plugins:maven-compiler-plugin:3.7.0:compile (default-compile) on project maven-surefire-common: Compilation failure: Compilation failure:
[2019-10-01T05:49:33.501Z] [ERROR] C:\Users\jenkins\AppData\Local\Temp\2\jenkins-maven-box-maven-surefire-maven2surefire-jvm-communication-10@2\maven-surefire-common\src\main\java\org\apache\maven\plugin\surefire\booterclient\lazytestprovider\DefaultCommandReader.java:[78,4] error: method does not override or implement a method from a supertype
[2019-10-01T05:49:33.501Z] [ERROR] C:\Users\jenkins\AppData\Local\Temp\2\jenkins-maven-box-maven-surefire-maven2surefire-jvm-communication-10@2\maven-surefire-common\src\main\java\org\apache\maven\plugin\surefire\booterclient\lazytestprovider\TestLessInputStream.java:[47,13] error: TestLessInputStream is not abstract and does not override abstract method readNextCommand() in AbstractCommandReader
[2019-10-01T05:49:33.501Z] [ERROR] C:\Users\jenkins\AppData\Local\Temp\2\jenkins-maven-box-maven-surefire-maven2surefire-jvm-communication-10@2\maven-surefire-common\src\main\java\org\apache\maven\plugin\surefire\booterclient\ForkStarter.java:[620,52] error: cannot find symbol
[2019-10-01T05:49:33.501Z] [ERROR]   symbol:   variable stdOut
[2019-10-01T05:49:33.501Z] [ERROR]   location: class ForkStarter
[2019-10-01T05:49:33.501Z] [ERROR] C:\Users\jenkins\AppData\Local\Temp\2\jenkins-maven-box-maven-surefire-maven2surefire-jvm-communication-10@2\maven-surefire-common\src\main\java\org\apache\maven\plugin\surefire\booterclient\lazytestprovider\TestProvidingInputStream.java:[53,13] error: TestProvidingInputStream is not abstract and does not override abstract method readNextCommand() in AbstractCommandReader
[2019-10-01T05:49:33.501Z] [ERROR] -> [Help 1]
[2019-10-01T05:49:33.501Z] org.apache.maven.lifecycle.LifecycleExecutionException: Failed to execute goal org.apache.maven.plugins:maven-compiler-plugin:3.7.0:compile (default-compile) on project maven-surefire-common: Compilation failure
[2019-10-01T05:49:33.501Z]     at org.apache.maven.lifecycle.internal.MojoExecutor.execute (MojoExecutor.java:215)
[2019-10-01T05:49:33.501Z]     at org.apache.maven.lifecycle.internal.MojoExecutor.execute (MojoExecutor.java:156)
[2019-10-01T05:49:33.501Z]     at org.apache.maven.lifecycle.internal.MojoExecutor.execute (MojoExecutor.java:148)
[2019-10-01T05:49:33.501Z]     at org.apache.maven.lifecycle.internal.LifecycleModuleBuilder.buildProject (LifecycleModuleBuilder.java:117)
[2019-10-01T05:49:33.501Z]     at org.apache.maven.lifecycle.internal.LifecycleModuleBuilder.buildProject (LifecycleModuleBuilder.java:81)
[2019-10-01T05:49:33.501Z]     at org.apache.maven.lifecycle.internal.builder.singlethreaded.SingleThreadedBuilder.build (SingleThreadedBuilder.java:56)
[2019-10-01T05:49:33.502Z]     at org.apache.maven.lifecycle.internal.LifecycleStarter.execute (LifecycleStarter.java:128)
[2019-10-01T05:49:33.502Z]     at org.apache.maven.DefaultMaven.doExecute (DefaultMaven.java:305)
[2019-10-01T05:49:33.502Z]     at org.apache.maven.DefaultMaven.doExecute (DefaultMaven.java:192)
[2019-10-01T05:49:33.502Z]     at org.apache.maven.DefaultMaven.execute (DefaultMaven.java:105)
[2019-10-01T05:49:33.502Z]     at org.apache.maven.cli.MavenCli.execute (MavenCli.java:956)
[2019-10-01T05:49:33.502Z]     at org.apache.maven.cli.MavenCli.doMain (MavenCli.java:288)
[2019-10-01T05:49:33.502Z]     at org.apache.maven.cli.MavenCli.main (MavenCli.java:192)
[2019-10-01T05:49:33.502Z]     at sun.reflect.NativeMethodAccessorImpl.invoke0 (Native Method)
[2019-10-01T05:49:33.502Z]     at sun.reflect.NativeMethodAccessorImpl.invoke (NativeMethodAccessorImpl.java:62)
[2019-10-01T05:49:33.502Z]     at sun.reflect.DelegatingMethodAccessorImpl.invoke (DelegatingMethodAccessorImpl.java:43)
[2019-10-01T05:49:33.502Z]     at java.lang.reflect.Method.invoke (Method.java:498)
[2019-10-01T05:49:33.502Z]     at org.codehaus.plexus.classworlds.launcher.Launcher.launchEnhanced (Launcher.java:282)
[2019-10-01T05:49:33.502Z]     at org.codehaus.plexus.classworlds.launcher.Launcher.launch (Launcher.java:225)
[2019-10-01T05:49:33.502Z]     at org.codehaus.plexus.classworlds.launcher.Launcher.mainWithExitCode (Launcher.java:406)
[2019-10-01T05:49:33.502Z]     at org.codehaus.plexus.classworlds.launcher.Launcher.main (Launcher.java:347)
[2019-10-01T05:49:33.502Z] Caused by: org.apache.maven.plugin.compiler.CompilationFailureException: Compilation failure
[2019-10-01T05:49:33.502Z]     at org.apache.maven.plugin.compiler.AbstractCompilerMojo.execute (AbstractCompilerMojo.java:1161)
[2019-10-01T05:49:33.502Z]     at org.apache.maven.plugin.compiler.CompilerMojo.execute (CompilerMojo.java:168)
[2019-10-01T05:49:33.502Z]     at org.apache.maven.plugin.DefaultBuildPluginManager.executeMojo (DefaultBuildPluginManager.java:137)
[2019-10-01T05:49:33.502Z]     at org.apache.maven.lifecycle.internal.MojoExecutor.execute (MojoExecutor.java:210)
[2019-10-01T05:49:33.502Z]     at org.apache.maven.lifecycle.internal.MojoExecutor.execute (MojoExecutor.java:156)
[2019-10-01T05:49:33.502Z]     at org.apache.maven.lifecycle.internal.MojoExecutor.execute (MojoExecutor.java:148)
[2019-10-01T05:49:33.502Z]     at org.apache.maven.lifecycle.internal.LifecycleModuleBuilder.buildProject (LifecycleModuleBuilder.java:117)
[2019-10-01T05:49:33.502Z]     at org.apache.maven.lifecycle.internal.LifecycleModuleBuilder.buildProject (LifecycleModuleBuilder.java:81)
[2019-10-01T05:49:33.502Z]     at org.apache.maven.lifecycle.internal.builder.singlethreaded.SingleThreadedBuilder.build (SingleThreadedBuilder.java:56)
[2019-10-01T05:49:33.502Z]     at org.apache.maven.lifecycle.internal.LifecycleStarter.execute (LifecycleStarter.java:128)
[2019-10-01T05:49:33.502Z]     at org.apache.maven.DefaultMaven.doExecute (DefaultMaven.java:305)
[2019-10-01T05:49:33.502Z]     at org.apache.maven.DefaultMaven.doExecute (DefaultMaven.java:192)
[2019-10-01T05:49:33.502Z]     at org.apache.maven.DefaultMaven.execute (DefaultMaven.java:105)
[2019-10-01T05:49:33.502Z]     at org.apache.maven.cli.MavenCli.execute (MavenCli.java:956)
[2019-10-01T05:49:33.502Z]     at org.apache.maven.cli.MavenCli.doMain (MavenCli.java:288)
[2019-10-01T05:49:33.502Z]     at org.apache.maven.cli.MavenCli.main (MavenCli.java:192)
[2019-10-01T05:49:33.502Z]     at sun.reflect.NativeMethodAccessorImpl.invoke0 (Native Method)
[2019-10-01T05:49:33.502Z]     at sun.reflect.NativeMethodAccessorImpl.invoke (NativeMethodAccessorImpl.java:62)
[2019-10-01T05:49:33.502Z]     at sun.reflect.DelegatingMethodAccessorImpl.invoke (DelegatingMethodAccessorImpl.java:43)
[2019-10-01T05:49:33.502Z]     at java.lang.reflect.Method.invoke (Method.java:498)
[2019-10-01T05:49:33.502Z]     at org.codehaus.plexus.classworlds.launcher.Launcher.launchEnhanced (Launcher.java:282)
[2019-10-01T05:49:33.502Z]     at org.codehaus.plexus.classworlds.launcher.Launcher.launch (Launcher.java:225)
[2019-10-01T05:49:33.502Z]     at org.codehaus.plexus.classworlds.launcher.Launcher.mainWithExitCode (Launcher.java:406)
[2019-10-01T05:49:33.502Z]     at org.codehaus.plexus.classworlds.launcher.Launcher.main (Launcher.java:347)
[2019-10-01T05:49:33.502Z] [ERROR]
[2019-10-01T05:49:33.502Z] [ERROR] Re-run Maven using the -X switch to enable full debug logging.
[2019-10-01T05:49:33.502Z] [ERROR]
[2019-10-01T05:49:33.502Z] [ERROR] For more information about the errors and possible solutions, please read the following articles:
[2019-10-01T05:49:33.502Z] [ERROR] [Help 1] http://cwiki.apache.org/confluence/display/MAVEN/MojoFailureException
[2019-10-01T05:49:33.502Z] [ERROR]
[2019-10-01T05:49:33.503Z] [ERROR] After correcting the problems, you can resume the build with the command
[2019-10-01T05:49:33.503Z] [ERROR]   mvn <args> -rf :maven-surefire-common
[Pipeline] }
[Pipeline] // withEnv
[Pipeline] }
[Pipeline] // stage
[Pipeline] fileExists
[Pipeline] fileExists
[Pipeline] archiveArtifacts
[2019-10-01T05:49:33.654Z] Archiving artifacts
[Pipeline] cleanWs
[2019-10-01T05:49:33.695Z] [WS-CLEANUP] Deleting project workspace...
[2019-10-01T05:49:33.695Z] [WS-CLEANUP] Deferred wipeout is used...
[2019-10-01T05:49:33.734Z] [WS-CLEANUP] done
[Pipeline] }
[Pipeline] // ws
[Pipeline] }
[Pipeline] // timestamps
[Pipeline] }
[Pipeline] // node
[Pipeline] }
[Pipeline] // parallel
[Pipeline] echo
Build result: FAILURE
[Pipeline] jiraIssueSelector
[Pipeline] echo
The authors of changes [rfscholte].
[Pipeline] echo
Sending email ...
[Pipeline] emailext
Reply | Threaded
Open this post in threaded view
|

Build failed in Jenkins: Maven TLP » maven-surefire » maven2surefire-jvm-communication #11

Apache Jenkins Server-2
See https://builds.apache.org/job/maven-box/job/maven-surefire/job/maven2surefire-jvm-communication/11/

No changes.

All tests passed

Build log:
[...truncated 38904 lines...]
[2019-10-04T06:31:55.480Z] [INFO] -------------------------------------------------------
[2019-10-04T06:31:55.480Z] [INFO]  T E S T S
[2019-10-04T06:31:55.480Z] [INFO] -------------------------------------------------------
[2019-10-04T06:31:55.480Z] [INFO] Running org.apache.maven.surefire.junit4.JUnit4SuiteTest
[2019-10-04T06:31:56.330Z] [INFO] Tests run: 2, Failures: 0, Errors: 0, Skipped: 0, Time elapsed: 0.069 s - in org.apache.maven.surefire.junit4.JUnit4SuiteTest
[2019-10-04T06:31:56.330Z] [INFO]
[2019-10-04T06:31:56.330Z] [INFO] Results:
[2019-10-04T06:31:56.330Z] [INFO]
[2019-10-04T06:31:56.330Z] [INFO] Tests run: 2, Failures: 0, Errors: 0, Skipped: 0
[2019-10-04T06:31:56.330Z] [INFO]
[2019-10-04T06:31:56.330Z] [INFO]
[2019-10-04T06:31:56.330Z] [INFO] --- maven-jar-plugin:3.1.0:jar (default-jar) @ surefire-junit4 ---
[2019-10-04T06:31:56.330Z] [INFO] Building jar: /home/jenkins/jenkins-slave/workspace/maven2surefire-jvm-communication@2/surefire-providers/surefire-junit4/target/surefire-junit4-3.0.0-SNAPSHOT.jar
[2019-10-04T06:31:56.330Z] [INFO]
[2019-10-04T06:31:56.330Z] [INFO] --- maven-site-plugin:3.8.2:attach-descriptor (attach-descriptor) @ surefire-junit4 ---
[2019-10-04T06:31:56.330Z] [INFO] Skipping because packaging 'jar' is not pom.
[2019-10-04T06:31:56.330Z] [INFO]
[2019-10-04T06:31:56.330Z] [INFO] --- maven-checkstyle-plugin:3.0.0:check (checkstyle-check) @ surefire-junit4 ---
[2019-10-04T06:31:56.330Z] [INFO]
[2019-10-04T06:31:56.330Z] [INFO] --- maven-install-plugin:2.5.2:install (default-install) @ surefire-junit4 ---
[2019-10-04T06:31:56.330Z] [INFO] Installing /home/jenkins/jenkins-slave/workspace/maven2surefire-jvm-communication@2/surefire-providers/surefire-junit4/target/surefire-junit4-3.0.0-SNAPSHOT.jar to /home/jenkins/jenkins-slave/workspace/maven2surefire-jvm-communication@2/.m2/org/apache/maven/surefire/surefire-junit4/3.0.0-SNAPSHOT/surefire-junit4-3.0.0-SNAPSHOT.jar
[2019-10-04T06:31:56.330Z] [INFO] Installing /home/jenkins/jenkins-slave/workspace/maven2surefire-jvm-communication@2/surefire-providers/surefire-junit4/pom.xml to /home/jenkins/jenkins-slave/workspace/maven2surefire-jvm-communication@2/.m2/org/apache/maven/surefire/surefire-junit4/3.0.0-SNAPSHOT/surefire-junit4-3.0.0-SNAPSHOT.pom
[2019-10-04T06:31:56.330Z] [INFO]
[2019-10-04T06:31:56.330Z] [INFO] ----------< org.apache.maven.surefire:maven-surefire-common >-----------
[2019-10-04T06:31:56.330Z] [INFO] Building Maven Surefire Common 3.0.0-SNAPSHOT                    [15/25]
[2019-10-04T06:31:56.330Z] [INFO] --------------------------------[ jar ]---------------------------------
[2019-10-04T06:31:56.330Z] [INFO] Downloading from central: https://repo.maven.apache.org/maven2/org/apache/maven/shared/maven-common-artifact-filters/3.1.0/maven-common-artifact-filters-3.1.0.pom
[2019-10-04T06:31:56.330Z] [INFO] Downloaded from central: https://repo.maven.apache.org/maven2/org/apache/maven/shared/maven-common-artifact-filters/3.1.0/maven-common-artifact-filters-3.1.0.pom (5.3 kB at 378 kB/s)
[2019-10-04T06:31:56.330Z] [INFO] Downloading from central: https://repo.maven.apache.org/maven2/org/apache/maven/shared/maven-shared-components/33/maven-shared-components-33.pom
[2019-10-04T06:31:56.330Z] [INFO] Downloaded from central: https://repo.maven.apache.org/maven2/org/apache/maven/shared/maven-shared-components/33/maven-shared-components-33.pom (5.1 kB at 425 kB/s)
[2019-10-04T06:31:56.330Z] [INFO] Downloading from central: https://repo.maven.apache.org/maven2/org/apache/maven/shared/maven-artifact-transfer/0.11.0/maven-artifact-transfer-0.11.0.pom
[2019-10-04T06:31:57.563Z] [INFO] Downloaded from central: https://repo.maven.apache.org/maven2/org/apache/maven/shared/maven-artifact-transfer/0.11.0/maven-artifact-transfer-0.11.0.pom (11 kB at 954 kB/s)
[2019-10-04T06:31:57.563Z] [INFO] Downloading from central: https://repo.maven.apache.org/maven2/org/codehaus/plexus/plexus-java/1.0.3/plexus-java-1.0.3.pom
[2019-10-04T06:31:57.563Z] [INFO] Downloaded from central: https://repo.maven.apache.org/maven2/org/codehaus/plexus/plexus-java/1.0.3/plexus-java-1.0.3.pom (4.8 kB at 433 kB/s)
[2019-10-04T06:31:57.563Z] [INFO] Downloading from central: https://repo.maven.apache.org/maven2/org/codehaus/plexus/plexus-languages/1.0.3/plexus-languages-1.0.3.pom
[2019-10-04T06:31:57.563Z] [INFO] Downloaded from central: https://repo.maven.apache.org/maven2/org/codehaus/plexus/plexus-languages/1.0.3/plexus-languages-1.0.3.pom (4.2 kB at 352 kB/s)
[2019-10-04T06:31:57.563Z] [INFO] Downloading from central: https://repo.maven.apache.org/maven2/org/ow2/asm/asm/7.0/asm-7.0.pom
[2019-10-04T06:31:57.563Z] [INFO] Downloaded from central: https://repo.maven.apache.org/maven2/org/ow2/asm/asm/7.0/asm-7.0.pom (2.9 kB at 267 kB/s)
[2019-10-04T06:31:57.563Z] [INFO] Downloading from central: https://repo.maven.apache.org/maven2/org/fusesource/jansi/jansi/1.13/jansi-1.13.pom
[2019-10-04T06:31:57.563Z] [INFO] Downloaded from central: https://repo.maven.apache.org/maven2/org/fusesource/jansi/jansi/1.13/jansi-1.13.pom (3.7 kB at 309 kB/s)
[2019-10-04T06:31:57.563Z] [INFO] Downloading from central: https://repo.maven.apache.org/maven2/org/fusesource/jansi/jansi-project/1.13/jansi-project-1.13.pom
[2019-10-04T06:31:57.563Z] [INFO] Downloaded from central: https://repo.maven.apache.org/maven2/org/fusesource/jansi/jansi-project/1.13/jansi-project-1.13.pom (12 kB at 909 kB/s)
[2019-10-04T06:31:57.563Z] [INFO] Downloading from central: https://repo.maven.apache.org/maven2/org/fusesource/fusesource-pom/1.11/fusesource-pom-1.11.pom
[2019-10-04T06:31:57.563Z] [INFO] Downloaded from central: https://repo.maven.apache.org/maven2/org/fusesource/fusesource-pom/1.11/fusesource-pom-1.11.pom (15 kB at 1.1 MB/s)
[2019-10-04T06:31:57.563Z] [INFO] Downloading from central: https://repo.maven.apache.org/maven2/org/apache/maven/shared/maven-common-artifact-filters/3.1.0/maven-common-artifact-filters-3.1.0.jar
[2019-10-04T06:31:57.563Z] [INFO] Downloading from central: https://repo.maven.apache.org/maven2/org/ow2/asm/asm/7.0/asm-7.0.jar
[2019-10-04T06:31:57.563Z] [INFO] Downloading from central: https://repo.maven.apache.org/maven2/org/codehaus/plexus/plexus-java/1.0.3/plexus-java-1.0.3.jar
[2019-10-04T06:31:57.563Z] [INFO] Downloading from central: https://repo.maven.apache.org/maven2/org/apache/maven/shared/maven-artifact-transfer/0.11.0/maven-artifact-transfer-0.11.0.jar
[2019-10-04T06:31:57.563Z] [INFO] Downloading from central: https://repo.maven.apache.org/maven2/org/fusesource/jansi/jansi/1.13/jansi-1.13.jar
[2019-10-04T06:31:57.563Z] [INFO] Downloaded from central: https://repo.maven.apache.org/maven2/org/apache/maven/shared/maven-common-artifact-filters/3.1.0/maven-common-artifact-filters-3.1.0.jar (61 kB at 2.9 MB/s)
[2019-10-04T06:31:57.563Z] [INFO] Downloaded from central: https://repo.maven.apache.org/maven2/org/codehaus/plexus/plexus-java/1.0.3/plexus-java-1.0.3.jar (51 kB at 2.3 MB/s)
[2019-10-04T06:31:57.563Z] [INFO] Downloaded from central: https://repo.maven.apache.org/maven2/org/fusesource/jansi/jansi/1.13/jansi-1.13.jar (152 kB at 4.9 MB/s)
[2019-10-04T06:31:57.564Z] [INFO] Downloaded from central: https://repo.maven.apache.org/maven2/org/ow2/asm/asm/7.0/asm-7.0.jar (114 kB at 3.3 MB/s)
[2019-10-04T06:31:57.564Z] [INFO] Downloaded from central: https://repo.maven.apache.org/maven2/org/apache/maven/shared/maven-artifact-transfer/0.11.0/maven-artifact-transfer-0.11.0.jar (128 kB at 3.4 MB/s)
[2019-10-04T06:31:57.564Z] [INFO]
[2019-10-04T06:31:57.564Z] [INFO] --- maven-clean-plugin:3.1.0:clean (default-clean) @ maven-surefire-common ---
[2019-10-04T06:31:57.564Z] [INFO]
[2019-10-04T06:31:57.564Z] [INFO] --- maven-enforcer-plugin:3.0.0-M2:enforce (enforce-maven-version) @ maven-surefire-common ---
[2019-10-04T06:31:57.564Z] [INFO]
[2019-10-04T06:31:57.564Z] [INFO] --- maven-enforcer-plugin:3.0.0-M2:enforce (enforce-bytecode-version) @ maven-surefire-common ---
[2019-10-04T06:31:57.564Z] [WARNING] Invalid bytecodeVersion for module-info.class: expected 51, but was 53
[2019-10-04T06:31:57.564Z] [INFO]
[2019-10-04T06:31:57.564Z] [INFO] --- maven-enforcer-plugin:3.0.0-M2:enforce (ban-known-bad-maven-versions) @ maven-surefire-common ---
[2019-10-04T06:31:57.564Z] [INFO]
[2019-10-04T06:31:57.564Z] [INFO] --- maven-enforcer-plugin:3.0.0-M2:enforce (enforce-java) @ maven-surefire-common ---
[2019-10-04T06:31:57.564Z] [INFO]
[2019-10-04T06:31:57.564Z] [INFO] --- maven-enforcer-plugin:3.0.0-M2:enforce (enforce-maven) @ maven-surefire-common ---
[2019-10-04T06:31:57.564Z] [INFO]
[2019-10-04T06:31:57.564Z] [INFO] --- apache-rat-plugin:0.12:check (rat-check) @ maven-surefire-common ---
[2019-10-04T06:31:57.564Z] [INFO] Enabled default license matchers.
[2019-10-04T06:31:57.564Z] [INFO] Will parse SCM ignores for exclusions...
[2019-10-04T06:31:57.564Z] [INFO] Finished adding exclusions from SCM ignore files.
[2019-10-04T06:31:57.564Z] [INFO] 61 implicit excludes (use -debug for more details).
[2019-10-04T06:31:57.564Z] [INFO] Exclude: .repository/**
[2019-10-04T06:31:57.564Z] [INFO] Exclude: .maven/spy.log
[2019-10-04T06:31:57.564Z] [INFO] Exclude: dependency-reduced-pom.xml
[2019-10-04T06:31:57.564Z] [INFO] Exclude: .java-version
[2019-10-04T06:31:57.564Z] [INFO] Exclude: Jenkinsfile
[2019-10-04T06:31:57.564Z] [INFO] Exclude: README.md
[2019-10-04T06:31:57.564Z] [INFO] Exclude: .gitignore
[2019-10-04T06:31:57.564Z] [INFO] Exclude: .git/**/*
[2019-10-04T06:31:57.564Z] [INFO] Exclude: **/.idea
[2019-10-04T06:31:57.564Z] [INFO] Exclude: **/.svn/**/*
[2019-10-04T06:31:57.564Z] [INFO] Exclude: **/*.iml
[2019-10-04T06:31:57.564Z] [INFO] Exclude: **/*.ipr
[2019-10-04T06:31:57.564Z] [INFO] Exclude: **/*.iws
[2019-10-04T06:31:57.564Z] [INFO] Exclude: **/*.versionsBackup
[2019-10-04T06:31:57.564Z] [INFO] Exclude: **/dependency-reduced-pom.xml
[2019-10-04T06:31:57.564Z] [INFO] Exclude: .repository/**
[2019-10-04T06:31:57.564Z] [INFO] Exclude: src/test/resources/**/*
[2019-10-04T06:31:57.564Z] [INFO] Exclude: src/test/resources/**/*.css
[2019-10-04T06:31:57.564Z] [INFO] Exclude: **/*.jj
[2019-10-04T06:31:57.564Z] [INFO] Exclude: src/main/resources/META-INF/services/org.apache.maven.surefire.providerapi.SurefireProvider
[2019-10-04T06:31:57.564Z] [INFO] Exclude: DEPENDENCIES
[2019-10-04T06:31:57.564Z] [INFO] Exclude: .m2/**
[2019-10-04T06:31:57.564Z] [INFO] Exclude: .m2
[2019-10-04T06:31:57.564Z] [INFO] Exclude: .travis.yml
[2019-10-04T06:31:57.564Z] [INFO] 143 resources included (use -debug for more details)
[2019-10-04T06:31:57.564Z] [INFO] Rat check: Summary over all files. Unapproved: 0, unknown: 0, generated: 0, approved: 143 licenses.
[2019-10-04T06:31:57.564Z] [INFO]
[2019-10-04T06:31:57.564Z] [INFO] --- maven-compiler-plugin:3.7.0:compile (compile-generated) @ maven-surefire-common ---
[2019-10-04T06:31:57.564Z] [INFO] Nothing to compile - all classes are up to date
[2019-10-04T06:31:57.564Z] [INFO]
[2019-10-04T06:31:57.564Z] [INFO] --- maven-remote-resources-plugin:1.5:process (process-resource-bundles) @ maven-surefire-common ---
[2019-10-04T06:31:58.390Z] [INFO]
[2019-10-04T06:31:58.390Z] [INFO] --- maven-resources-plugin:3.1.0:resources (default-resources) @ maven-surefire-common ---
[2019-10-04T06:31:58.390Z] [INFO] Using 'UTF-8' encoding to copy filtered resources.
[2019-10-04T06:31:58.390Z] [INFO] skip non existing resourceDirectory /home/jenkins/jenkins-slave/workspace/maven2surefire-jvm-communication@2/maven-surefire-common/src/main/resources
[2019-10-04T06:31:58.390Z] [INFO] Copying 3 resources
[2019-10-04T06:31:58.390Z] [INFO]
[2019-10-04T06:31:58.390Z] [INFO] --- maven-compiler-plugin:3.7.0:compile (default-compile) @ maven-surefire-common ---
[2019-10-04T06:31:58.390Z] [INFO] Changes detected - recompiling the module!
[2019-10-04T06:31:58.390Z] [INFO] Compiling 92 source files to /home/jenkins/jenkins-slave/workspace/maven2surefire-jvm-communication@2/maven-surefire-common/target/classes
[2019-10-04T06:32:00.887Z] [INFO] -------------------------------------------------------------
[2019-10-04T06:32:00.887Z] [ERROR] COMPILATION ERROR :
[2019-10-04T06:32:00.887Z] [INFO] -------------------------------------------------------------
[2019-10-04T06:32:00.887Z] [ERROR] /home/jenkins/jenkins-slave/workspace/maven2surefire-jvm-communication@2/maven-surefire-common/src/main/java/org/apache/maven/plugin/surefire/booterclient/lazytestprovider/DefaultCommandReader.java:[78,4] error: method does not override or implement a method from a supertype
[2019-10-04T06:32:00.887Z] [ERROR] /home/jenkins/jenkins-slave/workspace/maven2surefire-jvm-communication@2/maven-surefire-common/src/main/java/org/apache/maven/plugin/surefire/booterclient/lazytestprovider/TestLessInputStream.java:[47,13] error: TestLessInputStream is not abstract and does not override abstract method readNextCommand() in AbstractCommandReader
[2019-10-04T06:32:00.888Z] [ERROR] /home/jenkins/jenkins-slave/workspace/maven2surefire-jvm-communication@2/maven-surefire-common/src/main/java/org/apache/maven/plugin/surefire/booterclient/ForkStarter.java:[620,52] error: cannot find symbol
[2019-10-04T06:32:00.888Z]   symbol:   variable stdOut
[2019-10-04T06:32:00.888Z]   location: class ForkStarter
[2019-10-04T06:32:00.888Z] [ERROR] /home/jenkins/jenkins-slave/workspace/maven2surefire-jvm-communication@2/maven-surefire-common/src/main/java/org/apache/maven/plugin/surefire/booterclient/lazytestprovider/TestProvidingInputStream.java:[53,13] error: TestProvidingInputStream is not abstract and does not override abstract method readNextCommand() in AbstractCommandReader
[2019-10-04T06:32:00.888Z] [INFO] 4 errors
[2019-10-04T06:32:00.888Z] [INFO] -------------------------------------------------------------
[2019-10-04T06:32:00.888Z] [INFO] ------------------------------------------------------------------------
[2019-10-04T06:32:00.888Z] [INFO] Reactor Summary for Apache Maven Surefire 3.0.0-SNAPSHOT:
[2019-10-04T06:32:00.888Z] [INFO]
[2019-10-04T06:32:00.888Z] [INFO] Apache Maven Surefire .............................. SUCCESS [ 15.405 s]
[2019-10-04T06:32:00.888Z] [INFO] SureFire Logger API ................................ SUCCESS [  9.204 s]
[2019-10-04T06:32:00.888Z] [INFO] SureFire API ....................................... SUCCESS [  8.425 s]
[2019-10-04T06:32:00.888Z] [INFO] Surefire Extensions API ............................ SUCCESS [  1.610 s]
[2019-10-04T06:32:00.888Z] [INFO] Surefire Extensions SPI ............................ SUCCESS [  1.637 s]
[2019-10-04T06:32:00.888Z] [INFO] SureFire Booter .................................... SUCCESS [ 11.550 s]
[2019-10-04T06:32:00.888Z] [INFO] Maven Surefire Test-Grouping Support ............... SUCCESS [  4.595 s]
[2019-10-04T06:32:00.888Z] [INFO] SureFire Providers ................................. SUCCESS [  0.825 s]
[2019-10-04T06:32:00.888Z] [INFO] Shared JUnit3 Provider Code ........................ SUCCESS [  3.197 s]
[2019-10-04T06:32:00.888Z] [INFO] Shared Java 5 Provider Base ........................ SUCCESS [  3.740 s]
[2019-10-04T06:32:00.888Z] [INFO] Shared JUnit4 Provider Code ........................ SUCCESS [  3.827 s]
[2019-10-04T06:32:00.888Z] [INFO] Shared JUnit48 Provider Code ....................... SUCCESS [  4.191 s]
[2019-10-04T06:32:00.888Z] [INFO] SureFire JUnit Runner .............................. SUCCESS [  3.379 s]
[2019-10-04T06:32:00.888Z] [INFO] SureFire JUnit4 Runner ............................. SUCCESS [  3.304 s]
[2019-10-04T06:32:00.888Z] [INFO] Maven Surefire Common .............................. FAILURE [  4.557 s]
[2019-10-04T06:32:00.888Z] [INFO] SureFire JUnitCore Runner .......................... SKIPPED
[2019-10-04T06:32:00.888Z] [INFO] SureFire JUnit Platform Runner ..................... SKIPPED
[2019-10-04T06:32:00.888Z] [INFO] SureFire TestNG Utils .............................. SKIPPED
[2019-10-04T06:32:00.888Z] [INFO] SureFire TestNG Runner ............................. SKIPPED
[2019-10-04T06:32:00.888Z] [INFO] ShadeFire JUnit3 Provider .......................... SKIPPED
[2019-10-04T06:32:00.888Z] [INFO] Surefire Report Parser ............................. SKIPPED
[2019-10-04T06:32:00.888Z] [INFO] Maven Surefire Plugin .............................. SKIPPED
[2019-10-04T06:32:00.888Z] [INFO] Maven Failsafe Plugin .............................. SKIPPED
[2019-10-04T06:32:00.888Z] [INFO] Maven Surefire Report Plugin ....................... SKIPPED
[2019-10-04T06:32:00.888Z] [INFO] Maven Surefire Integration Tests ................... SKIPPED
[2019-10-04T06:32:00.888Z] [INFO] ------------------------------------------------------------------------
[2019-10-04T06:32:00.888Z] [INFO] BUILD FAILURE
[2019-10-04T06:32:00.888Z] [INFO] ------------------------------------------------------------------------
[2019-10-04T06:32:00.888Z] [INFO] Total time:  01:20 min
[2019-10-04T06:32:00.888Z] [INFO] Finished at: 2019-10-04T06:32:01Z
[2019-10-04T06:32:00.888Z] [INFO] ------------------------------------------------------------------------
[2019-10-04T06:32:00.888Z] [ERROR] Failed to execute goal org.apache.maven.plugins:maven-compiler-plugin:3.7.0:compile (default-compile) on project maven-surefire-common: Compilation failure: Compilation failure:
[2019-10-04T06:32:00.888Z] [ERROR] /home/jenkins/jenkins-slave/workspace/maven2surefire-jvm-communication@2/maven-surefire-common/src/main/java/org/apache/maven/plugin/surefire/booterclient/lazytestprovider/DefaultCommandReader.java:[78,4] error: method does not override or implement a method from a supertype
[2019-10-04T06:32:00.888Z] [ERROR] /home/jenkins/jenkins-slave/workspace/maven2surefire-jvm-communication@2/maven-surefire-common/src/main/java/org/apache/maven/plugin/surefire/booterclient/lazytestprovider/TestLessInputStream.java:[47,13] error: TestLessInputStream is not abstract and does not override abstract method readNextCommand() in AbstractCommandReader
[2019-10-04T06:32:00.888Z] [ERROR] /home/jenkins/jenkins-slave/workspace/maven2surefire-jvm-communication@2/maven-surefire-common/src/main/java/org/apache/maven/plugin/surefire/booterclient/ForkStarter.java:[620,52] error: cannot find symbol
[2019-10-04T06:32:00.888Z] [ERROR]   symbol:   variable stdOut
[2019-10-04T06:32:00.888Z] [ERROR]   location: class ForkStarter
[2019-10-04T06:32:00.888Z] [ERROR] /home/jenkins/jenkins-slave/workspace/maven2surefire-jvm-communication@2/maven-surefire-common/src/main/java/org/apache/maven/plugin/surefire/booterclient/lazytestprovider/TestProvidingInputStream.java:[53,13] error: TestProvidingInputStream is not abstract and does not override abstract method readNextCommand() in AbstractCommandReader
[2019-10-04T06:32:00.888Z] [ERROR] -> [Help 1]
[2019-10-04T06:32:00.888Z] org.apache.maven.lifecycle.LifecycleExecutionException: Failed to execute goal org.apache.maven.plugins:maven-compiler-plugin:3.7.0:compile (default-compile) on project maven-surefire-common: Compilation failure
[2019-10-04T06:32:00.888Z]     at org.apache.maven.lifecycle.internal.MojoExecutor.execute (MojoExecutor.java:215)
[2019-10-04T06:32:00.888Z]     at org.apache.maven.lifecycle.internal.MojoExecutor.execute (MojoExecutor.java:156)
[2019-10-04T06:32:00.888Z]     at org.apache.maven.lifecycle.internal.MojoExecutor.execute (MojoExecutor.java:148)
[2019-10-04T06:32:00.888Z]     at org.apache.maven.lifecycle.internal.LifecycleModuleBuilder.buildProject (LifecycleModuleBuilder.java:117)
[2019-10-04T06:32:00.888Z]     at org.apache.maven.lifecycle.internal.LifecycleModuleBuilder.buildProject (LifecycleModuleBuilder.java:81)
[2019-10-04T06:32:00.889Z]     at org.apache.maven.lifecycle.internal.builder.singlethreaded.SingleThreadedBuilder.build (SingleThreadedBuilder.java:56)
[2019-10-04T06:32:00.889Z]     at org.apache.maven.lifecycle.internal.LifecycleStarter.execute (LifecycleStarter.java:128)
[2019-10-04T06:32:00.889Z]     at org.apache.maven.DefaultMaven.doExecute (DefaultMaven.java:305)
[2019-10-04T06:32:00.889Z]     at org.apache.maven.DefaultMaven.doExecute (DefaultMaven.java:192)
[2019-10-04T06:32:00.889Z]     at org.apache.maven.DefaultMaven.execute (DefaultMaven.java:105)
[2019-10-04T06:32:00.889Z]     at org.apache.maven.cli.MavenCli.execute (MavenCli.java:956)
[2019-10-04T06:32:00.889Z]     at org.apache.maven.cli.MavenCli.doMain (MavenCli.java:288)
[2019-10-04T06:32:00.889Z]     at org.apache.maven.cli.MavenCli.main (MavenCli.java:192)
[2019-10-04T06:32:00.889Z]     at sun.reflect.NativeMethodAccessorImpl.invoke0 (Native Method)
[2019-10-04T06:32:00.889Z]     at sun.reflect.NativeMethodAccessorImpl.invoke (NativeMethodAccessorImpl.java:62)
[2019-10-04T06:32:00.889Z]     at sun.reflect.DelegatingMethodAccessorImpl.invoke (DelegatingMethodAccessorImpl.java:43)
[2019-10-04T06:32:00.889Z]     at java.lang.reflect.Method.invoke (Method.java:498)
[2019-10-04T06:32:00.889Z]     at org.codehaus.plexus.classworlds.launcher.Launcher.launchEnhanced (Launcher.java:289)
[2019-10-04T06:32:00.889Z]     at org.codehaus.plexus.classworlds.launcher.Launcher.launch (Launcher.java:229)
[2019-10-04T06:32:00.889Z]     at org.codehaus.plexus.classworlds.launcher.Launcher.mainWithExitCode (Launcher.java:415)
[2019-10-04T06:32:00.889Z]     at org.codehaus.plexus.classworlds.launcher.Launcher.main (Launcher.java:356)
[2019-10-04T06:32:00.889Z] Caused by: org.apache.maven.plugin.compiler.CompilationFailureException: Compilation failure
[2019-10-04T06:32:00.889Z]     at org.apache.maven.plugin.compiler.AbstractCompilerMojo.execute (AbstractCompilerMojo.java:1161)
[2019-10-04T06:32:00.889Z]     at org.apache.maven.plugin.compiler.CompilerMojo.execute (CompilerMojo.java:168)
[2019-10-04T06:32:00.889Z]     at org.apache.maven.plugin.DefaultBuildPluginManager.executeMojo (DefaultBuildPluginManager.java:137)
[2019-10-04T06:32:00.889Z]     at org.apache.maven.lifecycle.internal.MojoExecutor.execute (MojoExecutor.java:210)
[2019-10-04T06:32:00.889Z]     at org.apache.maven.lifecycle.internal.MojoExecutor.execute (MojoExecutor.java:156)
[2019-10-04T06:32:00.889Z]     at org.apache.maven.lifecycle.internal.MojoExecutor.execute (MojoExecutor.java:148)
[2019-10-04T06:32:00.889Z]     at org.apache.maven.lifecycle.internal.LifecycleModuleBuilder.buildProject (LifecycleModuleBuilder.java:117)
[2019-10-04T06:32:00.889Z]     at org.apache.maven.lifecycle.internal.LifecycleModuleBuilder.buildProject (LifecycleModuleBuilder.java:81)
[2019-10-04T06:32:00.889Z]     at org.apache.maven.lifecycle.internal.builder.singlethreaded.SingleThreadedBuilder.build (SingleThreadedBuilder.java:56)
[2019-10-04T06:32:00.889Z]     at org.apache.maven.lifecycle.internal.LifecycleStarter.execute (LifecycleStarter.java:128)
[2019-10-04T06:32:00.889Z]     at org.apache.maven.DefaultMaven.doExecute (DefaultMaven.java:305)
[2019-10-04T06:32:00.889Z]     at org.apache.maven.DefaultMaven.doExecute (DefaultMaven.java:192)
[2019-10-04T06:32:00.889Z]     at org.apache.maven.DefaultMaven.execute (DefaultMaven.java:105)
[2019-10-04T06:32:00.889Z]     at org.apache.maven.cli.MavenCli.execute (MavenCli.java:956)
[2019-10-04T06:32:00.889Z]     at org.apache.maven.cli.MavenCli.doMain (MavenCli.java:288)
[2019-10-04T06:32:00.889Z]     at org.apache.maven.cli.MavenCli.main (MavenCli.java:192)
[2019-10-04T06:32:00.889Z]     at sun.reflect.NativeMethodAccessorImpl.invoke0 (Native Method)
[2019-10-04T06:32:00.889Z]     at sun.reflect.NativeMethodAccessorImpl.invoke (NativeMethodAccessorImpl.java:62)
[2019-10-04T06:32:00.889Z]     at sun.reflect.DelegatingMethodAccessorImpl.invoke (DelegatingMethodAccessorImpl.java:43)
[2019-10-04T06:32:00.889Z]     at java.lang.reflect.Method.invoke (Method.java:498)
[2019-10-04T06:32:00.889Z]     at org.codehaus.plexus.classworlds.launcher.Launcher.launchEnhanced (Launcher.java:289)
[2019-10-04T06:32:00.889Z]     at org.codehaus.plexus.classworlds.launcher.Launcher.launch (Launcher.java:229)
[2019-10-04T06:32:00.889Z]     at org.codehaus.plexus.classworlds.launcher.Launcher.mainWithExitCode (Launcher.java:415)
[2019-10-04T06:32:00.889Z]     at org.codehaus.plexus.classworlds.launcher.Launcher.main (Launcher.java:356)
[2019-10-04T06:32:00.889Z] [ERROR]
[2019-10-04T06:32:00.889Z] [ERROR] Re-run Maven using the -X switch to enable full debug logging.
[2019-10-04T06:32:00.889Z] [ERROR]
[2019-10-04T06:32:00.889Z] [ERROR] For more information about the errors and possible solutions, please read the following articles:
[2019-10-04T06:32:00.889Z] [ERROR] [Help 1] http://cwiki.apache.org/confluence/display/MAVEN/MojoFailureException
[2019-10-04T06:32:00.889Z] [ERROR]
[2019-10-04T06:32:00.889Z] [ERROR] After correcting the problems, you can resume the build with the command
[2019-10-04T06:32:00.889Z] [ERROR]   mvn <goals> -rf :maven-surefire-common
[Pipeline] }
[Pipeline] // withEnv
[Pipeline] }
[Pipeline] // stage
[Pipeline] fileExists
[Pipeline] fileExists
[Pipeline] archiveArtifacts
[2019-10-04T06:32:02.002Z] Archiving artifacts
[Pipeline] cleanWs
[2019-10-04T06:32:02.482Z] [WS-CLEANUP] Deleting project workspace...
[2019-10-04T06:32:02.482Z] [WS-CLEANUP] Deferred wipeout is used...
[2019-10-04T06:32:03.046Z] [WS-CLEANUP] done
[Pipeline] }
[Pipeline] // ws
[Pipeline] }
[Pipeline] // timestamps
[Pipeline] }
[Pipeline] // node
[Pipeline] }
[Pipeline] // parallel
[Pipeline] echo
Build result: FAILURE
[Pipeline] jiraIssueSelector
[Pipeline] echo
The authors of changes [].
[Pipeline] echo
Sending email ...
[Pipeline] emailext