Build failed in Jenkins: Maven TLP » maven-surefire » maven2surefire-jvm-communication #45

classic Classic list List threaded Threaded
3 messages Options
Reply | Threaded
Open this post in threaded view
|

Build failed in Jenkins: Maven TLP » maven-surefire » maven2surefire-jvm-communication #45

Apache Jenkins Server-2
See https://builds.apache.org/job/maven-box/job/maven-surefire/job/maven2surefire-jvm-communication/45/

Changes:

* add Maven 3.1.1
* covered Classpath

1 tests failed.
FAILED:  org.apache.maven.surefire.booter.ClasspathTest.testLoadInNewClassLoader

Error Message:
no !/ in spec

Stack Trace:
java.net.MalformedURLException: no !/ in spec
        at java.base/java.net.URL.<init>(URL.java:695)
        at java.base/java.net.URL.<init>(URL.java:557)
        at java.base/java.net.URL.<init>(URL.java:504)
        at org.apache.maven.surefire.booter.ClasspathTest.testLoadInNewClassLoader(ClasspathTest.java:203)
Caused by: java.lang.NullPointerException: no !/ in spec
        at java.base/sun.net.www.protocol.jar.Handler.parseAbsoluteSpec(Handler.java:168)
        at java.base/sun.net.www.protocol.jar.Handler.parseURL(Handler.java:150)
        at java.base/java.net.URL.<init>(URL.java:690)
        ... 28 more




Build log:
[...truncated 8239 lines...]
[2020-02-14T00:15:15.633Z]     at org.apache.maven.lifecycle.internal.LifecycleModuleBuilder.buildProject (LifecycleModuleBuilder.java:117)
[2020-02-14T00:15:15.633Z]     at org.apache.maven.lifecycle.internal.LifecycleModuleBuilder.buildProject (LifecycleModuleBuilder.java:81)
[2020-02-14T00:15:15.633Z]     at org.apache.maven.lifecycle.internal.builder.singlethreaded.SingleThreadedBuilder.build (SingleThreadedBuilder.java:56)
[2020-02-14T00:15:15.633Z]     at org.apache.maven.lifecycle.internal.LifecycleStarter.execute (LifecycleStarter.java:128)
[2020-02-14T00:15:15.633Z]     at org.apache.maven.DefaultMaven.doExecute (DefaultMaven.java:305)
[2020-02-14T00:15:15.633Z]     at org.apache.maven.DefaultMaven.doExecute (DefaultMaven.java:192)
[2020-02-14T00:15:15.633Z]     at org.apache.maven.DefaultMaven.execute (DefaultMaven.java:105)
[2020-02-14T00:15:15.633Z]     at org.apache.maven.cli.MavenCli.execute (MavenCli.java:956)
[2020-02-14T00:15:15.633Z]     at org.apache.maven.cli.MavenCli.doMain (MavenCli.java:288)
[2020-02-14T00:15:15.633Z]     at org.apache.maven.cli.MavenCli.main (MavenCli.java:192)
[2020-02-14T00:15:15.633Z]     at sun.reflect.NativeMethodAccessorImpl.invoke0 (Native Method)
[2020-02-14T00:15:15.633Z]     at sun.reflect.NativeMethodAccessorImpl.invoke (NativeMethodAccessorImpl.java:62)
[2020-02-14T00:15:15.633Z]     at sun.reflect.DelegatingMethodAccessorImpl.invoke (DelegatingMethodAccessorImpl.java:43)
[2020-02-14T00:15:15.633Z]     at java.lang.reflect.Method.invoke (Method.java:498)
[2020-02-14T00:15:15.633Z]     at org.codehaus.plexus.classworlds.launcher.Launcher.launchEnhanced (Launcher.java:282)
[2020-02-14T00:15:15.633Z]     at org.codehaus.plexus.classworlds.launcher.Launcher.launch (Launcher.java:225)
[2020-02-14T00:15:15.633Z]     at org.codehaus.plexus.classworlds.launcher.Launcher.mainWithExitCode (Launcher.java:406)
[2020-02-14T00:15:15.633Z]     at org.codehaus.plexus.classworlds.launcher.Launcher.main (Launcher.java:347)
[2020-02-14T00:15:15.633Z] Caused by: org.apache.maven.plugin.MojoFailureException: There are test failures.
[2020-02-14T00:15:15.633Z]
[2020-02-14T00:15:15.633Z] Please refer to C:\Users\jenkins\AppData\Local\Temp\2\jenkins-maven-box-maven-surefire-maven2surefire-jvm-communication-45@2\surefire-booter\target\surefire-reports for the individual test results.
[2020-02-14T00:15:15.633Z] Please refer to dump files (if any exist) [date].dump, [date]-jvmRun[N].dump and [date].dumpstream.
[2020-02-14T00:15:15.633Z]     at org.apache.maven.plugin.surefire.SurefireHelper.throwException (SurefireHelper.java:271)
[2020-02-14T00:15:15.633Z]     at org.apache.maven.plugin.surefire.SurefireHelper.reportExecution (SurefireHelper.java:159)
[2020-02-14T00:15:15.633Z]     at org.apache.maven.plugin.surefire.SurefirePlugin.handleSummary (SurefirePlugin.java:435)
[2020-02-14T00:15:15.633Z]     at org.apache.maven.plugin.surefire.AbstractSurefireMojo.executeAfterPreconditionsChecked (AbstractSurefireMojo.java:1079)
[2020-02-14T00:15:15.633Z]     at org.apache.maven.plugin.surefire.AbstractSurefireMojo.execute (AbstractSurefireMojo.java:889)
[2020-02-14T00:15:15.633Z]     at org.apache.maven.plugin.DefaultBuildPluginManager.executeMojo (DefaultBuildPluginManager.java:137)
[2020-02-14T00:15:15.633Z]     at org.apache.maven.lifecycle.internal.MojoExecutor.execute (MojoExecutor.java:210)
[2020-02-14T00:15:15.633Z]     at org.apache.maven.lifecycle.internal.MojoExecutor.execute (MojoExecutor.java:156)
[2020-02-14T00:15:15.633Z]     at org.apache.maven.lifecycle.internal.MojoExecutor.execute (MojoExecutor.java:148)
[2020-02-14T00:15:15.633Z]     at org.apache.maven.lifecycle.internal.LifecycleModuleBuilder.buildProject (LifecycleModuleBuilder.java:117)
[2020-02-14T00:15:15.633Z]     at org.apache.maven.lifecycle.internal.LifecycleModuleBuilder.buildProject (LifecycleModuleBuilder.java:81)
[2020-02-14T00:15:15.634Z]     at org.apache.maven.lifecycle.internal.builder.singlethreaded.SingleThreadedBuilder.build (SingleThreadedBuilder.java:56)
[2020-02-14T00:15:15.634Z]     at org.apache.maven.lifecycle.internal.LifecycleStarter.execute (LifecycleStarter.java:128)
[2020-02-14T00:15:15.634Z]     at org.apache.maven.DefaultMaven.doExecute (DefaultMaven.java:305)
[2020-02-14T00:15:15.634Z]     at org.apache.maven.DefaultMaven.doExecute (DefaultMaven.java:192)
[2020-02-14T00:15:15.634Z]     at org.apache.maven.DefaultMaven.execute (DefaultMaven.java:105)
[2020-02-14T00:15:15.634Z]     at org.apache.maven.cli.MavenCli.execute (MavenCli.java:956)
[2020-02-14T00:15:15.634Z]     at org.apache.maven.cli.MavenCli.doMain (MavenCli.java:288)
[2020-02-14T00:15:15.634Z]     at org.apache.maven.cli.MavenCli.main (MavenCli.java:192)
[2020-02-14T00:15:15.634Z]     at sun.reflect.NativeMethodAccessorImpl.invoke0 (Native Method)
[2020-02-14T00:15:15.634Z]     at sun.reflect.NativeMethodAccessorImpl.invoke (NativeMethodAccessorImpl.java:62)
[2020-02-14T00:15:15.634Z]     at sun.reflect.DelegatingMethodAccessorImpl.invoke (DelegatingMethodAccessorImpl.java:43)
[2020-02-14T00:15:15.634Z]     at java.lang.reflect.Method.invoke (Method.java:498)
[2020-02-14T00:15:15.634Z]     at org.codehaus.plexus.classworlds.launcher.Launcher.launchEnhanced (Launcher.java:282)
[2020-02-14T00:15:15.634Z]     at org.codehaus.plexus.classworlds.launcher.Launcher.launch (Launcher.java:225)
[2020-02-14T00:15:15.634Z]     at org.codehaus.plexus.classworlds.launcher.Launcher.mainWithExitCode (Launcher.java:406)
[2020-02-14T00:15:15.634Z]     at org.codehaus.plexus.classworlds.launcher.Launcher.main (Launcher.java:347)
[2020-02-14T00:15:15.634Z] [ERROR]
[2020-02-14T00:15:15.634Z] [ERROR] Re-run Maven using the -X switch to enable full debug logging.
[2020-02-14T00:15:15.634Z] [ERROR]
[2020-02-14T00:15:15.634Z] [ERROR] For more information about the errors and possible solutions, please read the following articles:
[2020-02-14T00:15:15.634Z] [ERROR] [Help 1] http://cwiki.apache.org/confluence/display/MAVEN/MojoFailureException
[2020-02-14T00:15:15.634Z] [ERROR]
[2020-02-14T00:15:15.634Z] [ERROR] After correcting the problems, you can resume the build with the command
[2020-02-14T00:15:15.634Z] [ERROR]   mvn <args> -rf :surefire-booter
[Pipeline] }
[Pipeline] // withEnv
[Pipeline] }
[Pipeline] // stage
[Pipeline] fileExists
[Pipeline] fileExists
[Pipeline] archiveArtifacts
[2020-02-14T00:15:15.801Z] Archiving artifacts
[Pipeline] cleanWs
[2020-02-14T00:15:15.848Z] [WS-CLEANUP] Deleting project workspace...
[2020-02-14T00:15:15.848Z] [WS-CLEANUP] Deferred wipeout is used...
[2020-02-14T00:15:15.892Z] [WS-CLEANUP] done
[Pipeline] }
[Pipeline] // ws
[Pipeline] }
[Pipeline] // timestamps
[Pipeline] }
[2020-02-14T00:15:16.038Z] java.lang.RuntimeException: dummy exception
[2020-02-14T00:15:16.038Z] at org.apache.maven.surefire.booter.ForkedBooter.run(ForkedBooter.java:523)
[2020-02-14T00:15:16.038Z] at org.apache.maven.surefire.booter.ForkedBooterMockTest.testMainWithError(ForkedBooterMockTest.java:155)
[2020-02-14T00:15:16.038Z] at org.junit.internal.runners.TestMethod.invoke(TestMethod.java:68)
[2020-02-14T00:15:16.038Z] at org.junit.internal.runners.MethodRoadie$2.run(MethodRoadie.java:89)
[2020-02-14T00:15:16.038Z] at org.junit.internal.runners.MethodRoadie.runBeforesThenTestThenAfters(MethodRoadie.java:97)
[2020-02-14T00:15:16.038Z] at org.junit.internal.runners.MethodRoadie.runTest(MethodRoadie.java:87)
[2020-02-14T00:15:16.038Z] at org.junit.internal.runners.MethodRoadie.run(MethodRoadie.java:50)
[2020-02-14T00:15:16.038Z] at org.junit.internal.runners.ClassRoadie.runUnprotected(ClassRoadie.java:34)
[2020-02-14T00:15:16.038Z] at org.junit.internal.runners.ClassRoadie.runProtected(ClassRoadie.java:44)
[2020-02-14T00:15:16.038Z] at junit.framework.JUnit4TestAdapter.run(JUnit4TestAdapter.java:50)
[2020-02-14T00:15:16.038Z] at junit.framework.TestSuite.runTest(TestSuite.java:241)
[2020-02-14T00:15:16.038Z] at junit.framework.TestSuite.run(TestSuite.java:236)
[2020-02-14T00:15:16.038Z] at org.apache.maven.shadefire.surefire.junit.JUnitTestSet.execute(JUnitTestSet.java:99)
[2020-02-14T00:15:16.039Z] at org.apache.maven.shadefire.surefire.junit.JUnit3Provider.executeTestSet(JUnit3Provider.java:141)
[2020-02-14T00:15:16.039Z] at org.apache.maven.shadefire.surefire.junit.JUnit3Provider.invoke(JUnit3Provider.java:114)
[2020-02-14T00:15:16.039Z] at org.apache.maven.shadefire.surefire.booter.ForkedBooter.runSuitesInProcess(ForkedBooter.java:377)
[2020-02-14T00:15:16.039Z] at org.apache.maven.shadefire.surefire.booter.ForkedBooter.execute(ForkedBooter.java:138)
[2020-02-14T00:15:16.039Z] at org.apache.maven.shadefire.surefire.booter.ForkedBooter.run(ForkedBooter.java:465)
[2020-02-14T00:15:16.039Z] at org.apache.maven.shadefire.surefire.booter.ForkedBooter.main(ForkedBooter.java:451)
[2020-02-14T00:15:16.039Z] [ERROR] Tests run: 139, Failures: 0, Errors: 1, Skipped: 0, Time elapsed: 7.355 s <<< FAILURE! - in org.apache.maven.surefire.booter.JUnit4SuiteTest
[2020-02-14T00:15:16.039Z] [ERROR] org.apache.maven.surefire.booter.ClasspathTest.testLoadInNewClassLoader  Time elapsed: 0.004 s  <<< ERROR!
[2020-02-14T00:15:16.039Z] java.net.MalformedURLException: no !/ in spec
[2020-02-14T00:15:16.039Z] at java.net.URL.<init>(URL.java:627)
[2020-02-14T00:15:16.039Z] at java.net.URL.<init>(URL.java:490)
[2020-02-14T00:15:16.039Z] at java.net.URL.<init>(URL.java:439)
[2020-02-14T00:15:16.039Z] at org.apache.maven.surefire.booter.ClasspathTest.testLoadInNewClassLoader(ClasspathTest.java:203)
[2020-02-14T00:15:16.039Z] Caused by: java.lang.NullPointerException: no !/ in spec
[2020-02-14T00:15:16.039Z] at sun.net.www.protocol.jar.Handler.parseAbsoluteSpec(Handler.java:171)
[2020-02-14T00:15:16.039Z] at sun.net.www.protocol.jar.Handler.parseURL(Handler.java:151)
[2020-02-14T00:15:16.039Z] at java.net.URL.<init>(URL.java:622)
[2020-02-14T00:15:16.039Z] ... 28 more
[2020-02-14T00:15:16.039Z]
[2020-02-14T00:15:16.039Z] [INFO]
[2020-02-14T00:15:16.039Z] [INFO] Results:
[2020-02-14T00:15:16.039Z] [INFO]
[2020-02-14T00:15:16.039Z] [ERROR] Errors:
[2020-02-14T00:15:16.039Z] [ERROR]   org.apache.maven.surefire.booter.ClasspathTest#testLoadInNewClassLoader MalformedURLException
[2020-02-14T00:15:16.039Z] [INFO]
[2020-02-14T00:15:16.039Z] [ERROR] Tests run: 139, Failures: 0, Errors: 1, Skipped: 0
[2020-02-14T00:15:16.039Z] [INFO]
[2020-02-14T00:15:16.039Z] [INFO] ------------------------------------------------------------------------
[2020-02-14T00:15:16.039Z] [INFO] Reactor Summary for Apache Maven Surefire 3.0.0-SNAPSHOT:
[2020-02-14T00:15:16.039Z] [INFO]
[2020-02-14T00:15:16.039Z] [INFO] Apache Maven Surefire .............................. SUCCESS [01:09 min]
[2020-02-14T00:15:16.039Z] [INFO] SureFire Logger API ................................ SUCCESS [ 23.208 s]
[2020-02-14T00:15:16.039Z] [INFO] SureFire API ....................................... SUCCESS [ 21.425 s]
[2020-02-14T00:15:16.039Z] [INFO] Surefire Extensions API ............................ SUCCESS [  7.490 s]
[2020-02-14T00:15:16.039Z] [INFO] Surefire Extensions SPI ............................ SUCCESS [  2.996 s]
[2020-02-14T00:15:16.039Z] [INFO] SureFire Booter .................................... FAILURE [ 22.275 s]
[2020-02-14T00:15:16.039Z] [INFO] Maven Surefire Test-Grouping Support ............... SKIPPED
[2020-02-14T00:15:16.039Z] [INFO] SureFire Providers ................................. SKIPPED
[2020-02-14T00:15:16.039Z] [INFO] Shared JUnit3 Provider Code ........................ SKIPPED
[2020-02-14T00:15:16.039Z] [INFO] Shared Java 5 Provider Base ........................ SKIPPED
[2020-02-14T00:15:16.039Z] [INFO] Shared JUnit4 Provider Code ........................ SKIPPED
[2020-02-14T00:15:16.039Z] [INFO] Shared JUnit48 Provider Code ....................... SKIPPED
[2020-02-14T00:15:16.039Z] [INFO] SureFire JUnit Runner .............................. SKIPPED
[2020-02-14T00:15:16.039Z] [INFO] SureFire JUnit4 Runner ............................. SKIPPED
[2020-02-14T00:15:16.039Z] [INFO] Maven Surefire Common .............................. SKIPPED
[2020-02-14T00:15:16.039Z] [INFO] SureFire JUnitCore Runner .......................... SKIPPED
[2020-02-14T00:15:16.039Z] [INFO] SureFire JUnit Platform Runner ..................... SKIPPED
[2020-02-14T00:15:16.039Z] [INFO] SureFire TestNG Utils .............................. SKIPPED
[2020-02-14T00:15:16.039Z] [INFO] SureFire TestNG Runner ............................. SKIPPED
[2020-02-14T00:15:16.039Z] [INFO] ShadeFire JUnit3 Provider .......................... SKIPPED
[2020-02-14T00:15:16.039Z] [INFO] Surefire Report Parser ............................. SKIPPED
[2020-02-14T00:15:16.039Z] [INFO] Maven Surefire Plugin .............................. SKIPPED
[2020-02-14T00:15:16.039Z] [INFO] Maven Failsafe Plugin .............................. SKIPPED
[2020-02-14T00:15:16.039Z] [INFO] Maven Surefire Report Plugin ....................... SKIPPED
[2020-02-14T00:15:16.039Z] [INFO] Maven Surefire Integration Tests ................... SKIPPED
[2020-02-14T00:15:16.039Z] [INFO] Surefire Shared Utils .............................. SKIPPED
[2020-02-14T00:15:16.039Z] [INFO] ------------------------------------------------------------------------
[2020-02-14T00:15:16.039Z] [INFO] BUILD FAILURE
[2020-02-14T00:15:16.039Z] [INFO] ------------------------------------------------------------------------
[2020-02-14T00:15:16.039Z] [INFO] Total time:  02:28 min
[2020-02-14T00:15:16.039Z] [INFO] Finished at: 2020-02-13T16:15:15-08:00
[2020-02-14T00:15:16.039Z] [INFO] ------------------------------------------------------------------------
[2020-02-14T00:15:16.039Z] [ERROR] Failed to execute goal org.apache.maven.plugins:maven-surefire-plugin:3.0.0-M4:test (default-test) on project surefire-booter: There are test failures.
[2020-02-14T00:15:16.039Z] [ERROR]
[2020-02-14T00:15:16.039Z] [ERROR] Please refer to C:\Users\jenkins\AppData\Local\Temp\2\jenkins-maven-box-maven-surefire-maven2surefire-jvm-communication-45\surefire-booter\target\surefire-reports for the individual test results.
[2020-02-14T00:15:16.039Z] [ERROR] Please refer to dump files (if any exist) [date].dump, [date]-jvmRun[N].dump and [date].dumpstream.
[2020-02-14T00:15:16.040Z] [ERROR] -> [Help 1]
[2020-02-14T00:15:16.040Z] org.apache.maven.lifecycle.LifecycleExecutionException: Failed to execute goal org.apache.maven.plugins:maven-surefire-plugin:3.0.0-M4:test (default-test) on project surefire-booter: There are test failures.
[2020-02-14T00:15:16.040Z]
[2020-02-14T00:15:16.040Z] Please refer to C:\Users\jenkins\AppData\Local\Temp\2\jenkins-maven-box-maven-surefire-maven2surefire-jvm-communication-45\surefire-booter\target\surefire-reports for the individual test results.
[2020-02-14T00:15:16.040Z] Please refer to dump files (if any exist) [date].dump, [date]-jvmRun[N].dump and [date].dumpstream.
[2020-02-14T00:15:16.040Z]     at org.apache.maven.lifecycle.internal.MojoExecutor.execute (MojoExecutor.java:215)
[2020-02-14T00:15:16.040Z]     at org.apache.maven.lifecycle.internal.MojoExecutor.execute (MojoExecutor.java:156)
[2020-02-14T00:15:16.040Z]     at org.apache.maven.lifecycle.internal.MojoExecutor.execute (MojoExecutor.java:148)
[2020-02-14T00:15:16.040Z]     at org.apache.maven.lifecycle.internal.LifecycleModuleBuilder.buildProject (LifecycleModuleBuilder.java:117)
[2020-02-14T00:15:16.040Z]     at org.apache.maven.lifecycle.internal.LifecycleModuleBuilder.buildProject (LifecycleModuleBuilder.java:81)
[2020-02-14T00:15:16.040Z]     at org.apache.maven.lifecycle.internal.builder.singlethreaded.SingleThreadedBuilder.build (SingleThreadedBuilder.java:56)
[2020-02-14T00:15:16.040Z]     at org.apache.maven.lifecycle.internal.LifecycleStarter.execute (LifecycleStarter.java:128)
[2020-02-14T00:15:16.040Z]     at org.apache.maven.DefaultMaven.doExecute (DefaultMaven.java:305)
[2020-02-14T00:15:16.040Z]     at org.apache.maven.DefaultMaven.doExecute (DefaultMaven.java:192)
[2020-02-14T00:15:16.040Z]     at org.apache.maven.DefaultMaven.execute (DefaultMaven.java:105)
[2020-02-14T00:15:16.040Z]     at org.apache.maven.cli.MavenCli.execute (MavenCli.java:956)
[2020-02-14T00:15:16.040Z]     at org.apache.maven.cli.MavenCli.doMain (MavenCli.java:288)
[2020-02-14T00:15:16.040Z]     at org.apache.maven.cli.MavenCli.main (MavenCli.java:192)
[2020-02-14T00:15:16.040Z]     at sun.reflect.NativeMethodAccessorImpl.invoke0 (Native Method)
[2020-02-14T00:15:16.040Z]     at sun.reflect.NativeMethodAccessorImpl.invoke (NativeMethodAccessorImpl.java:62)
[2020-02-14T00:15:16.040Z]     at sun.reflect.DelegatingMethodAccessorImpl.invoke (DelegatingMethodAccessorImpl.java:43)
[2020-02-14T00:15:16.040Z]     at java.lang.reflect.Method.invoke (Method.java:498)
[2020-02-14T00:15:16.040Z]     at org.codehaus.plexus.classworlds.launcher.Launcher.launchEnhanced (Launcher.java:282)
[2020-02-14T00:15:16.040Z]     at org.codehaus.plexus.classworlds.launcher.Launcher.launch (Launcher.java:225)
[2020-02-14T00:15:16.040Z]     at org.codehaus.plexus.classworlds.launcher.Launcher.mainWithExitCode (Launcher.java:406)
[2020-02-14T00:15:16.040Z]     at org.codehaus.plexus.classworlds.launcher.Launcher.main (Launcher.java:347)
[2020-02-14T00:15:16.040Z] Caused by: org.apache.maven.plugin.MojoFailureException: There are test failures.
[2020-02-14T00:15:16.040Z]
[2020-02-14T00:15:16.040Z] Please refer to C:\Users\jenkins\AppData\Local\Temp\2\jenkins-maven-box-maven-surefire-maven2surefire-jvm-communication-45\surefire-booter\target\surefire-reports for the individual test results.
[2020-02-14T00:15:16.040Z] Please refer to dump files (if any exist) [date].dump, [date]-jvmRun[N].dump and [date].dumpstream.
[2020-02-14T00:15:16.040Z]     at org.apache.maven.plugin.surefire.SurefireHelper.throwException (SurefireHelper.java:271)
[2020-02-14T00:15:16.040Z]     at org.apache.maven.plugin.surefire.SurefireHelper.reportExecution (SurefireHelper.java:159)
[2020-02-14T00:15:16.040Z]     at org.apache.maven.plugin.surefire.SurefirePlugin.handleSummary (SurefirePlugin.java:435)
[2020-02-14T00:15:16.040Z]     at org.apache.maven.plugin.surefire.AbstractSurefireMojo.executeAfterPreconditionsChecked (AbstractSurefireMojo.java:1079)
[2020-02-14T00:15:16.040Z]     at org.apache.maven.plugin.surefire.AbstractSurefireMojo.execute (AbstractSurefireMojo.java:889)
[2020-02-14T00:15:16.040Z]     at org.apache.maven.plugin.DefaultBuildPluginManager.executeMojo (DefaultBuildPluginManager.java:137)
[2020-02-14T00:15:16.041Z]     at org.apache.maven.lifecycle.internal.MojoExecutor.execute (MojoExecutor.java:210)
[2020-02-14T00:15:16.041Z]     at org.apache.maven.lifecycle.internal.MojoExecutor.execute (MojoExecutor.java:156)
[2020-02-14T00:15:16.041Z]     at org.apache.maven.lifecycle.internal.MojoExecutor.execute (MojoExecutor.java:148)
[2020-02-14T00:15:16.041Z]     at org.apache.maven.lifecycle.internal.LifecycleModuleBuilder.buildProject (LifecycleModuleBuilder.java:117)
[2020-02-14T00:15:16.041Z]     at org.apache.maven.lifecycle.internal.LifecycleModuleBuilder.buildProject (LifecycleModuleBuilder.java:81)
[2020-02-14T00:15:16.041Z]     at org.apache.maven.lifecycle.internal.builder.singlethreaded.SingleThreadedBuilder.build (SingleThreadedBuilder.java:56)
[2020-02-14T00:15:16.041Z]     at org.apache.maven.lifecycle.internal.LifecycleStarter.execute (LifecycleStarter.java:128)
[2020-02-14T00:15:16.041Z]     at org.apache.maven.DefaultMaven.doExecute (DefaultMaven.java:305)
[2020-02-14T00:15:16.041Z]     at org.apache.maven.DefaultMaven.doExecute (DefaultMaven.java:192)
[2020-02-14T00:15:16.041Z]     at org.apache.maven.DefaultMaven.execute (DefaultMaven.java:105)
[2020-02-14T00:15:16.041Z]     at org.apache.maven.cli.MavenCli.execute (MavenCli.java:956)
[2020-02-14T00:15:16.041Z]     at org.apache.maven.cli.MavenCli.doMain (MavenCli.java:288)
[2020-02-14T00:15:16.041Z]     at org.apache.maven.cli.MavenCli.main (MavenCli.java:192)
[2020-02-14T00:15:16.041Z]     at sun.reflect.NativeMethodAccessorImpl.invoke0 (Native Method)
[2020-02-14T00:15:16.041Z]     at sun.reflect.NativeMethodAccessorImpl.invoke (NativeMethodAccessorImpl.java:62)
[2020-02-14T00:15:16.041Z]     at sun.reflect.DelegatingMethodAccessorImpl.invoke (DelegatingMethodAccessorImpl.java:43)
[2020-02-14T00:15:16.041Z]     at java.lang.reflect.Method.invoke (Method.java:498)
[2020-02-14T00:15:16.041Z]     at org.codehaus.plexus.classworlds.launcher.Launcher.launchEnhanced (Launcher.java:282)
[2020-02-14T00:15:16.041Z]     at org.codehaus.plexus.classworlds.launcher.Launcher.launch (Launcher.java:225)
[2020-02-14T00:15:16.041Z]     at org.codehaus.plexus.classworlds.launcher.Launcher.mainWithExitCode (Launcher.java:406)
[2020-02-14T00:15:16.041Z]     at org.codehaus.plexus.classworlds.launcher.Launcher.main (Launcher.java:347)
[2020-02-14T00:15:16.041Z] [ERROR]
[2020-02-14T00:15:16.041Z] [ERROR] Re-run Maven using the -X switch to enable full debug logging.
[2020-02-14T00:15:16.041Z] [ERROR]
[2020-02-14T00:15:16.041Z] [ERROR] For more information about the errors and possible solutions, please read the following articles:
[2020-02-14T00:15:16.041Z] [ERROR] [Help 1] http://cwiki.apache.org/confluence/display/MAVEN/MojoFailureException
[2020-02-14T00:15:16.041Z] [ERROR]
[2020-02-14T00:15:16.041Z] [ERROR] After correcting the problems, you can resume the build with the command
[2020-02-14T00:15:16.041Z] [ERROR]   mvn <args> -rf :surefire-booter
[Pipeline] // node
[Pipeline] }
[Pipeline] }
[Pipeline] // withEnv
[Pipeline] }
[Pipeline] // stage
[Pipeline] fileExists
[Pipeline] fileExists
[Pipeline] archiveArtifacts
[2020-02-14T00:15:16.338Z] Archiving artifacts
[Pipeline] cleanWs
[2020-02-14T00:15:16.419Z] [WS-CLEANUP] Deleting project workspace...
[2020-02-14T00:15:16.419Z] [WS-CLEANUP] Deferred wipeout is used...
[2020-02-14T00:15:16.477Z] [WS-CLEANUP] done
[Pipeline] }
[Pipeline] // ws
[Pipeline] }
[Pipeline] // timestamps
[Pipeline] }
[Pipeline] // node
[Pipeline] }
[Pipeline] // parallel
[Pipeline] echo
Build result: FAILURE
[Pipeline] jiraIssueSelector
[Pipeline] echo
The authors of changes [tibordigana].
[Pipeline] echo
Sending email ...
[Pipeline] emailext
Reply | Threaded
Open this post in threaded view
|

Build failed in Jenkins: Maven TLP » maven-surefire » maven2surefire-jvm-communication #46

Apache Jenkins Server-2
See https://builds.apache.org/job/maven-box/job/maven-surefire/job/maven2surefire-jvm-communication/46/

Changes:

* fix testLoadInNewClassLoader

1 tests failed.
FAILED:  org.apache.maven.surefire.booter.ClasspathTest.testLoadInNewClassLoader

Error Message:
no !/ in spec

Stack Trace:
java.net.MalformedURLException: no !/ in spec
        at java.base/java.net.URL.<init>(URL.java:695)
        at java.base/java.net.URL.<init>(URL.java:557)
        at java.base/java.net.URL.<init>(URL.java:504)
        at org.apache.maven.surefire.booter.ClasspathTest.testLoadInNewClassLoader(ClasspathTest.java:203)
Caused by: java.lang.NullPointerException: no !/ in spec
        at java.base/sun.net.www.protocol.jar.Handler.parseAbsoluteSpec(Handler.java:168)
        at java.base/sun.net.www.protocol.jar.Handler.parseURL(Handler.java:150)
        at java.base/java.net.URL.<init>(URL.java:690)
        ... 28 more




Build log:
[...truncated 8237 lines...]
[2020-02-14T01:01:23.142Z] [INFO] Will parse SCM ignores for exclusions...
[2020-02-14T01:01:23.142Z] [INFO] Finished adding exclusions from SCM ignore files.
[2020-02-14T01:01:23.142Z] [INFO] 61 implicit excludes (use -debug for more details).
[2020-02-14T01:01:23.142Z] [INFO] Exclude: .repository/**
[2020-02-14T01:01:23.142Z] [INFO] Exclude: .maven/spy.log
[2020-02-14T01:01:23.142Z] [INFO] Exclude: dependency-reduced-pom.xml
[2020-02-14T01:01:23.142Z] [INFO] Exclude: .java-version
[2020-02-14T01:01:23.142Z] [INFO] Exclude: Jenkinsfile
[2020-02-14T01:01:23.142Z] [INFO] Exclude: README.md
[2020-02-14T01:01:23.142Z] [INFO] Exclude: .editorconfig
[2020-02-14T01:01:23.142Z] [INFO] Exclude: .gitignore
[2020-02-14T01:01:23.142Z] [INFO] Exclude: .git/**/*
[2020-02-14T01:01:23.142Z] [INFO] Exclude: **/.github/**
[2020-02-14T01:01:23.142Z] [INFO] Exclude: **/.idea
[2020-02-14T01:01:23.142Z] [INFO] Exclude: **/.svn/**/*
[2020-02-14T01:01:23.142Z] [INFO] Exclude: **/*.iml
[2020-02-14T01:01:23.142Z] [INFO] Exclude: **/*.ipr
[2020-02-14T01:01:23.142Z] [INFO] Exclude: **/*.iws
[2020-02-14T01:01:23.142Z] [INFO] Exclude: **/*.versionsBackup
[2020-02-14T01:01:23.142Z] [INFO] Exclude: **/dependency-reduced-pom.xml
[2020-02-14T01:01:23.142Z] [INFO] Exclude: .repository/**
[2020-02-14T01:01:23.142Z] [INFO] Exclude: src/test/resources/**/*
[2020-02-14T01:01:23.142Z] [INFO] Exclude: src/test/resources/**/*.css
[2020-02-14T01:01:23.142Z] [INFO] Exclude: **/*.jj
[2020-02-14T01:01:23.142Z] [INFO] Exclude: src/main/resources/META-INF/services/org.apache.maven.surefire.providerapi.SurefireProvider
[2020-02-14T01:01:23.142Z] [INFO] Exclude: DEPENDENCIES
[2020-02-14T01:01:23.142Z] [INFO] Exclude: .m2/**
[2020-02-14T01:01:23.142Z] [INFO] Exclude: .m2
[2020-02-14T01:01:23.142Z] [INFO] Exclude: .travis.yml
[2020-02-14T01:01:23.142Z] [INFO] 49 resources included (use -debug for more details)
[2020-02-14T01:01:23.743Z] [INFO] Rat check: Summary over all files. Unapproved: 0, unknown: 0, generated: 0, approved: 49 licenses.
[2020-02-14T01:01:23.743Z] [INFO]
[2020-02-14T01:01:23.743Z] [INFO] --- jacoco-maven-plugin:0.8.5:prepare-agent (jacoco-agent) @ surefire-booter ---
[2020-02-14T01:01:23.743Z] [INFO] Skipping JaCoCo execution because property jacoco.skip is set.
[2020-02-14T01:01:23.743Z] [INFO] jacoco.agent set to empty
[2020-02-14T01:01:23.743Z] [INFO]
[2020-02-14T01:01:23.743Z] [INFO] --- maven-dependency-plugin:3.1.1:build-classpath (build-test-classpath) @ surefire-booter ---
[2020-02-14T01:01:27.127Z] [INFO] Wrote classpath file 'C:\Users\jenkins\AppData\Local\Temp\2\jenkins-maven-box-maven-surefire-maven2surefire-jvm-communication-46\surefire-booter\target\test-classpath\cp.txt'.
[2020-02-14T01:01:27.127Z] [INFO]
[2020-02-14T01:01:27.521Z] [INFO] --- maven-compiler-plugin:3.7.0:compile (compile-generated) @ surefire-booter ---
[2020-02-14T01:01:27.521Z] [INFO] Nothing to compile - all classes are up to date
[2020-02-14T01:01:27.521Z] [INFO]
[2020-02-14T01:01:27.521Z] [INFO] --- maven-remote-resources-plugin:1.5:process (process-resource-bundles) @ surefire-booter ---
[2020-02-14T01:01:27.521Z] [INFO]
[2020-02-14T01:01:27.521Z] [INFO] --- maven-resources-plugin:3.1.0:resources (default-resources) @ surefire-booter ---
[2020-02-14T01:01:27.521Z] [INFO] Using 'UTF-8' encoding to copy filtered resources.
[2020-02-14T01:01:27.521Z] [INFO] Copying 1 resource
[2020-02-14T01:01:27.521Z] [INFO] Copying 3 resources
[2020-02-14T01:01:27.521Z] [INFO]
[2020-02-14T01:01:27.521Z] [INFO] --- maven-compiler-plugin:3.7.0:compile (default-compile) @ surefire-booter ---
[2020-02-14T01:01:27.521Z] [INFO] Changes detected - recompiling the module!
[2020-02-14T01:01:27.521Z] [INFO] Compiling 32 source files to C:\Users\jenkins\AppData\Local\Temp\2\jenkins-maven-box-maven-surefire-maven2surefire-jvm-communication-46\surefire-booter\target\classes
[2020-02-14T01:01:30.990Z] [INFO]
[2020-02-14T01:01:30.990Z] [INFO] --- animal-sniffer-maven-plugin:1.17:check (signature-check) @ surefire-booter ---
[2020-02-14T01:01:30.990Z] [INFO] Checking unresolved references to org.codehaus.mojo.signature:java17:1.0
[2020-02-14T01:01:30.990Z] [INFO]
[2020-02-14T01:01:30.990Z] [INFO] --- maven-resources-plugin:3.1.0:testResources (default-testResources) @ surefire-booter ---
[2020-02-14T01:01:30.990Z] [INFO] Using 'UTF-8' encoding to copy filtered resources.
[2020-02-14T01:01:30.990Z] [INFO] Copying 7 resources
[2020-02-14T01:01:30.990Z] [INFO] Copying 3 resources
[2020-02-14T01:01:30.990Z] [INFO]
[2020-02-14T01:01:30.990Z] [INFO] --- maven-compiler-plugin:3.7.0:testCompile (default-testCompile) @ surefire-booter ---
[2020-02-14T01:01:30.990Z] [INFO] Changes detected - recompiling the module!
[2020-02-14T01:01:30.990Z] [INFO] Compiling 15 source files to C:\Users\jenkins\AppData\Local\Temp\2\jenkins-maven-box-maven-surefire-maven2surefire-jvm-communication-46\surefire-booter\target\test-classes
[2020-02-14T01:01:34.353Z] [INFO]
[2020-02-14T01:01:34.353Z] [INFO] --- maven-surefire-plugin:3.0.0-M4:test (default-test) @ surefire-booter ---
[2020-02-14T01:01:34.353Z] [INFO] Surefire report directory: C:\Users\jenkins\AppData\Local\Temp\2\jenkins-maven-box-maven-surefire-maven2surefire-jvm-communication-46\surefire-booter\target\surefire-reports
[2020-02-14T01:01:34.353Z] [INFO] Using configured provider org.apache.maven.shadefire.surefire.junit.JUnit3Provider
[2020-02-14T01:01:34.353Z] [WARNING] The system property java.awt.headless is configured twice! The property appears in <argLine/> and any of <systemPropertyVariables/>, <systemProperties/> or user property.
[2020-02-14T01:01:34.353Z] [INFO] parallel='none', perCoreThreadCount=true, threadCount=0, useUnlimitedThreads=false, threadCountSuites=0, threadCountClasses=0, threadCountMethods=0, parallelOptimized=true
[2020-02-14T01:01:34.353Z] [INFO]
[2020-02-14T01:01:34.353Z] [INFO] -------------------------------------------------------
[2020-02-14T01:01:34.353Z] [INFO]  T E S T S
[2020-02-14T01:01:34.353Z] [INFO] -------------------------------------------------------
[2020-02-14T01:01:34.353Z] [INFO] Running org.apache.maven.surefire.booter.JUnit4SuiteTest
[2020-02-14T01:01:36.956Z] java version 1.7.0_79 expectedPid=8444
[2020-02-14T01:01:41.892Z] java.lang.RuntimeException: dummy exception
[2020-02-14T01:01:41.892Z] at org.apache.maven.surefire.booter.ForkedBooter.run(ForkedBooter.java:523)
[2020-02-14T01:01:41.892Z] at org.apache.maven.surefire.booter.ForkedBooterMockTest.testMainWithError(ForkedBooterMockTest.java:155)
[2020-02-14T01:01:41.892Z] at org.junit.internal.runners.TestMethod.invoke(TestMethod.java:68)
[2020-02-14T01:01:41.892Z] at org.junit.internal.runners.MethodRoadie$2.run(MethodRoadie.java:89)
[2020-02-14T01:01:41.893Z] at org.junit.internal.runners.MethodRoadie.runBeforesThenTestThenAfters(MethodRoadie.java:97)
[2020-02-14T01:01:41.893Z] at org.junit.internal.runners.MethodRoadie.runTest(MethodRoadie.java:87)
[2020-02-14T01:01:41.893Z] at org.junit.internal.runners.MethodRoadie.run(MethodRoadie.java:50)
[2020-02-14T01:01:41.893Z] at org.junit.internal.runners.ClassRoadie.runUnprotected(ClassRoadie.java:34)
[2020-02-14T01:01:41.893Z] at org.junit.internal.runners.ClassRoadie.runProtected(ClassRoadie.java:44)
[2020-02-14T01:01:41.893Z] at junit.framework.JUnit4TestAdapter.run(JUnit4TestAdapter.java:50)
[2020-02-14T01:01:41.893Z] at junit.framework.TestSuite.runTest(TestSuite.java:241)
[2020-02-14T01:01:41.893Z] at junit.framework.TestSuite.run(TestSuite.java:236)
[2020-02-14T01:01:41.893Z] at org.apache.maven.shadefire.surefire.junit.JUnitTestSet.execute(JUnitTestSet.java:99)
[2020-02-14T01:01:41.893Z] at org.apache.maven.shadefire.surefire.junit.JUnit3Provider.executeTestSet(JUnit3Provider.java:141)
[2020-02-14T01:01:41.893Z] at org.apache.maven.shadefire.surefire.junit.JUnit3Provider.invoke(JUnit3Provider.java:114)
[2020-02-14T01:01:41.893Z] at org.apache.maven.shadefire.surefire.booter.ForkedBooter.runSuitesInProcess(ForkedBooter.java:377)
[2020-02-14T01:01:41.893Z] at org.apache.maven.shadefire.surefire.booter.ForkedBooter.execute(ForkedBooter.java:138)
[2020-02-14T01:01:41.893Z] at org.apache.maven.shadefire.surefire.booter.ForkedBooter.run(ForkedBooter.java:465)
[2020-02-14T01:01:41.893Z] at org.apache.maven.shadefire.surefire.booter.ForkedBooter.main(ForkedBooter.java:451)
[2020-02-14T01:01:41.893Z] [ERROR] Tests run: 139, Failures: 0, Errors: 1, Skipped: 0, Time elapsed: 7.127 s <<< FAILURE! - in org.apache.maven.surefire.booter.JUnit4SuiteTest
[2020-02-14T01:01:41.893Z] [ERROR] org.apache.maven.surefire.booter.ClasspathTest.testLoadInNewClassLoader  Time elapsed: 0.005 s  <<< ERROR!
[2020-02-14T01:01:41.893Z] java.net.MalformedURLException: no !/ in spec
[2020-02-14T01:01:41.893Z] at java.net.URL.<init>(URL.java:619)
[2020-02-14T01:01:41.893Z] at java.net.URL.<init>(URL.java:482)
[2020-02-14T01:01:41.893Z] at java.net.URL.<init>(URL.java:431)
[2020-02-14T01:01:41.893Z] at org.apache.maven.surefire.booter.ClasspathTest.testLoadInNewClassLoader(ClasspathTest.java:203)
[2020-02-14T01:01:41.893Z] Caused by: java.lang.NullPointerException: no !/ in spec
[2020-02-14T01:01:41.893Z] at sun.net.www.protocol.jar.Handler.parseAbsoluteSpec(Handler.java:170)
[2020-02-14T01:01:41.893Z] at sun.net.www.protocol.jar.Handler.parseURL(Handler.java:150)
[2020-02-14T01:01:41.893Z] at java.net.URL.<init>(URL.java:614)
[2020-02-14T01:01:41.893Z] ... 28 more
[2020-02-14T01:01:41.893Z]
[2020-02-14T01:01:41.893Z] [INFO]
[2020-02-14T01:01:41.893Z] [INFO] Results:
[2020-02-14T01:01:41.893Z] [INFO]
[2020-02-14T01:01:41.893Z] [ERROR] Errors:
[2020-02-14T01:01:41.893Z] [ERROR]   org.apache.maven.surefire.booter.ClasspathTest#testLoadInNewClassLoader MalformedURLException
[2020-02-14T01:01:41.893Z] [INFO]
[2020-02-14T01:01:41.893Z] [ERROR] Tests run: 139, Failures: 0, Errors: 1, Skipped: 0
[2020-02-14T01:01:41.893Z] [INFO]
[2020-02-14T01:01:41.893Z] [INFO] ------------------------------------------------------------------------
[2020-02-14T01:01:41.893Z] [INFO] Reactor Summary for Apache Maven Surefire 3.0.0-SNAPSHOT:
[2020-02-14T01:01:41.893Z] [INFO]
[2020-02-14T01:01:41.893Z] [INFO] Apache Maven Surefire .............................. SUCCESS [01:13 min]
[2020-02-14T01:01:41.893Z] [INFO] SureFire Logger API ................................ SUCCESS [ 26.766 s]
[2020-02-14T01:01:41.893Z] [INFO] SureFire API ....................................... SUCCESS [ 19.245 s]
[2020-02-14T01:01:41.893Z] [INFO] Surefire Extensions API ............................ SUCCESS [  6.808 s]
[2020-02-14T01:01:41.893Z] [INFO] Surefire Extensions SPI ............................ SUCCESS [  2.514 s]
[2020-02-14T01:01:41.893Z] [INFO] SureFire Booter .................................... FAILURE [ 21.333 s]
[2020-02-14T01:01:41.893Z] [INFO] Maven Surefire Test-Grouping Support ............... SKIPPED
[2020-02-14T01:01:41.893Z] [INFO] SureFire Providers ................................. SKIPPED
[2020-02-14T01:01:41.893Z] [INFO] Shared JUnit3 Provider Code ........................ SKIPPED
[2020-02-14T01:01:41.893Z] [INFO] Shared Java 5 Provider Base ........................ SKIPPED
[2020-02-14T01:01:41.893Z] [INFO] Shared JUnit4 Provider Code ........................ SKIPPED
[2020-02-14T01:01:41.893Z] [INFO] Shared JUnit48 Provider Code ....................... SKIPPED
[2020-02-14T01:01:41.893Z] [INFO] SureFire JUnit Runner .............................. SKIPPED
[2020-02-14T01:01:41.893Z] [INFO] SureFire JUnit4 Runner ............................. SKIPPED
[2020-02-14T01:01:41.893Z] [INFO] Maven Surefire Common .............................. SKIPPED
[2020-02-14T01:01:41.893Z] [INFO] SureFire JUnitCore Runner .......................... SKIPPED
[2020-02-14T01:01:41.893Z] [INFO] SureFire JUnit Platform Runner ..................... SKIPPED
[2020-02-14T01:01:41.893Z] [INFO] SureFire TestNG Utils .............................. SKIPPED
[2020-02-14T01:01:41.893Z] [INFO] SureFire TestNG Runner ............................. SKIPPED
[2020-02-14T01:01:41.893Z] [INFO] ShadeFire JUnit3 Provider .......................... SKIPPED
[2020-02-14T01:01:41.893Z] [INFO] Surefire Report Parser ............................. SKIPPED
[2020-02-14T01:01:41.893Z] [INFO] Maven Surefire Plugin .............................. SKIPPED
[2020-02-14T01:01:41.893Z] [INFO] Maven Failsafe Plugin .............................. SKIPPED
[2020-02-14T01:01:41.893Z] [INFO] Maven Surefire Report Plugin ....................... SKIPPED
[2020-02-14T01:01:41.893Z] [INFO] Maven Surefire Integration Tests ................... SKIPPED
[2020-02-14T01:01:41.893Z] [INFO] Surefire Shared Utils .............................. SKIPPED
[2020-02-14T01:01:41.893Z] [INFO] ------------------------------------------------------------------------
[2020-02-14T01:01:41.893Z] [INFO] BUILD FAILURE
[2020-02-14T01:01:41.893Z] [INFO] ------------------------------------------------------------------------
[2020-02-14T01:01:41.893Z] [INFO] Total time:  02:32 min
[2020-02-14T01:01:41.893Z] [INFO] Finished at: 2020-02-13T17:01:41-08:00
[2020-02-14T01:01:41.893Z] [INFO] ------------------------------------------------------------------------
[2020-02-14T01:01:41.893Z] [ERROR] Failed to execute goal org.apache.maven.plugins:maven-surefire-plugin:3.0.0-M4:test (default-test) on project surefire-booter: There are test failures.
[2020-02-14T01:01:41.893Z] [ERROR]
[2020-02-14T01:01:41.894Z] [ERROR] Please refer to C:\Users\jenkins\AppData\Local\Temp\2\jenkins-maven-box-maven-surefire-maven2surefire-jvm-communication-46\surefire-booter\target\surefire-reports for the individual test results.
[2020-02-14T01:01:41.894Z] [ERROR] Please refer to dump files (if any exist) [date].dump, [date]-jvmRun[N].dump and [date].dumpstream.
[2020-02-14T01:01:41.894Z] [ERROR] -> [Help 1]
[2020-02-14T01:01:41.894Z] org.apache.maven.lifecycle.LifecycleExecutionException: Failed to execute goal org.apache.maven.plugins:maven-surefire-plugin:3.0.0-M4:test (default-test) on project surefire-booter: There are test failures.
[2020-02-14T01:01:41.894Z]
[2020-02-14T01:01:41.894Z] Please refer to C:\Users\jenkins\AppData\Local\Temp\2\jenkins-maven-box-maven-surefire-maven2surefire-jvm-communication-46\surefire-booter\target\surefire-reports for the individual test results.
[2020-02-14T01:01:41.894Z] Please refer to dump files (if any exist) [date].dump, [date]-jvmRun[N].dump and [date].dumpstream.
[2020-02-14T01:01:41.894Z]     at org.apache.maven.lifecycle.internal.MojoExecutor.execute (MojoExecutor.java:215)
[2020-02-14T01:01:41.894Z]     at org.apache.maven.lifecycle.internal.MojoExecutor.execute (MojoExecutor.java:156)
[2020-02-14T01:01:41.894Z]     at org.apache.maven.lifecycle.internal.MojoExecutor.execute (MojoExecutor.java:148)
[2020-02-14T01:01:41.894Z]     at org.apache.maven.lifecycle.internal.LifecycleModuleBuilder.buildProject (LifecycleModuleBuilder.java:117)
[2020-02-14T01:01:41.894Z]     at org.apache.maven.lifecycle.internal.LifecycleModuleBuilder.buildProject (LifecycleModuleBuilder.java:81)
[2020-02-14T01:01:41.894Z]     at org.apache.maven.lifecycle.internal.builder.singlethreaded.SingleThreadedBuilder.build (SingleThreadedBuilder.java:56)
[2020-02-14T01:01:41.894Z]     at org.apache.maven.lifecycle.internal.LifecycleStarter.execute (LifecycleStarter.java:128)
[2020-02-14T01:01:41.894Z]     at org.apache.maven.DefaultMaven.doExecute (DefaultMaven.java:305)
[2020-02-14T01:01:41.894Z]     at org.apache.maven.DefaultMaven.doExecute (DefaultMaven.java:192)
[2020-02-14T01:01:41.894Z]     at org.apache.maven.DefaultMaven.execute (DefaultMaven.java:105)
[2020-02-14T01:01:41.894Z]     at org.apache.maven.cli.MavenCli.execute (MavenCli.java:956)
[2020-02-14T01:01:41.894Z]     at org.apache.maven.cli.MavenCli.doMain (MavenCli.java:288)
[2020-02-14T01:01:41.894Z]     at org.apache.maven.cli.MavenCli.main (MavenCli.java:192)
[2020-02-14T01:01:41.894Z]     at sun.reflect.NativeMethodAccessorImpl.invoke0 (Native Method)
[2020-02-14T01:01:41.894Z]     at sun.reflect.NativeMethodAccessorImpl.invoke (NativeMethodAccessorImpl.java:62)
[2020-02-14T01:01:41.894Z]     at sun.reflect.DelegatingMethodAccessorImpl.invoke (DelegatingMethodAccessorImpl.java:43)
[2020-02-14T01:01:41.894Z]     at java.lang.reflect.Method.invoke (Method.java:498)
[2020-02-14T01:01:41.894Z]     at org.codehaus.plexus.classworlds.launcher.Launcher.launchEnhanced (Launcher.java:282)
[2020-02-14T01:01:41.894Z]     at org.codehaus.plexus.classworlds.launcher.Launcher.launch (Launcher.java:225)
[2020-02-14T01:01:41.894Z]     at org.codehaus.plexus.classworlds.launcher.Launcher.mainWithExitCode (Launcher.java:406)
[2020-02-14T01:01:41.894Z]     at org.codehaus.plexus.classworlds.launcher.Launcher.main (Launcher.java:347)
[2020-02-14T01:01:41.894Z] Caused by: org.apache.maven.plugin.MojoFailureException: There are test failures.
[2020-02-14T01:01:41.894Z]
[2020-02-14T01:01:41.894Z] Please refer to C:\Users\jenkins\AppData\Local\Temp\2\jenkins-maven-box-maven-surefire-maven2surefire-jvm-communication-46\surefire-booter\target\surefire-reports for the individual test results.
[2020-02-14T01:01:41.894Z] Please refer to dump files (if any exist) [date].dump, [date]-jvmRun[N].dump and [date].dumpstream.
[2020-02-14T01:01:41.894Z]     at org.apache.maven.plugin.surefire.SurefireHelper.throwException (SurefireHelper.java:271)
[2020-02-14T01:01:41.894Z]     at org.apache.maven.plugin.surefire.SurefireHelper.reportExecution (SurefireHelper.java:159)
[2020-02-14T01:01:41.894Z]     at org.apache.maven.plugin.surefire.SurefirePlugin.handleSummary (SurefirePlugin.java:435)
[2020-02-14T01:01:41.894Z]     at org.apache.maven.plugin.surefire.AbstractSurefireMojo.executeAfterPreconditionsChecked (AbstractSurefireMojo.java:1079)
[2020-02-14T01:01:41.894Z]     at org.apache.maven.plugin.surefire.AbstractSurefireMojo.execute (AbstractSurefireMojo.java:889)
[2020-02-14T01:01:41.894Z]     at org.apache.maven.plugin.DefaultBuildPluginManager.executeMojo (DefaultBuildPluginManager.java:137)
[2020-02-14T01:01:41.895Z]     at org.apache.maven.lifecycle.internal.MojoExecutor.execute (MojoExecutor.java:210)
[2020-02-14T01:01:41.895Z]     at org.apache.maven.lifecycle.internal.MojoExecutor.execute (MojoExecutor.java:156)
[2020-02-14T01:01:41.895Z]     at org.apache.maven.lifecycle.internal.MojoExecutor.execute (MojoExecutor.java:148)
[2020-02-14T01:01:41.895Z]     at org.apache.maven.lifecycle.internal.LifecycleModuleBuilder.buildProject (LifecycleModuleBuilder.java:117)
[2020-02-14T01:01:41.895Z]     at org.apache.maven.lifecycle.internal.LifecycleModuleBuilder.buildProject (LifecycleModuleBuilder.java:81)
[2020-02-14T01:01:41.895Z]     at org.apache.maven.lifecycle.internal.builder.singlethreaded.SingleThreadedBuilder.build (SingleThreadedBuilder.java:56)
[2020-02-14T01:01:41.895Z]     at org.apache.maven.lifecycle.internal.LifecycleStarter.execute (LifecycleStarter.java:128)
[2020-02-14T01:01:41.895Z]     at org.apache.maven.DefaultMaven.doExecute (DefaultMaven.java:305)
[2020-02-14T01:01:41.895Z]     at org.apache.maven.DefaultMaven.doExecute (DefaultMaven.java:192)
[2020-02-14T01:01:41.895Z]     at org.apache.maven.DefaultMaven.execute (DefaultMaven.java:105)
[2020-02-14T01:01:41.895Z]     at org.apache.maven.cli.MavenCli.execute (MavenCli.java:956)
[2020-02-14T01:01:41.895Z]     at org.apache.maven.cli.MavenCli.doMain (MavenCli.java:288)
[2020-02-14T01:01:41.895Z]     at org.apache.maven.cli.MavenCli.main (MavenCli.java:192)
[2020-02-14T01:01:41.895Z]     at sun.reflect.NativeMethodAccessorImpl.invoke0 (Native Method)
[2020-02-14T01:01:41.895Z]     at sun.reflect.NativeMethodAccessorImpl.invoke (NativeMethodAccessorImpl.java:62)
[2020-02-14T01:01:41.895Z]     at sun.reflect.DelegatingMethodAccessorImpl.invoke (DelegatingMethodAccessorImpl.java:43)
[2020-02-14T01:01:41.895Z]     at java.lang.reflect.Method.invoke (Method.java:498)
[2020-02-14T01:01:41.895Z]     at org.codehaus.plexus.classworlds.launcher.Launcher.launchEnhanced (Launcher.java:282)
[2020-02-14T01:01:41.895Z]     at org.codehaus.plexus.classworlds.launcher.Launcher.launch (Launcher.java:225)
[2020-02-14T01:01:41.895Z]     at org.codehaus.plexus.classworlds.launcher.Launcher.mainWithExitCode (Launcher.java:406)
[2020-02-14T01:01:41.895Z]     at org.codehaus.plexus.classworlds.launcher.Launcher.main (Launcher.java:347)
[2020-02-14T01:01:41.895Z] [ERROR]
[2020-02-14T01:01:41.895Z] [ERROR] Re-run Maven using the -X switch to enable full debug logging.
[2020-02-14T01:01:41.895Z] [ERROR]
[2020-02-14T01:01:41.895Z] [ERROR] For more information about the errors and possible solutions, please read the following articles:
[2020-02-14T01:01:41.895Z] [ERROR] [Help 1] http://cwiki.apache.org/confluence/display/MAVEN/MojoFailureException
[2020-02-14T01:01:41.895Z] [ERROR]
[2020-02-14T01:01:41.895Z] [ERROR] After correcting the problems, you can resume the build with the command
[2020-02-14T01:01:41.895Z] [ERROR]   mvn <args> -rf :surefire-booter
[Pipeline] }
[Pipeline] // withEnv
[Pipeline] }
[Pipeline] // stage
[Pipeline] fileExists
[Pipeline] fileExists
[Pipeline] archiveArtifacts
[2020-02-14T01:01:42.354Z] Archiving artifacts
[Pipeline] cleanWs
[2020-02-14T01:01:42.396Z] [WS-CLEANUP] Deleting project workspace...
[2020-02-14T01:01:42.396Z] [WS-CLEANUP] Deferred wipeout is used...
[2020-02-14T01:01:42.439Z] [WS-CLEANUP] done
[Pipeline] }
[Pipeline] // ws
[Pipeline] }
[Pipeline] // timestamps
[Pipeline] }
[Pipeline] // node
[Pipeline] }
[Pipeline] // parallel
[Pipeline] echo
Build result: FAILURE
[Pipeline] jiraIssueSelector
[Pipeline] echo
The authors of changes [tibordigana].
[Pipeline] echo
Sending email ...
[Pipeline] emailext
Reply | Threaded
Open this post in threaded view
|

Build succeeded in Jenkins: Maven TLP » maven-surefire » maven2surefire-jvm-communication #47

Apache Jenkins Server-2