Build failed in Jenkins: Maven TLP » maven-surefire » maven2surefire-jvm-communication #28

classic Classic list List threaded Threaded
4 messages Options
Reply | Threaded
Open this post in threaded view
|

Build failed in Jenkins: Maven TLP » maven-surefire » maven2surefire-jvm-communication #28

Apache Jenkins Server-2
See https://builds.apache.org/job/maven-box/job/maven-surefire/job/maven2surefire-jvm-communication/28/

Changes:

* removed '-DskipTests', '-DskipITs'

All tests passed

Build log:
[...truncated 34489 lines...]
[2020-01-12T22:37:28.680Z] [INFO] ------------------------------------------------------------------------
[2020-01-12T22:37:28.680Z] [INFO] Total time:  01:25 h
[2020-01-12T22:37:28.680Z] [INFO] Finished at: 2020-01-12T14:37:27-08:00
[2020-01-12T22:37:28.680Z] [INFO] ------------------------------------------------------------------------
[2020-01-12T22:37:28.680Z] [ERROR] Failed to execute goal org.apache.maven.plugins:maven-failsafe-plugin:3.0.0-M4:verify (default) on project surefire-its: There are test failures.
[2020-01-12T22:37:28.680Z] [ERROR]
[2020-01-12T22:37:28.680Z] [ERROR] Please refer to C:\Users\jenkins\AppData\Local\Temp\3\jenkins-maven-box-maven-surefire-maven2surefire-jvm-communication-28\surefire-its\target\failsafe-reports for the individual test results.
[2020-01-12T22:37:28.680Z] [ERROR] Please refer to dump files (if any exist) [date].dump, [date]-jvmRun[N].dump and [date].dumpstream.
[2020-01-12T22:37:28.680Z] [ERROR] -> [Help 1]
[2020-01-12T22:37:28.680Z] org.apache.maven.lifecycle.LifecycleExecutionException: Failed to execute goal org.apache.maven.plugins:maven-failsafe-plugin:3.0.0-M4:verify (default) on project surefire-its: There are test failures.
[2020-01-12T22:37:28.680Z]
[2020-01-12T22:37:28.680Z] Please refer to C:\Users\jenkins\AppData\Local\Temp\3\jenkins-maven-box-maven-surefire-maven2surefire-jvm-communication-28\surefire-its\target\failsafe-reports for the individual test results.
[2020-01-12T22:37:28.680Z] Please refer to dump files (if any exist) [date].dump, [date]-jvmRun[N].dump and [date].dumpstream.
[2020-01-12T22:37:28.680Z]     at org.apache.maven.lifecycle.internal.MojoExecutor.execute (MojoExecutor.java:215)
[2020-01-12T22:37:28.680Z]     at org.apache.maven.lifecycle.internal.MojoExecutor.execute (MojoExecutor.java:156)
[2020-01-12T22:37:28.680Z]     at org.apache.maven.lifecycle.internal.MojoExecutor.execute (MojoExecutor.java:148)
[2020-01-12T22:37:28.680Z]     at org.apache.maven.lifecycle.internal.LifecycleModuleBuilder.buildProject (LifecycleModuleBuilder.java:117)
[2020-01-12T22:37:28.680Z]     at org.apache.maven.lifecycle.internal.LifecycleModuleBuilder.buildProject (LifecycleModuleBuilder.java:81)
[2020-01-12T22:37:28.680Z]     at org.apache.maven.lifecycle.internal.builder.singlethreaded.SingleThreadedBuilder.build (SingleThreadedBuilder.java:56)
[2020-01-12T22:37:28.680Z]     at org.apache.maven.lifecycle.internal.LifecycleStarter.execute (LifecycleStarter.java:128)
[2020-01-12T22:37:28.680Z]     at org.apache.maven.DefaultMaven.doExecute (DefaultMaven.java:305)
[2020-01-12T22:37:28.680Z]     at org.apache.maven.DefaultMaven.doExecute (DefaultMaven.java:192)
[2020-01-12T22:37:28.680Z]     at org.apache.maven.DefaultMaven.execute (DefaultMaven.java:105)
[2020-01-12T22:37:28.680Z]     at org.apache.maven.cli.MavenCli.execute (MavenCli.java:956)
[2020-01-12T22:37:28.680Z]     at org.apache.maven.cli.MavenCli.doMain (MavenCli.java:288)
[2020-01-12T22:37:28.680Z]     at org.apache.maven.cli.MavenCli.main (MavenCli.java:192)
[2020-01-12T22:37:28.680Z]     at sun.reflect.NativeMethodAccessorImpl.invoke0 (Native Method)
[2020-01-12T22:37:28.680Z]     at sun.reflect.NativeMethodAccessorImpl.invoke (NativeMethodAccessorImpl.java:62)
[2020-01-12T22:37:28.680Z]     at sun.reflect.DelegatingMethodAccessorImpl.invoke (DelegatingMethodAccessorImpl.java:43)
[2020-01-12T22:37:28.680Z]     at java.lang.reflect.Method.invoke (Method.java:498)
[2020-01-12T22:37:28.680Z]     at org.codehaus.plexus.classworlds.launcher.Launcher.launchEnhanced (Launcher.java:282)
[2020-01-12T22:37:28.680Z]     at org.codehaus.plexus.classworlds.launcher.Launcher.launch (Launcher.java:225)
[2020-01-12T22:37:28.680Z]     at org.codehaus.plexus.classworlds.launcher.Launcher.mainWithExitCode (Launcher.java:406)
[2020-01-12T22:37:28.680Z]     at org.codehaus.plexus.classworlds.launcher.Launcher.main (Launcher.java:347)
[2020-01-12T22:37:28.680Z] Caused by: org.apache.maven.plugin.MojoFailureException: There are test failures.
[2020-01-12T22:37:28.680Z]
[2020-01-12T22:37:28.680Z] Please refer to C:\Users\jenkins\AppData\Local\Temp\3\jenkins-maven-box-maven-surefire-maven2surefire-jvm-communication-28\surefire-its\target\failsafe-reports for the individual test results.
[2020-01-12T22:37:28.680Z] Please refer to dump files (if any exist) [date].dump, [date]-jvmRun[N].dump and [date].dumpstream.
[2020-01-12T22:37:28.680Z]     at org.apache.maven.plugin.surefire.SurefireHelper.throwException (SurefireHelper.java:271)
[2020-01-12T22:37:28.680Z]     at org.apache.maven.plugin.surefire.SurefireHelper.reportExecution (SurefireHelper.java:159)
[2020-01-12T22:37:28.680Z]     at org.apache.maven.plugin.failsafe.VerifyMojo.execute (VerifyMojo.java:192)
[2020-01-12T22:37:28.680Z]     at org.apache.maven.plugin.DefaultBuildPluginManager.executeMojo (DefaultBuildPluginManager.java:137)
[2020-01-12T22:37:28.680Z]     at org.apache.maven.lifecycle.internal.MojoExecutor.execute (MojoExecutor.java:210)
[2020-01-12T22:37:28.680Z]     at org.apache.maven.lifecycle.internal.MojoExecutor.execute (MojoExecutor.java:156)
[2020-01-12T22:37:28.680Z]     at org.apache.maven.lifecycle.internal.MojoExecutor.execute (MojoExecutor.java:148)
[2020-01-12T22:37:28.680Z]     at org.apache.maven.lifecycle.internal.LifecycleModuleBuilder.buildProject (LifecycleModuleBuilder.java:117)
[2020-01-12T22:37:28.680Z]     at org.apache.maven.lifecycle.internal.LifecycleModuleBuilder.buildProject (LifecycleModuleBuilder.java:81)
[2020-01-12T22:37:28.680Z]     at org.apache.maven.lifecycle.internal.builder.singlethreaded.SingleThreadedBuilder.build (SingleThreadedBuilder.java:56)
[2020-01-12T22:37:28.680Z]     at org.apache.maven.lifecycle.internal.LifecycleStarter.execute (LifecycleStarter.java:128)
[2020-01-12T22:37:28.680Z]     at org.apache.maven.DefaultMaven.doExecute (DefaultMaven.java:305)
[2020-01-12T22:37:28.680Z]     at org.apache.maven.DefaultMaven.doExecute (DefaultMaven.java:192)
[2020-01-12T22:37:28.680Z]     at org.apache.maven.DefaultMaven.execute (DefaultMaven.java:105)
[2020-01-12T22:37:28.680Z]     at org.apache.maven.cli.MavenCli.execute (MavenCli.java:956)
[2020-01-12T22:37:28.680Z]     at org.apache.maven.cli.MavenCli.doMain (MavenCli.java:288)
[2020-01-12T22:37:28.680Z]     at org.apache.maven.cli.MavenCli.main (MavenCli.java:192)
[2020-01-12T22:37:28.680Z]     at sun.reflect.NativeMethodAccessorImpl.invoke0 (Native Method)
[2020-01-12T22:37:28.680Z]     at sun.reflect.NativeMethodAccessorImpl.invoke (NativeMethodAccessorImpl.java:62)
[2020-01-12T22:37:28.680Z]     at sun.reflect.DelegatingMethodAccessorImpl.invoke (DelegatingMethodAccessorImpl.java:43)
[2020-01-12T22:37:28.680Z]     at java.lang.reflect.Method.invoke (Method.java:498)
[2020-01-12T22:37:28.680Z]     at org.codehaus.plexus.classworlds.launcher.Launcher.launchEnhanced (Launcher.java:282)
[2020-01-12T22:37:28.680Z]     at org.codehaus.plexus.classworlds.launcher.Launcher.launch (Launcher.java:225)
[2020-01-12T22:37:28.680Z]     at org.codehaus.plexus.classworlds.launcher.Launcher.mainWithExitCode (Launcher.java:406)
[2020-01-12T22:37:28.680Z]     at org.codehaus.plexus.classworlds.launcher.Launcher.main (Launcher.java:347)
[2020-01-12T22:37:28.680Z] [ERROR]
[2020-01-12T22:37:28.680Z] [ERROR] Re-run Maven using the -X switch to enable full debug logging.
[2020-01-12T22:37:28.680Z] [ERROR]
[2020-01-12T22:37:28.680Z] [ERROR] For more information about the errors and possible solutions, please read the following articles:
[2020-01-12T22:37:28.680Z] [ERROR] [Help 1] http://cwiki.apache.org/confluence/display/MAVEN/MojoFailureException
[2020-01-12T22:37:28.680Z] [ERROR]
[2020-01-12T22:37:28.680Z] [ERROR] After correcting the problems, you can resume the build with the command
[2020-01-12T22:37:28.680Z] [ERROR]   mvn <args> -rf :surefire-its
[Pipeline] }
[Pipeline] // withEnv
[Pipeline] }
[Pipeline] // stage
[Pipeline] fileExists
[Pipeline] fileExists
[Pipeline] zip
[2020-01-12T22:37:28.864Z] Writing zip file of C:\Users\jenkins\AppData\Local\Temp\3\jenkins-maven-box-maven-surefire-maven2surefire-jvm-communication-28\surefire-its\target to C:\Users\jenkins\AppData\Local\Temp\3\jenkins-maven-box-maven-surefire-maven2surefire-jvm-communication-28\surefire-its--windows-jdk13-maven3.6.x.zip
[2020-01-12T22:37:41.613Z] [INFO] Tests run: 5, Failures: 0, Errors: 0, Skipped: 0, Time elapsed: 23.299 s - in org.apache.maven.surefire.its.jiras.Surefire995CategoryInheritanceIT
[2020-01-12T22:37:41.613Z] [INFO]
[2020-01-12T22:37:41.613Z] [INFO] Results:
[2020-01-12T22:37:41.613Z] [INFO]
[2020-01-12T22:37:41.613Z] [ERROR] Failures:
[2020-01-12T22:37:41.613Z] [ERROR]   Surefire946KillMainProcessInReusableForkIT.test:140 expected:<[tru]e> but was:<[fals]e>
[2020-01-12T22:37:41.613Z] [ERROR]   Surefire946KillMainProcessInReusableForkIT.test:140 expected:<[tru]e> but was:<[fals]e>
[2020-01-12T22:37:41.613Z] [ERROR] Errors:
[2020-01-12T22:37:41.613Z] [ERROR]   Surefire946KillMainProcessInReusableForkIT.test:112 » TestTimedOut test timed ...
[2020-01-12T22:37:41.613Z] [INFO]
[2020-01-12T22:37:41.613Z] [ERROR] Tests run: 861, Failures: 2, Errors: 1, Skipped: 144
[2020-01-12T22:37:41.613Z] [INFO]
[2020-01-12T22:37:41.613Z] [INFO]
[2020-01-12T22:37:41.613Z] [INFO] --- maven-checkstyle-plugin:3.0.0:check (checkstyle-check) @ surefire-its ---
[2020-01-12T22:37:41.613Z] [INFO]
[2020-01-12T22:37:41.613Z] [INFO] --- maven-failsafe-plugin:3.0.0-M4:verify (default) @ surefire-its ---
[2020-01-12T22:37:41.613Z] [INFO] Failsafe report directory: C:\Users\jenkins\AppData\Local\Temp\3\jenkins-maven-box-maven-surefire-maven2surefire-jvm-communication-28@2\surefire-its\target\failsafe-reports
[2020-01-12T22:37:41.613Z] [INFO] ------------------------------------------------------------------------
[2020-01-12T22:37:41.613Z] [INFO] Reactor Summary for Apache Maven Surefire 3.0.0-SNAPSHOT:
[2020-01-12T22:37:41.613Z] [INFO]
[2020-01-12T22:37:41.613Z] [INFO] Apache Maven Surefire .............................. SUCCESS [ 56.065 s]
[2020-01-12T22:37:41.613Z] [INFO] SureFire Logger API ................................ SUCCESS [ 24.173 s]
[2020-01-12T22:37:41.613Z] [INFO] SureFire API ....................................... SUCCESS [ 12.727 s]
[2020-01-12T22:37:41.613Z] [INFO] Surefire Extensions API ............................ SUCCESS [  7.392 s]
[2020-01-12T22:37:41.613Z] [INFO] Surefire Extensions SPI ............................ SUCCESS [  2.888 s]
[2020-01-12T22:37:41.613Z] [INFO] SureFire Booter .................................... SUCCESS [ 21.880 s]
[2020-01-12T22:37:41.613Z] [INFO] Maven Surefire Test-Grouping Support ............... SUCCESS [ 11.072 s]
[2020-01-12T22:37:41.613Z] [INFO] SureFire Providers ................................. SUCCESS [  1.324 s]
[2020-01-12T22:37:41.613Z] [INFO] Shared JUnit3 Provider Code ........................ SUCCESS [  5.310 s]
[2020-01-12T22:37:41.613Z] [INFO] Shared Java 5 Provider Base ........................ SUCCESS [  6.474 s]
[2020-01-12T22:37:41.613Z] [INFO] Shared JUnit4 Provider Code ........................ SUCCESS [  7.474 s]
[2020-01-12T22:37:41.613Z] [INFO] Shared JUnit48 Provider Code ....................... SUCCESS [  7.888 s]
[2020-01-12T22:37:41.613Z] [INFO] SureFire JUnit Runner .............................. SUCCESS [  6.075 s]
[2020-01-12T22:37:41.613Z] [INFO] SureFire JUnit4 Runner ............................. SUCCESS [  5.159 s]
[2020-01-12T22:37:41.613Z] [INFO] Maven Surefire Common .............................. SUCCESS [ 53.993 s]
[2020-01-12T22:37:41.614Z] [INFO] SureFire JUnitCore Runner .......................... SUCCESS [02:23 min]
[2020-01-12T22:37:41.614Z] [INFO] SureFire JUnit Platform Runner ..................... SUCCESS [ 12.603 s]
[2020-01-12T22:37:41.614Z] [INFO] SureFire TestNG Utils .............................. SUCCESS [  6.351 s]
[2020-01-12T22:37:41.614Z] [INFO] SureFire TestNG Runner ............................. SUCCESS [  6.606 s]
[2020-01-12T22:37:41.614Z] [INFO] ShadeFire JUnit3 Provider .......................... SUCCESS [  2.321 s]
[2020-01-12T22:37:41.614Z] [INFO] Surefire Report Parser ............................. SUCCESS [  7.639 s]
[2020-01-12T22:37:41.614Z] [INFO] Maven Surefire Plugin .............................. SUCCESS [ 15.182 s]
[2020-01-12T22:37:41.614Z] [INFO] Maven Failsafe Plugin .............................. SUCCESS [ 12.681 s]
[2020-01-12T22:37:41.614Z] [INFO] Maven Surefire Report Plugin ....................... SUCCESS [ 19.327 s]
[2020-01-12T22:37:41.614Z] [INFO] Maven Surefire Integration Tests ................... FAILURE [  01:17 h]
[2020-01-12T22:37:41.614Z] [INFO] Surefire Shared Utils .............................. SKIPPED
[2020-01-12T22:37:41.614Z] [INFO] ------------------------------------------------------------------------
[2020-01-12T22:37:41.614Z] [INFO] BUILD FAILURE
[2020-01-12T22:37:41.614Z] [INFO] ------------------------------------------------------------------------
[2020-01-12T22:37:41.614Z] [INFO] Total time:  01:25 h
[2020-01-12T22:37:41.614Z] [INFO] Finished at: 2020-01-12T14:37:39-08:00
[2020-01-12T22:37:41.614Z] [INFO] ------------------------------------------------------------------------
[2020-01-12T22:37:41.614Z] [ERROR] Failed to execute goal org.apache.maven.plugins:maven-failsafe-plugin:3.0.0-M4:verify (default) on project surefire-its: There are test failures.
[2020-01-12T22:37:41.614Z] [ERROR]
[2020-01-12T22:37:41.614Z] [ERROR] Please refer to C:\Users\jenkins\AppData\Local\Temp\3\jenkins-maven-box-maven-surefire-maven2surefire-jvm-communication-28@2\surefire-its\target\failsafe-reports for the individual test results.
[2020-01-12T22:37:41.614Z] [ERROR] Please refer to dump files (if any exist) [date].dump, [date]-jvmRun[N].dump and [date].dumpstream.
[2020-01-12T22:37:41.614Z] [ERROR] -> [Help 1]
[2020-01-12T22:37:41.614Z] org.apache.maven.lifecycle.LifecycleExecutionException: Failed to execute goal org.apache.maven.plugins:maven-failsafe-plugin:3.0.0-M4:verify (default) on project surefire-its: There are test failures.
[2020-01-12T22:37:41.614Z]
[2020-01-12T22:37:41.614Z] Please refer to C:\Users\jenkins\AppData\Local\Temp\3\jenkins-maven-box-maven-surefire-maven2surefire-jvm-communication-28@2\surefire-its\target\failsafe-reports for the individual test results.
[2020-01-12T22:37:41.614Z] Please refer to dump files (if any exist) [date].dump, [date]-jvmRun[N].dump and [date].dumpstream.
[2020-01-12T22:37:41.614Z]     at org.apache.maven.lifecycle.internal.MojoExecutor.execute (MojoExecutor.java:215)
[2020-01-12T22:37:41.614Z]     at org.apache.maven.lifecycle.internal.MojoExecutor.execute (MojoExecutor.java:156)
[2020-01-12T22:37:41.614Z]     at org.apache.maven.lifecycle.internal.MojoExecutor.execute (MojoExecutor.java:148)
[2020-01-12T22:37:41.614Z]     at org.apache.maven.lifecycle.internal.LifecycleModuleBuilder.buildProject (LifecycleModuleBuilder.java:117)
[2020-01-12T22:37:41.614Z]     at org.apache.maven.lifecycle.internal.LifecycleModuleBuilder.buildProject (LifecycleModuleBuilder.java:81)
[2020-01-12T22:37:41.614Z]     at org.apache.maven.lifecycle.internal.builder.singlethreaded.SingleThreadedBuilder.build (SingleThreadedBuilder.java:56)
[2020-01-12T22:37:41.614Z]     at org.apache.maven.lifecycle.internal.LifecycleStarter.execute (LifecycleStarter.java:128)
[2020-01-12T22:37:41.614Z]     at org.apache.maven.DefaultMaven.doExecute (DefaultMaven.java:305)
[2020-01-12T22:37:41.614Z]     at org.apache.maven.DefaultMaven.doExecute (DefaultMaven.java:192)
[2020-01-12T22:37:41.614Z]     at org.apache.maven.DefaultMaven.execute (DefaultMaven.java:105)
[2020-01-12T22:37:41.614Z]     at org.apache.maven.cli.MavenCli.execute (MavenCli.java:956)
[2020-01-12T22:37:41.614Z]     at org.apache.maven.cli.MavenCli.doMain (MavenCli.java:288)
[2020-01-12T22:37:41.614Z]     at org.apache.maven.cli.MavenCli.main (MavenCli.java:192)
[2020-01-12T22:37:41.614Z]     at sun.reflect.NativeMethodAccessorImpl.invoke0 (Native Method)
[2020-01-12T22:37:41.614Z]     at sun.reflect.NativeMethodAccessorImpl.invoke (NativeMethodAccessorImpl.java:62)
[2020-01-12T22:37:41.614Z]     at sun.reflect.DelegatingMethodAccessorImpl.invoke (DelegatingMethodAccessorImpl.java:43)
[2020-01-12T22:37:41.614Z]     at java.lang.reflect.Method.invoke (Method.java:498)
[2020-01-12T22:37:41.614Z]     at org.codehaus.plexus.classworlds.launcher.Launcher.launchEnhanced (Launcher.java:282)
[2020-01-12T22:37:41.614Z]     at org.codehaus.plexus.classworlds.launcher.Launcher.launch (Launcher.java:225)
[2020-01-12T22:37:41.614Z]     at org.codehaus.plexus.classworlds.launcher.Launcher.mainWithExitCode (Launcher.java:406)
[2020-01-12T22:37:41.614Z]     at org.codehaus.plexus.classworlds.launcher.Launcher.main (Launcher.java:347)
[2020-01-12T22:37:41.614Z] Caused by: org.apache.maven.plugin.MojoFailureException: There are test failures.
[2020-01-12T22:37:41.614Z]
[2020-01-12T22:37:41.614Z] Please refer to C:\Users\jenkins\AppData\Local\Temp\3\jenkins-maven-box-maven-surefire-maven2surefire-jvm-communication-28@2\surefire-its\target\failsafe-reports for the individual test results.
[2020-01-12T22:37:41.614Z] Please refer to dump files (if any exist) [date].dump, [date]-jvmRun[N].dump and [date].dumpstream.
[2020-01-12T22:37:41.615Z]     at org.apache.maven.plugin.surefire.SurefireHelper.throwException (SurefireHelper.java:271)
[2020-01-12T22:37:41.615Z]     at org.apache.maven.plugin.surefire.SurefireHelper.reportExecution (SurefireHelper.java:159)
[2020-01-12T22:37:41.615Z]     at org.apache.maven.plugin.failsafe.VerifyMojo.execute (VerifyMojo.java:192)
[2020-01-12T22:37:41.615Z]     at org.apache.maven.plugin.DefaultBuildPluginManager.executeMojo (DefaultBuildPluginManager.java:137)
[2020-01-12T22:37:41.615Z]     at org.apache.maven.lifecycle.internal.MojoExecutor.execute (MojoExecutor.java:210)
[2020-01-12T22:37:41.615Z]     at org.apache.maven.lifecycle.internal.MojoExecutor.execute (MojoExecutor.java:156)
[2020-01-12T22:37:41.615Z]     at org.apache.maven.lifecycle.internal.MojoExecutor.execute (MojoExecutor.java:148)
[2020-01-12T22:37:41.615Z]     at org.apache.maven.lifecycle.internal.LifecycleModuleBuilder.buildProject (LifecycleModuleBuilder.java:117)
[2020-01-12T22:37:41.615Z]     at org.apache.maven.lifecycle.internal.LifecycleModuleBuilder.buildProject (LifecycleModuleBuilder.java:81)
[2020-01-12T22:37:41.615Z]     at org.apache.maven.lifecycle.internal.builder.singlethreaded.SingleThreadedBuilder.build (SingleThreadedBuilder.java:56)
[2020-01-12T22:37:41.615Z]     at org.apache.maven.lifecycle.internal.LifecycleStarter.execute (LifecycleStarter.java:128)
[2020-01-12T22:37:41.615Z]     at org.apache.maven.DefaultMaven.doExecute (DefaultMaven.java:305)
[2020-01-12T22:37:41.615Z]     at org.apache.maven.DefaultMaven.doExecute (DefaultMaven.java:192)
[2020-01-12T22:37:41.615Z]     at org.apache.maven.DefaultMaven.execute (DefaultMaven.java:105)
[2020-01-12T22:37:41.615Z]     at org.apache.maven.cli.MavenCli.execute (MavenCli.java:956)
[2020-01-12T22:37:41.615Z]     at org.apache.maven.cli.MavenCli.doMain (MavenCli.java:288)
[2020-01-12T22:37:41.615Z]     at org.apache.maven.cli.MavenCli.main (MavenCli.java:192)
[2020-01-12T22:37:41.615Z]     at sun.reflect.NativeMethodAccessorImpl.invoke0 (Native Method)
[2020-01-12T22:37:41.615Z]     at sun.reflect.NativeMethodAccessorImpl.invoke (NativeMethodAccessorImpl.java:62)
[2020-01-12T22:37:41.615Z]     at sun.reflect.DelegatingMethodAccessorImpl.invoke (DelegatingMethodAccessorImpl.java:43)
[2020-01-12T22:37:41.615Z]     at java.lang.reflect.Method.invoke (Method.java:498)
[2020-01-12T22:37:41.615Z]     at org.codehaus.plexus.classworlds.launcher.Launcher.launchEnhanced (Launcher.java:282)
[2020-01-12T22:37:41.615Z]     at org.codehaus.plexus.classworlds.launcher.Launcher.launch (Launcher.java:225)
[2020-01-12T22:37:41.615Z]     at org.codehaus.plexus.classworlds.launcher.Launcher.mainWithExitCode (Launcher.java:406)
[2020-01-12T22:37:41.615Z]     at org.codehaus.plexus.classworlds.launcher.Launcher.main (Launcher.java:347)
[2020-01-12T22:37:41.615Z] [ERROR]
[2020-01-12T22:37:41.615Z] [ERROR] Re-run Maven using the -X switch to enable full debug logging.
[2020-01-12T22:37:41.615Z] [ERROR]
[2020-01-12T22:37:41.615Z] [ERROR] For more information about the errors and possible solutions, please read the following articles:
[2020-01-12T22:37:41.615Z] [ERROR] [Help 1] http://cwiki.apache.org/confluence/display/MAVEN/MojoFailureException
[2020-01-12T22:37:41.615Z] [ERROR]
[2020-01-12T22:37:41.615Z] [ERROR] After correcting the problems, you can resume the build with the command
[2020-01-12T22:37:41.615Z] [ERROR]   mvn <args> -rf :surefire-its
[Pipeline] }
[Pipeline] // withEnv
[Pipeline] }
[Pipeline] // stage
[Pipeline] fileExists
[Pipeline] fileExists
[Pipeline] zip
[2020-01-12T22:37:41.813Z] Writing zip file of C:\Users\jenkins\AppData\Local\Temp\3\jenkins-maven-box-maven-surefire-maven2surefire-jvm-communication-28@2\surefire-its\target to C:\Users\jenkins\AppData\Local\Temp\3\jenkins-maven-box-maven-surefire-maven2surefire-jvm-communication-28@2\surefire-its--windows-jdk11-maven3.6.x.zip
[2020-01-12T22:37:44.401Z] Zipped 17227 entries.
[2020-01-12T22:37:44.401Z] Archiving C:\Users\jenkins\AppData\Local\Temp\3\jenkins-maven-box-maven-surefire-maven2surefire-jvm-communication-28\surefire-its--windows-jdk13-maven3.6.x.zip
[2020-01-12T22:37:44.402Z] [Fast Archiver] No artifacts from Maven TLP » maven-surefire » maven2surefire-jvm-communication #27 to compare, so performing full copy of artifacts
[Pipeline] archiveArtifacts
[2020-01-12T22:37:46.027Z] Archiving artifacts
[2020-01-12T22:37:46.041Z] [Fast Archiver] No artifacts from Maven TLP » maven-surefire » maven2surefire-jvm-communication #27 to compare, so performing full copy of artifacts
[Pipeline] cleanWs
[2020-01-12T22:37:47.485Z] [WS-CLEANUP] Deleting project workspace...
[2020-01-12T22:37:47.485Z] [WS-CLEANUP] Deferred wipeout is used...
[2020-01-12T22:37:47.937Z] [WS-CLEANUP] done
[Pipeline] }
[Pipeline] // ws
[Pipeline] }
[Pipeline] // timestamps
[Pipeline] }
[Pipeline] // node
[Pipeline] }
[2020-01-12T22:38:04.055Z] Zipped 17239 entries.
[2020-01-12T22:38:04.055Z] Archiving C:\Users\jenkins\AppData\Local\Temp\3\jenkins-maven-box-maven-surefire-maven2surefire-jvm-communication-28@2\surefire-its--windows-jdk11-maven3.6.x.zip
[2020-01-12T22:38:04.057Z] [Fast Archiver] No artifacts from Maven TLP » maven-surefire » maven2surefire-jvm-communication #27 to compare, so performing full copy of artifacts
[Pipeline] archiveArtifacts
[2020-01-12T22:38:06.062Z] Archiving artifacts
[2020-01-12T22:38:06.075Z] [Fast Archiver] No artifacts from Maven TLP » maven-surefire » maven2surefire-jvm-communication #27 to compare, so performing full copy of artifacts
[Pipeline] cleanWs
[2020-01-12T22:38:08.235Z] [WS-CLEANUP] Deleting project workspace...
[2020-01-12T22:38:08.235Z] [WS-CLEANUP] Deferred wipeout is used...
[2020-01-12T22:38:08.683Z] [WS-CLEANUP] done
[Pipeline] }
[Pipeline] // ws
[Pipeline] }
[Pipeline] // timestamps
[Pipeline] }
[Pipeline] // node
[Pipeline] }
[Pipeline] // parallel
[Pipeline] echo
Build result: FAILURE
[Pipeline] jiraIssueSelector
[Pipeline] echo
The authors of changes [tibordigana].
[Pipeline] echo
Sending email ...
[Pipeline] emailext
Reply | Threaded
Open this post in threaded view
|

Build failed in Jenkins: Maven TLP » maven-surefire » maven2surefire-jvm-communication #29

Apache Jenkins Server-2
See https://builds.apache.org/job/maven-box/job/maven-surefire/job/maven2surefire-jvm-communication/29/

Changes:

* investigate dumps on Ubuntu

All tests passed

Build log:
[...truncated 34452 lines...]
[2020-01-13T01:51:45.551Z] [INFO] Surefire Extensions SPI ............................ SUCCESS [  2.735 s]
[2020-01-13T01:51:45.551Z] [INFO] SureFire Booter .................................... SUCCESS [ 23.437 s]
[2020-01-13T01:51:45.551Z] [INFO] Maven Surefire Test-Grouping Support ............... SUCCESS [  7.183 s]
[2020-01-13T01:51:45.551Z] [INFO] SureFire Providers ................................. SUCCESS [  1.394 s]
[2020-01-13T01:51:45.551Z] [INFO] Shared JUnit3 Provider Code ........................ SUCCESS [  4.906 s]
[2020-01-13T01:51:45.551Z] [INFO] Shared Java 5 Provider Base ........................ SUCCESS [  5.668 s]
[2020-01-13T01:51:45.551Z] [INFO] Shared JUnit4 Provider Code ........................ SUCCESS [  6.103 s]
[2020-01-13T01:51:45.551Z] [INFO] Shared JUnit48 Provider Code ....................... SUCCESS [  7.168 s]
[2020-01-13T01:51:45.551Z] [INFO] SureFire JUnit Runner .............................. SUCCESS [  5.473 s]
[2020-01-13T01:51:45.551Z] [INFO] SureFire JUnit4 Runner ............................. SUCCESS [  5.441 s]
[2020-01-13T01:51:45.551Z] [INFO] Maven Surefire Common .............................. SUCCESS [ 52.976 s]
[2020-01-13T01:51:45.551Z] [INFO] SureFire JUnitCore Runner .......................... SUCCESS [02:25 min]
[2020-01-13T01:51:45.551Z] [INFO] SureFire JUnit Platform Runner ..................... SUCCESS [ 14.812 s]
[2020-01-13T01:51:45.551Z] [INFO] SureFire TestNG Utils .............................. SUCCESS [  5.645 s]
[2020-01-13T01:51:45.551Z] [INFO] SureFire TestNG Runner ............................. SUCCESS [  6.219 s]
[2020-01-13T01:51:45.551Z] [INFO] ShadeFire JUnit3 Provider .......................... SUCCESS [  1.920 s]
[2020-01-13T01:51:45.551Z] [INFO] Surefire Report Parser ............................. SUCCESS [  7.033 s]
[2020-01-13T01:51:45.551Z] [INFO] Maven Surefire Plugin .............................. SUCCESS [ 13.006 s]
[2020-01-13T01:51:45.552Z] [INFO] Maven Failsafe Plugin .............................. SUCCESS [ 14.197 s]
[2020-01-13T01:51:45.552Z] [INFO] Maven Surefire Report Plugin ....................... SUCCESS [ 19.970 s]
[2020-01-13T01:51:45.552Z] [INFO] Maven Surefire Integration Tests ................... SUCCESS [  01:17 h]
[2020-01-13T01:51:45.552Z] [INFO] Surefire Shared Utils .............................. SUCCESS [02:39 min]
[2020-01-13T01:51:45.552Z] [INFO] ------------------------------------------------------------------------
[2020-01-13T01:51:45.552Z] [INFO] BUILD SUCCESS
[2020-01-13T01:51:45.552Z] [INFO] ------------------------------------------------------------------------
[2020-01-13T01:51:45.552Z] [INFO] Total time:  01:27 h
[2020-01-13T01:51:45.552Z] [INFO] Finished at: 2020-01-13T01:51:34Z
[2020-01-13T01:51:45.552Z] [INFO] ------------------------------------------------------------------------
[Pipeline] }
[Pipeline] // withEnv
[Pipeline] }
[Pipeline] // stage
[Pipeline] openTasks
[2020-01-13T01:51:46.467Z] [TASKS] Skipping publisher since build result is FAILURE
[Pipeline] jacoco
[Pipeline] junit
[2020-01-13T01:51:47.150Z] Recording test results
[Pipeline] fileExists
[Pipeline] fileExists
[Pipeline] zip
[2020-01-13T01:51:51.357Z] Writing zip file of /home/jenkins/jenkins-slave/workspace/maven2surefire-jvm-communication@2/surefire-its/target to /home/jenkins/jenkins-slave/workspace/maven2surefire-jvm-communication@2/surefire-its--linux-jdk14-maven3.6.x.zip
[2020-01-13T01:52:03.787Z] Zipped 18345 entries.
[2020-01-13T01:52:03.787Z] Archiving /home/jenkins/jenkins-slave/workspace/maven2surefire-jvm-communication@2/surefire-its--linux-jdk14-maven3.6.x.zip
[2020-01-13T01:52:03.789Z] [Fast Archiver] No artifacts from Maven TLP » maven-surefire » maven2surefire-jvm-communication #27 to compare, so performing full copy of artifacts
[Pipeline] archiveArtifacts
[2020-01-13T01:52:09.412Z] Archiving artifacts
[2020-01-13T01:52:10.733Z] [Fast Archiver] No artifacts from Maven TLP » maven-surefire » maven2surefire-jvm-communication #27 to compare, so performing full copy of artifacts
[Pipeline] cleanWs
[2020-01-13T01:52:17.989Z] [WS-CLEANUP] Deleting project workspace...
[2020-01-13T01:52:17.989Z] [WS-CLEANUP] Deferred wipeout is used...
[2020-01-13T01:52:18.670Z] [WS-CLEANUP] done
[Pipeline] }
[Pipeline] // ws
[Pipeline] }
[Pipeline] // timestamps
[Pipeline] }
[Pipeline] // node
[Pipeline] }
[2020-01-13T01:53:00.034Z] [INFO] Tests run: 6, Failures: 0, Errors: 0, Skipped: 0, Time elapsed: 66.71 s - in org.apache.maven.surefire.its.jiras.Surefire946KillMainProcessInReusableForkIT
[2020-01-13T01:53:00.035Z] [INFO] Running org.apache.maven.surefire.its.jiras.Surefire972BizarreNoClassDefIT
[2020-01-13T01:53:00.035Z] [INFO] Tests run: 1, Failures: 0, Errors: 0, Skipped: 0, Time elapsed: 9.744 s - in org.apache.maven.surefire.its.jiras.Surefire972BizarreNoClassDefIT
[2020-01-13T01:53:00.035Z] [INFO] Running org.apache.maven.surefire.its.jiras.Surefire975DefaultVMEncodingIT
[2020-01-13T01:53:06.541Z] [INFO] Tests run: 1, Failures: 0, Errors: 0, Skipped: 0, Time elapsed: 7.281 s - in org.apache.maven.surefire.its.jiras.Surefire975DefaultVMEncodingIT
[2020-01-13T01:53:06.542Z] [INFO] Running org.apache.maven.surefire.its.jiras.Surefire979WrongClassLoaderIT
[2020-01-13T01:53:13.037Z] [INFO] Tests run: 1, Failures: 0, Errors: 0, Skipped: 0, Time elapsed: 6.706 s - in org.apache.maven.surefire.its.jiras.Surefire979WrongClassLoaderIT
[2020-01-13T01:53:13.037Z] [INFO] Running org.apache.maven.surefire.its.jiras.Surefire985ParameterizedRunnerAndCategoriesIT
[2020-01-13T01:53:19.527Z] [INFO] Tests run: 1, Failures: 0, Errors: 0, Skipped: 0, Time elapsed: 6.146 s - in org.apache.maven.surefire.its.jiras.Surefire985ParameterizedRunnerAndCategoriesIT
[2020-01-13T01:53:19.527Z] [INFO] Running org.apache.maven.surefire.its.jiras.Surefire995CategoryInheritanceIT
[2020-01-13T01:53:48.787Z] [INFO] Tests run: 5, Failures: 0, Errors: 0, Skipped: 0, Time elapsed: 29.938 s - in org.apache.maven.surefire.its.jiras.Surefire995CategoryInheritanceIT
[2020-01-13T01:53:49.504Z] [INFO]
[2020-01-13T01:53:49.504Z] [INFO] Results:
[2020-01-13T01:53:49.504Z] [INFO]
[2020-01-13T01:53:49.504Z] [WARNING] Tests run: 861, Failures: 0, Errors: 0, Skipped: 135
[2020-01-13T01:53:49.504Z] [INFO]
[2020-01-13T01:53:49.504Z] [INFO]
[2020-01-13T01:53:49.504Z] [INFO] --- maven-checkstyle-plugin:3.0.0:check (checkstyle-check) @ surefire-its ---
[2020-01-13T01:53:51.812Z] [INFO]
[2020-01-13T01:53:51.812Z] [INFO] --- maven-failsafe-plugin:3.0.0-M4:verify (default) @ surefire-its ---
[2020-01-13T01:53:51.812Z] [INFO] Failsafe report directory: /home/jenkins/jenkins-slave/workspace/maven2surefire-jvm-communication@2/surefire-its/target/failsafe-reports
[2020-01-13T01:53:51.812Z] [INFO]
[2020-01-13T01:53:51.812Z] [INFO] --- maven-install-plugin:2.5.2:install (default-install) @ surefire-its ---
[2020-01-13T01:53:51.812Z] [INFO] Skipping artifact installation
[2020-01-13T01:53:51.812Z] [INFO]
[2020-01-13T01:53:51.812Z] [INFO] ----------< org.apache.maven.surefire:surefire-shared-utils >-----------
[2020-01-13T01:53:51.812Z] [INFO] Building Surefire Shared Utils 3.0.0-SNAPSHOT                    [26/26]
[2020-01-13T01:53:51.812Z] [INFO] --------------------------------[ jar ]---------------------------------
[2020-01-13T01:53:51.812Z] [INFO]
[2020-01-13T01:53:51.812Z] [INFO] --- maven-clean-plugin:3.1.0:clean (default-clean) @ surefire-shared-utils ---
[2020-01-13T01:53:51.812Z] [INFO]
[2020-01-13T01:53:51.812Z] [INFO] --- maven-enforcer-plugin:3.0.0-M2:enforce (enforce-maven-version) @ surefire-shared-utils ---
[2020-01-13T01:53:51.812Z] [INFO]
[2020-01-13T01:53:51.812Z] [INFO] --- maven-enforcer-plugin:3.0.0-M2:enforce (enforce-bytecode-version) @ surefire-shared-utils ---
[2020-01-13T01:53:51.812Z] [INFO]
[2020-01-13T01:53:51.812Z] [INFO] --- maven-enforcer-plugin:3.0.0-M2:enforce (ban-known-bad-maven-versions) @ surefire-shared-utils ---
[2020-01-13T01:53:51.812Z] [INFO]
[2020-01-13T01:53:51.812Z] [INFO] --- maven-enforcer-plugin:3.0.0-M2:enforce (enforce-java) @ surefire-shared-utils ---
[2020-01-13T01:53:51.812Z] [INFO]
[2020-01-13T01:53:51.812Z] [INFO] --- maven-enforcer-plugin:3.0.0-M2:enforce (enforce-maven) @ surefire-shared-utils ---
[2020-01-13T01:53:51.812Z] [INFO]
[2020-01-13T01:53:51.812Z] [INFO] --- apache-rat-plugin:0.12:check (rat-check) @ surefire-shared-utils ---
[2020-01-13T01:53:51.812Z] [INFO] Enabled default license matchers.
[2020-01-13T01:53:51.812Z] [INFO] Will parse SCM ignores for exclusions...
[2020-01-13T01:53:51.812Z] [INFO] Finished adding exclusions from SCM ignore files.
[2020-01-13T01:53:51.812Z] [INFO] 61 implicit excludes (use -debug for more details).
[2020-01-13T01:53:51.812Z] [INFO] Exclude: .repository/**
[2020-01-13T01:53:51.812Z] [INFO] Exclude: .maven/spy.log
[2020-01-13T01:53:51.812Z] [INFO] Exclude: dependency-reduced-pom.xml
[2020-01-13T01:53:51.812Z] [INFO] Exclude: .java-version
[2020-01-13T01:53:51.812Z] [INFO] Exclude: Jenkinsfile
[2020-01-13T01:53:51.812Z] [INFO] Exclude: README.md
[2020-01-13T01:53:51.812Z] [INFO] Exclude: .editorconfig
[2020-01-13T01:53:51.812Z] [INFO] Exclude: .gitignore
[2020-01-13T01:53:51.812Z] [INFO] Exclude: .git/**/*
[2020-01-13T01:53:51.812Z] [INFO] Exclude: **/.github/**
[2020-01-13T01:53:51.812Z] [INFO] Exclude: **/.idea
[2020-01-13T01:53:51.812Z] [INFO] Exclude: **/.svn/**/*
[2020-01-13T01:53:51.812Z] [INFO] Exclude: **/*.iml
[2020-01-13T01:53:51.812Z] [INFO] Exclude: **/*.ipr
[2020-01-13T01:53:51.812Z] [INFO] Exclude: **/*.iws
[2020-01-13T01:53:51.812Z] [INFO] Exclude: **/*.versionsBackup
[2020-01-13T01:53:51.812Z] [INFO] Exclude: **/dependency-reduced-pom.xml
[2020-01-13T01:53:51.812Z] [INFO] Exclude: .repository/**
[2020-01-13T01:53:51.812Z] [INFO] Exclude: src/test/resources/**/*
[2020-01-13T01:53:51.812Z] [INFO] Exclude: src/test/resources/**/*.css
[2020-01-13T01:53:51.812Z] [INFO] Exclude: **/*.jj
[2020-01-13T01:53:51.812Z] [INFO] Exclude: src/main/resources/META-INF/services/org.apache.maven.surefire.providerapi.SurefireProvider
[2020-01-13T01:53:51.812Z] [INFO] Exclude: DEPENDENCIES
[2020-01-13T01:53:51.812Z] [INFO] Exclude: .m2/**
[2020-01-13T01:53:51.812Z] [INFO] Exclude: .m2
[2020-01-13T01:53:51.812Z] [INFO] Exclude: .travis.yml
[2020-01-13T01:53:51.812Z] [INFO] 1 resources included (use -debug for more details)
[2020-01-13T01:53:51.812Z] [INFO] Rat check: Summary over all files. Unapproved: 0, unknown: 0, generated: 0, approved: 1 licenses.
[2020-01-13T01:53:51.812Z] [INFO]
[2020-01-13T01:53:51.812Z] [INFO] --- maven-compiler-plugin:3.7.0:compile (compile-generated) @ surefire-shared-utils ---
[2020-01-13T01:53:51.812Z] [INFO] No sources to compile
[2020-01-13T01:53:51.812Z] [INFO]
[2020-01-13T01:53:51.812Z] [INFO] --- maven-remote-resources-plugin:1.5:process (process-resource-bundles) @ surefire-shared-utils ---
[2020-01-13T01:53:51.812Z] [INFO]
[2020-01-13T01:53:51.812Z] [INFO] --- maven-resources-plugin:3.1.0:resources (default-resources) @ surefire-shared-utils ---
[2020-01-13T01:53:51.812Z] [INFO] Using 'UTF-8' encoding to copy filtered resources.
[2020-01-13T01:53:51.812Z] [INFO] skip non existing resourceDirectory /home/jenkins/jenkins-slave/workspace/maven2surefire-jvm-communication@2/surefire-shared-utils/src/main/resources
[2020-01-13T01:53:51.812Z] [INFO] Copying 3 resources
[2020-01-13T01:53:51.812Z] [INFO]
[2020-01-13T01:53:51.812Z] [INFO] --- maven-compiler-plugin:3.7.0:compile (default-compile) @ surefire-shared-utils ---
[2020-01-13T01:53:51.812Z] [INFO] No sources to compile
[2020-01-13T01:53:51.813Z] [INFO]
[2020-01-13T01:53:51.813Z] [INFO] --- animal-sniffer-maven-plugin:1.17:check (signature-check) @ surefire-shared-utils ---
[2020-01-13T01:53:51.813Z] [INFO] Checking unresolved references to org.codehaus.mojo.signature:java17:1.0
[2020-01-13T01:53:52.529Z] [INFO]
[2020-01-13T01:53:52.529Z] [INFO] --- maven-resources-plugin:3.1.0:testResources (default-testResources) @ surefire-shared-utils ---
[2020-01-13T01:53:52.529Z] [INFO] Using 'UTF-8' encoding to copy filtered resources.
[2020-01-13T01:53:52.529Z] [INFO] skip non existing resourceDirectory /home/jenkins/jenkins-slave/workspace/maven2surefire-jvm-communication@2/surefire-shared-utils/src/test/resources
[2020-01-13T01:53:52.529Z] [INFO] Copying 3 resources
[2020-01-13T01:53:52.529Z] [INFO]
[2020-01-13T01:53:52.529Z] [INFO] --- maven-compiler-plugin:3.7.0:testCompile (default-testCompile) @ surefire-shared-utils ---
[2020-01-13T01:53:52.529Z] [INFO] No sources to compile
[2020-01-13T01:53:52.529Z] [INFO]
[2020-01-13T01:53:52.529Z] [INFO] --- maven-surefire-plugin:3.0.0-M4:test (default-test) @ surefire-shared-utils ---
[2020-01-13T01:53:52.529Z] [INFO]
[2020-01-13T01:53:52.529Z] [INFO] --- maven-jar-plugin:3.1.0:jar (default-jar) @ surefire-shared-utils ---
[2020-01-13T01:53:52.529Z] [INFO] Building jar: /home/jenkins/jenkins-slave/workspace/maven2surefire-jvm-communication@2/surefire-shared-utils/target/surefire-shared-utils-3.0.0-SNAPSHOT.jar
[2020-01-13T01:53:52.529Z] [INFO]
[2020-01-13T01:53:52.529Z] [INFO] --- maven-site-plugin:3.8.2:attach-descriptor (attach-descriptor) @ surefire-shared-utils ---
[2020-01-13T01:53:52.530Z] [INFO] Skipping because packaging 'jar' is not pom.
[2020-01-13T01:53:52.530Z] [INFO]
[2020-01-13T01:53:52.530Z] [INFO] --- maven-shade-plugin:3.1.1:shade (default) @ surefire-shared-utils ---
[2020-01-13T01:53:52.530Z] [INFO] Including org.apache.maven.shared:maven-shared-utils:jar:3.1.0 in the shaded jar.
[2020-01-13T01:53:52.530Z] [INFO] Including commons-io:commons-io:jar:2.6 in the shaded jar.
[2020-01-13T01:53:52.530Z] [INFO] Including org.apache.commons:commons-lang3:jar:3.8.1 in the shaded jar.
[2020-01-13T01:53:52.530Z] [INFO] Including org.apache.commons:commons-compress:jar:1.19 in the shaded jar.
[2020-01-13T01:53:52.530Z] [INFO] Including commons-codec:commons-codec:jar:1.11 in the shaded jar.
[2020-01-13T01:53:54.013Z] [INFO] Replacing original artifact with shaded artifact.
[2020-01-13T01:53:54.013Z] [INFO] Replacing /home/jenkins/jenkins-slave/workspace/maven2surefire-jvm-communication@2/surefire-shared-utils/target/surefire-shared-utils-3.0.0-SNAPSHOT.jar with /home/jenkins/jenkins-slave/workspace/maven2surefire-jvm-communication@2/surefire-shared-utils/target/surefire-shared-utils-3.0.0-SNAPSHOT-shaded.jar
[2020-01-13T01:53:54.013Z] [INFO] Dependency-reduced POM written at: /home/jenkins/jenkins-slave/workspace/maven2surefire-jvm-communication@2/surefire-shared-utils/dependency-reduced-pom.xml
[2020-01-13T01:53:54.014Z] [INFO]
[2020-01-13T01:53:54.014Z] [INFO] --- maven-checkstyle-plugin:3.0.0:check (checkstyle-check) @ surefire-shared-utils ---
[2020-01-13T01:53:54.731Z] [INFO]
[2020-01-13T01:53:54.731Z] [INFO] --- maven-install-plugin:2.5.2:install (default-install) @ surefire-shared-utils ---
[2020-01-13T01:53:54.731Z] [INFO] Installing /home/jenkins/jenkins-slave/workspace/maven2surefire-jvm-communication@2/surefire-shared-utils/target/surefire-shared-utils-3.0.0-SNAPSHOT.jar to /home/jenkins/jenkins-slave/workspace/maven2surefire-jvm-communication@2/.m2/org/apache/maven/surefire/surefire-shared-utils/3.0.0-SNAPSHOT/surefire-shared-utils-3.0.0-SNAPSHOT.jar
[2020-01-13T01:53:54.731Z] [INFO] Installing /home/jenkins/jenkins-slave/workspace/maven2surefire-jvm-communication@2/surefire-shared-utils/dependency-reduced-pom.xml to /home/jenkins/jenkins-slave/workspace/maven2surefire-jvm-communication@2/.m2/org/apache/maven/surefire/surefire-shared-utils/3.0.0-SNAPSHOT/surefire-shared-utils-3.0.0-SNAPSHOT.pom
[2020-01-13T01:53:54.731Z] [INFO] ------------------------------------------------------------------------
[2020-01-13T01:53:54.731Z] [INFO] Reactor Summary for Apache Maven Surefire 3.0.0-SNAPSHOT:
[2020-01-13T01:53:54.731Z] [INFO]
[2020-01-13T01:53:54.731Z] [INFO] Apache Maven Surefire .............................. SUCCESS [ 19.061 s]
[2020-01-13T01:53:54.731Z] [INFO] SureFire Logger API ................................ SUCCESS [ 12.061 s]
[2020-01-13T01:53:54.731Z] [INFO] SureFire API ....................................... SUCCESS [ 10.959 s]
[2020-01-13T01:53:54.731Z] [INFO] Surefire Extensions API ............................ SUCCESS [  6.565 s]
[2020-01-13T01:53:54.731Z] [INFO] Surefire Extensions SPI ............................ SUCCESS [  2.760 s]
[2020-01-13T01:53:54.731Z] [INFO] SureFire Booter .................................... SUCCESS [ 20.271 s]
[2020-01-13T01:53:54.731Z] [INFO] Maven Surefire Test-Grouping Support ............... SUCCESS [  6.599 s]
[2020-01-13T01:53:54.731Z] [INFO] SureFire Providers ................................. SUCCESS [  1.476 s]
[2020-01-13T01:53:54.731Z] [INFO] Shared JUnit3 Provider Code ........................ SUCCESS [  4.702 s]
[2020-01-13T01:53:54.731Z] [INFO] Shared Java 5 Provider Base ........................ SUCCESS [  5.759 s]
[2020-01-13T01:53:54.731Z] [INFO] Shared JUnit4 Provider Code ........................ SUCCESS [  5.693 s]
[2020-01-13T01:53:54.731Z] [INFO] Shared JUnit48 Provider Code ....................... SUCCESS [  7.034 s]
[2020-01-13T01:53:54.731Z] [INFO] SureFire JUnit Runner .............................. SUCCESS [  5.580 s]
[2020-01-13T01:53:54.731Z] [INFO] SureFire JUnit4 Runner ............................. SUCCESS [  5.417 s]
[2020-01-13T01:53:54.731Z] [INFO] Maven Surefire Common .............................. SUCCESS [ 56.123 s]
[2020-01-13T01:53:54.731Z] [INFO] SureFire JUnitCore Runner .......................... SUCCESS [02:21 min]
[2020-01-13T01:53:54.731Z] [INFO] SureFire JUnit Platform Runner ..................... SUCCESS [ 14.329 s]
[2020-01-13T01:53:54.731Z] [INFO] SureFire TestNG Utils .............................. SUCCESS [  5.850 s]
[2020-01-13T01:53:54.731Z] [INFO] SureFire TestNG Runner ............................. SUCCESS [  5.953 s]
[2020-01-13T01:53:54.731Z] [INFO] ShadeFire JUnit3 Provider .......................... SUCCESS [  1.810 s]
[2020-01-13T01:53:54.731Z] [INFO] Surefire Report Parser ............................. SUCCESS [  6.802 s]
[2020-01-13T01:53:54.731Z] [INFO] Maven Surefire Plugin .............................. SUCCESS [ 14.696 s]
[2020-01-13T01:53:54.731Z] [INFO] Maven Failsafe Plugin .............................. SUCCESS [ 13.642 s]
[2020-01-13T01:53:54.731Z] [INFO] Maven Surefire Report Plugin ....................... SUCCESS [ 20.224 s]
[2020-01-13T01:53:54.731Z] [INFO] Maven Surefire Integration Tests ................... SUCCESS [  01:23 h]
[2020-01-13T01:53:54.731Z] [INFO] Surefire Shared Utils .............................. SUCCESS [  3.320 s]
[2020-01-13T01:53:54.731Z] [INFO] ------------------------------------------------------------------------
[2020-01-13T01:53:54.731Z] [INFO] BUILD SUCCESS
[2020-01-13T01:53:54.731Z] [INFO] ------------------------------------------------------------------------
[2020-01-13T01:53:54.731Z] [INFO] Total time:  01:29 h
[2020-01-13T01:53:54.731Z] [INFO] Finished at: 2020-01-13T01:53:54Z
[2020-01-13T01:53:54.731Z] [INFO] ------------------------------------------------------------------------
[Pipeline] }
[Pipeline] // withEnv
[Pipeline] }
[Pipeline] // stage
[Pipeline] fileExists
[Pipeline] fileExists
[Pipeline] zip
[2020-01-13T01:53:55.968Z] Writing zip file of /home/jenkins/jenkins-slave/workspace/maven2surefire-jvm-communication@2/surefire-its/target to /home/jenkins/jenkins-slave/workspace/maven2surefire-jvm-communication@2/surefire-its--linux-jdk11-maven3.6.x.zip
[2020-01-13T01:54:08.627Z] Zipped 18349 entries.
[2020-01-13T01:54:08.627Z] Archiving /home/jenkins/jenkins-slave/workspace/maven2surefire-jvm-communication@2/surefire-its--linux-jdk11-maven3.6.x.zip
[2020-01-13T01:54:08.628Z] [Fast Archiver] No artifacts from Maven TLP » maven-surefire » maven2surefire-jvm-communication #27 to compare, so performing full copy of artifacts
[Pipeline] archiveArtifacts
[2020-01-13T01:54:13.873Z] Archiving artifacts
[2020-01-13T01:54:14.034Z] [Fast Archiver] No artifacts from Maven TLP » maven-surefire » maven2surefire-jvm-communication #27 to compare, so performing full copy of artifacts
[Pipeline] cleanWs
[2020-01-13T01:54:19.322Z] [WS-CLEANUP] Deleting project workspace...
[2020-01-13T01:54:19.322Z] [WS-CLEANUP] Deferred wipeout is used...
[2020-01-13T01:54:19.642Z] [WS-CLEANUP] done
[Pipeline] }
[Pipeline] // ws
[Pipeline] }
[Pipeline] // timestamps
[Pipeline] }
[Pipeline] // node
[Pipeline] }
[Pipeline] // parallel
[Pipeline] echo
Build result: FAILURE
[Pipeline] jiraIssueSelector
[Pipeline] echo
The authors of changes [tibordigana].
[Pipeline] echo
Sending email ...
[Pipeline] emailext
Reply | Threaded
Open this post in threaded view
|

Build failed in Jenkins: Maven TLP » maven-surefire » maven2surefire-jvm-communication #30

Apache Jenkins Server-2
See https://builds.apache.org/job/maven-box/job/maven-surefire/job/maven2surefire-jvm-communication/30/

Changes:

* -fn
* skipped tests
* cat dumps
* upload artifact
* investigate only Ubuntu
* surefire JAR not created. Let's use the old version.

All tests passed

Build log:
[...truncated 34462 lines...]
[2020-01-13T03:22:17.775Z] [INFO] Apache Maven Surefire .............................. SUCCESS [ 18.827 s]
[2020-01-13T03:22:17.775Z] [INFO] SureFire Logger API ................................ SUCCESS [ 11.283 s]
[2020-01-13T03:22:17.775Z] [INFO] SureFire API ....................................... SUCCESS [ 14.475 s]
[2020-01-13T03:22:17.775Z] [INFO] Surefire Extensions API ............................ SUCCESS [  7.748 s]
[2020-01-13T03:22:17.775Z] [INFO] Surefire Extensions SPI ............................ SUCCESS [  2.668 s]
[2020-01-13T03:22:17.775Z] [INFO] SureFire Booter .................................... SUCCESS [ 23.517 s]
[2020-01-13T03:22:17.775Z] [INFO] Maven Surefire Test-Grouping Support ............... SUCCESS [  7.171 s]
[2020-01-13T03:22:17.775Z] [INFO] SureFire Providers ................................. SUCCESS [  1.486 s]
[2020-01-13T03:22:17.775Z] [INFO] Shared JUnit3 Provider Code ........................ SUCCESS [  5.016 s]
[2020-01-13T03:22:17.775Z] [INFO] Shared Java 5 Provider Base ........................ SUCCESS [  5.768 s]
[2020-01-13T03:22:17.775Z] [INFO] Shared JUnit4 Provider Code ........................ SUCCESS [  6.020 s]
[2020-01-13T03:22:17.775Z] [INFO] Shared JUnit48 Provider Code ....................... SUCCESS [  7.174 s]
[2020-01-13T03:22:17.775Z] [INFO] SureFire JUnit Runner .............................. SUCCESS [  5.342 s]
[2020-01-13T03:22:17.775Z] [INFO] SureFire JUnit4 Runner ............................. SUCCESS [  5.702 s]
[2020-01-13T03:22:17.775Z] [INFO] Maven Surefire Common .............................. SUCCESS [ 52.551 s]
[2020-01-13T03:22:17.775Z] [INFO] SureFire JUnitCore Runner .......................... SUCCESS [02:25 min]
[2020-01-13T03:22:17.775Z] [INFO] SureFire JUnit Platform Runner ..................... SUCCESS [ 14.638 s]
[2020-01-13T03:22:17.775Z] [INFO] SureFire TestNG Utils .............................. SUCCESS [  5.650 s]
[2020-01-13T03:22:17.775Z] [INFO] SureFire TestNG Runner ............................. SUCCESS [  6.069 s]
[2020-01-13T03:22:17.775Z] [INFO] ShadeFire JUnit3 Provider .......................... SUCCESS [  1.895 s]
[2020-01-13T03:22:17.775Z] [INFO] Surefire Report Parser ............................. SUCCESS [  7.359 s]
[2020-01-13T03:22:17.775Z] [INFO] Maven Surefire Plugin .............................. SUCCESS [ 12.987 s]
[2020-01-13T03:22:17.775Z] [INFO] Maven Failsafe Plugin .............................. SUCCESS [ 14.038 s]
[2020-01-13T03:22:17.775Z] [INFO] Maven Surefire Report Plugin ....................... SUCCESS [ 19.559 s]
[2020-01-13T03:22:17.775Z] [INFO] Maven Surefire Integration Tests ................... SUCCESS [  01:17 h]
[2020-01-13T03:22:17.775Z] [INFO] Surefire Shared Utils .............................. SUCCESS [02:47 min]
[2020-01-13T03:22:17.775Z] [INFO] ------------------------------------------------------------------------
[2020-01-13T03:22:17.775Z] [INFO] BUILD SUCCESS
[2020-01-13T03:22:17.775Z] [INFO] ------------------------------------------------------------------------
[2020-01-13T03:22:17.775Z] [INFO] Total time:  01:27 h
[2020-01-13T03:22:17.775Z] [INFO] Finished at: 2020-01-13T03:22:16Z
[2020-01-13T03:22:17.775Z] [INFO] ------------------------------------------------------------------------
[Pipeline] }
[Pipeline] // withEnv
[Pipeline] }
[Pipeline] // stage
[Pipeline] openTasks
[2020-01-13T03:22:18.683Z] [TASKS] Skipping publisher since build result is FAILURE
[Pipeline] jacoco
[Pipeline] junit
[2020-01-13T03:22:19.291Z] Recording test results
[2020-01-13T03:22:21.299Z] [INFO] Tests run: 1, Failures: 0, Errors: 0, Skipped: 0, Time elapsed: 6.82 s - in org.apache.maven.surefire.its.jiras.Surefire975DefaultVMEncodingIT
[2020-01-13T03:22:21.299Z] [INFO] Running org.apache.maven.surefire.its.jiras.Surefire979WrongClassLoaderIT
[Pipeline] fileExists
[Pipeline] fileExists
[Pipeline] zip
[2020-01-13T03:22:23.163Z] Writing zip file of /home/jenkins/jenkins-slave/workspace/maven2surefire-jvm-communication@2/surefire-its/target to /home/jenkins/jenkins-slave/workspace/maven2surefire-jvm-communication@2/surefire-its--linux-jdk14-maven3.6.x.zip
[2020-01-13T03:22:29.133Z] [INFO] Tests run: 1, Failures: 0, Errors: 0, Skipped: 0, Time elapsed: 6.671 s - in org.apache.maven.surefire.its.jiras.Surefire979WrongClassLoaderIT
[2020-01-13T03:22:29.133Z] [INFO] Running org.apache.maven.surefire.its.jiras.Surefire985ParameterizedRunnerAndCategoriesIT
[2020-01-13T03:22:34.402Z] [INFO] Tests run: 1, Failures: 0, Errors: 0, Skipped: 0, Time elapsed: 6.082 s - in org.apache.maven.surefire.its.jiras.Surefire985ParameterizedRunnerAndCategoriesIT
[2020-01-13T03:22:34.402Z] [INFO] Running org.apache.maven.surefire.its.jiras.Surefire995CategoryInheritanceIT
[2020-01-13T03:22:36.200Z] Zipped 18374 entries.
[2020-01-13T03:22:36.200Z] Archiving /home/jenkins/jenkins-slave/workspace/maven2surefire-jvm-communication@2/surefire-its--linux-jdk14-maven3.6.x.zip
[2020-01-13T03:22:36.220Z] [Fast Archiver] No artifacts from Maven TLP » maven-surefire » maven2surefire-jvm-communication #27 to compare, so performing full copy of artifacts
[Pipeline] archiveArtifacts
[2020-01-13T03:22:41.492Z] Archiving artifacts
[2020-01-13T03:22:41.800Z] [Fast Archiver] No artifacts from Maven TLP » maven-surefire » maven2surefire-jvm-communication #27 to compare, so performing full copy of artifacts
[Pipeline] cleanWs
[2020-01-13T03:22:47.247Z] [WS-CLEANUP] Deleting project workspace...
[2020-01-13T03:22:47.248Z] [WS-CLEANUP] Deferred wipeout is used...
[2020-01-13T03:22:47.876Z] [WS-CLEANUP] done
[Pipeline] }
[Pipeline] // ws
[Pipeline] }
[Pipeline] // timestamps
[Pipeline] }
[Pipeline] // node
[Pipeline] }
[2020-01-13T03:23:03.672Z] [INFO] Tests run: 5, Failures: 0, Errors: 0, Skipped: 0, Time elapsed: 29.388 s - in org.apache.maven.surefire.its.jiras.Surefire995CategoryInheritanceIT
[2020-01-13T03:23:03.672Z] [INFO]
[2020-01-13T03:23:03.672Z] [INFO] Results:
[2020-01-13T03:23:03.672Z] [INFO]
[2020-01-13T03:23:03.672Z] [WARNING] Tests run: 861, Failures: 0, Errors: 0, Skipped: 135
[2020-01-13T03:23:03.672Z] [INFO]
[2020-01-13T03:23:03.672Z] [INFO]
[2020-01-13T03:23:03.672Z] [INFO] --- maven-checkstyle-plugin:3.0.0:check (checkstyle-check) @ surefire-its ---
[2020-01-13T03:23:05.977Z] [INFO]
[2020-01-13T03:23:05.977Z] [INFO] --- maven-failsafe-plugin:3.0.0-M4:verify (default) @ surefire-its ---
[2020-01-13T03:23:05.977Z] [INFO] Failsafe report directory: /home/jenkins/jenkins-slave/workspace/maven2surefire-jvm-communication@3@2/surefire-its/target/failsafe-reports
[2020-01-13T03:23:05.977Z] [INFO]
[2020-01-13T03:23:05.977Z] [INFO] --- maven-install-plugin:2.5.2:install (default-install) @ surefire-its ---
[2020-01-13T03:23:05.977Z] [INFO] Skipping artifact installation
[2020-01-13T03:23:05.977Z] [INFO]
[2020-01-13T03:23:05.977Z] [INFO] ----------< org.apache.maven.surefire:surefire-shared-utils >-----------
[2020-01-13T03:23:05.977Z] [INFO] Building Surefire Shared Utils 3.0.0-SNAPSHOT                    [26/26]
[2020-01-13T03:23:05.977Z] [INFO] --------------------------------[ jar ]---------------------------------
[2020-01-13T03:23:06.692Z] [INFO]
[2020-01-13T03:23:06.693Z] [INFO] --- maven-clean-plugin:3.1.0:clean (default-clean) @ surefire-shared-utils ---
[2020-01-13T03:23:06.693Z] [INFO]
[2020-01-13T03:23:06.693Z] [INFO] --- maven-enforcer-plugin:3.0.0-M2:enforce (enforce-maven-version) @ surefire-shared-utils ---
[2020-01-13T03:23:06.693Z] [INFO]
[2020-01-13T03:23:06.693Z] [INFO] --- maven-enforcer-plugin:3.0.0-M2:enforce (enforce-bytecode-version) @ surefire-shared-utils ---
[2020-01-13T03:23:06.693Z] [INFO]
[2020-01-13T03:23:06.693Z] [INFO] --- maven-enforcer-plugin:3.0.0-M2:enforce (ban-known-bad-maven-versions) @ surefire-shared-utils ---
[2020-01-13T03:23:06.693Z] [INFO]
[2020-01-13T03:23:06.693Z] [INFO] --- maven-enforcer-plugin:3.0.0-M2:enforce (enforce-java) @ surefire-shared-utils ---
[2020-01-13T03:23:06.693Z] [INFO]
[2020-01-13T03:23:06.693Z] [INFO] --- maven-enforcer-plugin:3.0.0-M2:enforce (enforce-maven) @ surefire-shared-utils ---
[2020-01-13T03:23:06.693Z] [INFO]
[2020-01-13T03:23:06.693Z] [INFO] --- apache-rat-plugin:0.12:check (rat-check) @ surefire-shared-utils ---
[2020-01-13T03:23:06.693Z] [INFO] Enabled default license matchers.
[2020-01-13T03:23:06.693Z] [INFO] Will parse SCM ignores for exclusions...
[2020-01-13T03:23:06.693Z] [INFO] Finished adding exclusions from SCM ignore files.
[2020-01-13T03:23:06.693Z] [INFO] 61 implicit excludes (use -debug for more details).
[2020-01-13T03:23:06.693Z] [INFO] Exclude: .repository/**
[2020-01-13T03:23:06.693Z] [INFO] Exclude: .maven/spy.log
[2020-01-13T03:23:06.693Z] [INFO] Exclude: dependency-reduced-pom.xml
[2020-01-13T03:23:06.693Z] [INFO] Exclude: .java-version
[2020-01-13T03:23:06.693Z] [INFO] Exclude: Jenkinsfile
[2020-01-13T03:23:06.693Z] [INFO] Exclude: README.md
[2020-01-13T03:23:06.693Z] [INFO] Exclude: .editorconfig
[2020-01-13T03:23:06.693Z] [INFO] Exclude: .gitignore
[2020-01-13T03:23:06.693Z] [INFO] Exclude: .git/**/*
[2020-01-13T03:23:06.693Z] [INFO] Exclude: **/.github/**
[2020-01-13T03:23:06.693Z] [INFO] Exclude: **/.idea
[2020-01-13T03:23:06.693Z] [INFO] Exclude: **/.svn/**/*
[2020-01-13T03:23:06.693Z] [INFO] Exclude: **/*.iml
[2020-01-13T03:23:06.693Z] [INFO] Exclude: **/*.ipr
[2020-01-13T03:23:06.693Z] [INFO] Exclude: **/*.iws
[2020-01-13T03:23:06.693Z] [INFO] Exclude: **/*.versionsBackup
[2020-01-13T03:23:06.693Z] [INFO] Exclude: **/dependency-reduced-pom.xml
[2020-01-13T03:23:06.693Z] [INFO] Exclude: .repository/**
[2020-01-13T03:23:06.693Z] [INFO] Exclude: src/test/resources/**/*
[2020-01-13T03:23:06.693Z] [INFO] Exclude: src/test/resources/**/*.css
[2020-01-13T03:23:06.693Z] [INFO] Exclude: **/*.jj
[2020-01-13T03:23:06.693Z] [INFO] Exclude: src/main/resources/META-INF/services/org.apache.maven.surefire.providerapi.SurefireProvider
[2020-01-13T03:23:06.693Z] [INFO] Exclude: DEPENDENCIES
[2020-01-13T03:23:06.693Z] [INFO] Exclude: .m2/**
[2020-01-13T03:23:06.693Z] [INFO] Exclude: .m2
[2020-01-13T03:23:06.693Z] [INFO] Exclude: .travis.yml
[2020-01-13T03:23:06.693Z] [INFO] 1 resources included (use -debug for more details)
[2020-01-13T03:23:06.693Z] [INFO] Rat check: Summary over all files. Unapproved: 0, unknown: 0, generated: 0, approved: 1 licenses.
[2020-01-13T03:23:06.693Z] [INFO]
[2020-01-13T03:23:06.693Z] [INFO] --- maven-compiler-plugin:3.7.0:compile (compile-generated) @ surefire-shared-utils ---
[2020-01-13T03:23:06.693Z] [INFO] No sources to compile
[2020-01-13T03:23:06.693Z] [INFO]
[2020-01-13T03:23:06.693Z] [INFO] --- maven-remote-resources-plugin:1.5:process (process-resource-bundles) @ surefire-shared-utils ---
[2020-01-13T03:23:06.693Z] [INFO]
[2020-01-13T03:23:06.693Z] [INFO] --- maven-resources-plugin:3.1.0:resources (default-resources) @ surefire-shared-utils ---
[2020-01-13T03:23:06.693Z] [INFO] Using 'UTF-8' encoding to copy filtered resources.
[2020-01-13T03:23:06.693Z] [INFO] skip non existing resourceDirectory /home/jenkins/jenkins-slave/workspace/maven2surefire-jvm-communication@3@2/surefire-shared-utils/src/main/resources
[2020-01-13T03:23:06.693Z] [INFO] Copying 3 resources
[2020-01-13T03:23:06.693Z] [INFO]
[2020-01-13T03:23:06.693Z] [INFO] --- maven-compiler-plugin:3.7.0:compile (default-compile) @ surefire-shared-utils ---
[2020-01-13T03:23:06.693Z] [INFO] No sources to compile
[2020-01-13T03:23:06.693Z] [INFO]
[2020-01-13T03:23:06.693Z] [INFO] --- animal-sniffer-maven-plugin:1.17:check (signature-check) @ surefire-shared-utils ---
[2020-01-13T03:23:06.693Z] [INFO] Checking unresolved references to org.codehaus.mojo.signature:java17:1.0
[2020-01-13T03:23:07.409Z] [INFO]
[2020-01-13T03:23:07.409Z] [INFO] --- maven-resources-plugin:3.1.0:testResources (default-testResources) @ surefire-shared-utils ---
[2020-01-13T03:23:07.409Z] [INFO] Using 'UTF-8' encoding to copy filtered resources.
[2020-01-13T03:23:07.409Z] [INFO] skip non existing resourceDirectory /home/jenkins/jenkins-slave/workspace/maven2surefire-jvm-communication@3@2/surefire-shared-utils/src/test/resources
[2020-01-13T03:23:07.409Z] [INFO] Copying 3 resources
[2020-01-13T03:23:07.409Z] [INFO]
[2020-01-13T03:23:07.409Z] [INFO] --- maven-compiler-plugin:3.7.0:testCompile (default-testCompile) @ surefire-shared-utils ---
[2020-01-13T03:23:07.409Z] [INFO] No sources to compile
[2020-01-13T03:23:07.409Z] [INFO]
[2020-01-13T03:23:07.409Z] [INFO] --- maven-surefire-plugin:3.0.0-M4:test (default-test) @ surefire-shared-utils ---
[2020-01-13T03:23:07.409Z] [INFO]
[2020-01-13T03:23:07.409Z] [INFO] --- maven-jar-plugin:3.1.0:jar (default-jar) @ surefire-shared-utils ---
[2020-01-13T03:23:07.410Z] [INFO] Building jar: /home/jenkins/jenkins-slave/workspace/maven2surefire-jvm-communication@3@2/surefire-shared-utils/target/surefire-shared-utils-3.0.0-SNAPSHOT.jar
[2020-01-13T03:23:07.410Z] [INFO]
[2020-01-13T03:23:07.410Z] [INFO] --- maven-site-plugin:3.8.2:attach-descriptor (attach-descriptor) @ surefire-shared-utils ---
[2020-01-13T03:23:07.410Z] [INFO] Skipping because packaging 'jar' is not pom.
[2020-01-13T03:23:07.410Z] [INFO]
[2020-01-13T03:23:07.410Z] [INFO] --- maven-shade-plugin:3.1.1:shade (default) @ surefire-shared-utils ---
[2020-01-13T03:23:07.410Z] [INFO] Including org.apache.maven.shared:maven-shared-utils:jar:3.1.0 in the shaded jar.
[2020-01-13T03:23:07.410Z] [INFO] Including commons-io:commons-io:jar:2.6 in the shaded jar.
[2020-01-13T03:23:07.410Z] [INFO] Including org.apache.commons:commons-lang3:jar:3.8.1 in the shaded jar.
[2020-01-13T03:23:07.410Z] [INFO] Including org.apache.commons:commons-compress:jar:1.19 in the shaded jar.
[2020-01-13T03:23:07.410Z] [INFO] Including commons-codec:commons-codec:jar:1.11 in the shaded jar.
[2020-01-13T03:23:08.889Z] [INFO] Replacing original artifact with shaded artifact.
[2020-01-13T03:23:08.889Z] [INFO] Replacing /home/jenkins/jenkins-slave/workspace/maven2surefire-jvm-communication@3@2/surefire-shared-utils/target/surefire-shared-utils-3.0.0-SNAPSHOT.jar with /home/jenkins/jenkins-slave/workspace/maven2surefire-jvm-communication@3@2/surefire-shared-utils/target/surefire-shared-utils-3.0.0-SNAPSHOT-shaded.jar
[2020-01-13T03:23:08.889Z] [INFO] Dependency-reduced POM written at: /home/jenkins/jenkins-slave/workspace/maven2surefire-jvm-communication@3@2/surefire-shared-utils/dependency-reduced-pom.xml
[2020-01-13T03:23:08.889Z] [INFO]
[2020-01-13T03:23:08.889Z] [INFO] --- maven-checkstyle-plugin:3.0.0:check (checkstyle-check) @ surefire-shared-utils ---
[2020-01-13T03:23:09.603Z] [INFO]
[2020-01-13T03:23:09.603Z] [INFO] --- maven-install-plugin:2.5.2:install (default-install) @ surefire-shared-utils ---
[2020-01-13T03:23:09.603Z] [INFO] Installing /home/jenkins/jenkins-slave/workspace/maven2surefire-jvm-communication@3@2/surefire-shared-utils/target/surefire-shared-utils-3.0.0-SNAPSHOT.jar to /home/jenkins/jenkins-slave/workspace/maven2surefire-jvm-communication@3@2/.m2/org/apache/maven/surefire/surefire-shared-utils/3.0.0-SNAPSHOT/surefire-shared-utils-3.0.0-SNAPSHOT.jar
[2020-01-13T03:23:09.604Z] [INFO] Installing /home/jenkins/jenkins-slave/workspace/maven2surefire-jvm-communication@3@2/surefire-shared-utils/dependency-reduced-pom.xml to /home/jenkins/jenkins-slave/workspace/maven2surefire-jvm-communication@3@2/.m2/org/apache/maven/surefire/surefire-shared-utils/3.0.0-SNAPSHOT/surefire-shared-utils-3.0.0-SNAPSHOT.pom
[2020-01-13T03:23:09.604Z] [INFO] ------------------------------------------------------------------------
[2020-01-13T03:23:09.604Z] [INFO] Reactor Summary for Apache Maven Surefire 3.0.0-SNAPSHOT:
[2020-01-13T03:23:09.604Z] [INFO]
[2020-01-13T03:23:09.604Z] [INFO] Apache Maven Surefire .............................. SUCCESS [ 18.383 s]
[2020-01-13T03:23:09.604Z] [INFO] SureFire Logger API ................................ SUCCESS [ 11.618 s]
[2020-01-13T03:23:09.604Z] [INFO] SureFire API ....................................... SUCCESS [ 14.282 s]
[2020-01-13T03:23:09.604Z] [INFO] Surefire Extensions API ............................ SUCCESS [  6.891 s]
[2020-01-13T03:23:09.604Z] [INFO] Surefire Extensions SPI ............................ SUCCESS [  2.849 s]
[2020-01-13T03:23:09.604Z] [INFO] SureFire Booter .................................... SUCCESS [ 19.130 s]
[2020-01-13T03:23:09.604Z] [INFO] Maven Surefire Test-Grouping Support ............... SUCCESS [  6.765 s]
[2020-01-13T03:23:09.604Z] [INFO] SureFire Providers ................................. SUCCESS [  1.476 s]
[2020-01-13T03:23:09.604Z] [INFO] Shared JUnit3 Provider Code ........................ SUCCESS [  4.685 s]
[2020-01-13T03:23:09.604Z] [INFO] Shared Java 5 Provider Base ........................ SUCCESS [  5.491 s]
[2020-01-13T03:23:09.604Z] [INFO] Shared JUnit4 Provider Code ........................ SUCCESS [  5.785 s]
[2020-01-13T03:23:09.604Z] [INFO] Shared JUnit48 Provider Code ....................... SUCCESS [  6.949 s]
[2020-01-13T03:23:09.604Z] [INFO] SureFire JUnit Runner .............................. SUCCESS [  5.127 s]
[2020-01-13T03:23:09.604Z] [INFO] SureFire JUnit4 Runner ............................. SUCCESS [  5.362 s]
[2020-01-13T03:23:09.604Z] [INFO] Maven Surefire Common .............................. SUCCESS [ 57.073 s]
[2020-01-13T03:23:09.604Z] [INFO] SureFire JUnitCore Runner .......................... SUCCESS [02:21 min]
[2020-01-13T03:23:09.604Z] [INFO] SureFire JUnit Platform Runner ..................... SUCCESS [ 13.134 s]
[2020-01-13T03:23:09.604Z] [INFO] SureFire TestNG Utils .............................. SUCCESS [  5.215 s]
[2020-01-13T03:23:09.604Z] [INFO] SureFire TestNG Runner ............................. SUCCESS [  5.966 s]
[2020-01-13T03:23:09.604Z] [INFO] ShadeFire JUnit3 Provider .......................... SUCCESS [  1.915 s]
[2020-01-13T03:23:09.604Z] [INFO] Surefire Report Parser ............................. SUCCESS [  6.847 s]
[2020-01-13T03:23:09.604Z] [INFO] Maven Surefire Plugin .............................. SUCCESS [ 12.821 s]
[2020-01-13T03:23:09.604Z] [INFO] Maven Failsafe Plugin .............................. SUCCESS [ 12.536 s]
[2020-01-13T03:23:09.604Z] [INFO] Maven Surefire Report Plugin ....................... SUCCESS [ 18.228 s]
[2020-01-13T03:23:09.604Z] [INFO] Maven Surefire Integration Tests ................... SUCCESS [  01:21 h]
[2020-01-13T03:23:09.604Z] [INFO] Surefire Shared Utils .............................. SUCCESS [  3.518 s]
[2020-01-13T03:23:09.604Z] [INFO] ------------------------------------------------------------------------
[2020-01-13T03:23:09.604Z] [INFO] BUILD SUCCESS
[2020-01-13T03:23:09.604Z] [INFO] ------------------------------------------------------------------------
[2020-01-13T03:23:09.604Z] [INFO] Total time:  01:28 h
[2020-01-13T03:23:09.604Z] [INFO] Finished at: 2020-01-13T03:23:08Z
[2020-01-13T03:23:09.604Z] [INFO] ------------------------------------------------------------------------
[Pipeline] }
[Pipeline] // withEnv
[Pipeline] }
[Pipeline] // stage
[Pipeline] fileExists
[Pipeline] fileExists
[Pipeline] zip
[2020-01-13T03:23:10.840Z] Writing zip file of /home/jenkins/jenkins-slave/workspace/maven2surefire-jvm-communication@3@2/surefire-its/target to /home/jenkins/jenkins-slave/workspace/maven2surefire-jvm-communication@3@2/surefire-its--linux-jdk11-maven3.6.x.zip
[2020-01-13T03:23:23.862Z] Zipped 18380 entries.
[2020-01-13T03:23:23.862Z] Archiving /home/jenkins/jenkins-slave/workspace/maven2surefire-jvm-communication@3@2/surefire-its--linux-jdk11-maven3.6.x.zip
[2020-01-13T03:23:23.864Z] [Fast Archiver] No artifacts from Maven TLP » maven-surefire » maven2surefire-jvm-communication #27 to compare, so performing full copy of artifacts
[Pipeline] archiveArtifacts
[2020-01-13T03:23:29.586Z] Archiving artifacts
[2020-01-13T03:23:29.745Z] [Fast Archiver] No artifacts from Maven TLP » maven-surefire » maven2surefire-jvm-communication #27 to compare, so performing full copy of artifacts
[Pipeline] cleanWs
[2020-01-13T03:23:34.956Z] [WS-CLEANUP] Deleting project workspace...
[2020-01-13T03:23:34.956Z] [WS-CLEANUP] Deferred wipeout is used...
[2020-01-13T03:23:35.272Z] [WS-CLEANUP] done
[Pipeline] }
[Pipeline] // ws
[Pipeline] }
[Pipeline] // timestamps
[Pipeline] }
[Pipeline] // node
[Pipeline] }
[Pipeline] // parallel
[Pipeline] echo
Build result: FAILURE
[Pipeline] jiraIssueSelector
[Pipeline] echo
The authors of changes [tibordigana].
[Pipeline] echo
Sending email ...
[Pipeline] emailext
Reply | Threaded
Open this post in threaded view
|

Build failed in Jenkins: Maven TLP » maven-surefire » maven2surefire-jvm-communication #31

Apache Jenkins Server-2
See https://builds.apache.org/job/maven-box/job/maven-surefire/job/maven2surefire-jvm-communication/31/

Changes:

* Add JDK 15
* Add Maven 3.6.3

All tests passed

Build log:
[...truncated 17302 lines...]
[2020-01-16T07:46:37.081Z] [INFO] ------------------------------------------------------------------------
[2020-01-16T07:46:37.081Z] [INFO] Reactor Summary for Apache Maven Surefire 3.0.0-SNAPSHOT:
[2020-01-16T07:46:37.081Z] [INFO]
[2020-01-16T07:46:37.081Z] [INFO] Apache Maven Surefire .............................. SUCCESS [ 15.396 s]
[2020-01-16T07:46:37.081Z] [INFO] SureFire Logger API ................................ SUCCESS [  7.988 s]
[2020-01-16T07:46:37.081Z] [INFO] SureFire API ....................................... SUCCESS [  8.571 s]
[2020-01-16T07:46:37.081Z] [INFO] Surefire Extensions API ............................ SUCCESS [  4.316 s]
[2020-01-16T07:46:37.081Z] [INFO] Surefire Extensions SPI ............................ SUCCESS [  1.788 s]
[2020-01-16T07:46:37.081Z] [INFO] SureFire Booter .................................... SUCCESS [ 12.424 s]
[2020-01-16T07:46:37.081Z] [INFO] Maven Surefire Test-Grouping Support ............... SUCCESS [  4.760 s]
[2020-01-16T07:46:37.081Z] [INFO] SureFire Providers ................................. SUCCESS [  0.849 s]
[2020-01-16T07:46:37.081Z] [INFO] Shared JUnit3 Provider Code ........................ SUCCESS [  3.177 s]
[2020-01-16T07:46:37.081Z] [INFO] Shared Java 5 Provider Base ........................ SUCCESS [  3.621 s]
[2020-01-16T07:46:37.081Z] [INFO] Shared JUnit4 Provider Code ........................ SUCCESS [  3.791 s]
[2020-01-16T07:46:37.081Z] [INFO] Shared JUnit48 Provider Code ....................... SUCCESS [  4.591 s]
[2020-01-16T07:46:37.081Z] [INFO] SureFire JUnit Runner .............................. SUCCESS [  3.344 s]
[2020-01-16T07:46:37.081Z] [INFO] SureFire JUnit4 Runner ............................. SUCCESS [  3.416 s]
[2020-01-16T07:46:37.081Z] [INFO] Maven Surefire Common .............................. SUCCESS [ 30.608 s]
[2020-01-16T07:46:37.081Z] [INFO] SureFire JUnitCore Runner .......................... SUCCESS [02:13 min]
[2020-01-16T07:46:37.081Z] [INFO] SureFire JUnit Platform Runner ..................... SUCCESS [  8.750 s]
[2020-01-16T07:46:37.081Z] [INFO] SureFire TestNG Utils .............................. SUCCESS [  3.643 s]
[2020-01-16T07:46:37.081Z] [INFO] SureFire TestNG Runner ............................. SUCCESS [  4.008 s]
[2020-01-16T07:46:37.081Z] [INFO] ShadeFire JUnit3 Provider .......................... SUCCESS [  1.158 s]
[2020-01-16T07:46:37.081Z] [INFO] Surefire Report Parser ............................. SUCCESS [  4.367 s]
[2020-01-16T07:46:37.081Z] [INFO] Maven Surefire Plugin .............................. SUCCESS [  8.570 s]
[2020-01-16T07:46:37.081Z] [INFO] Maven Failsafe Plugin .............................. SUCCESS [  8.381 s]
[2020-01-16T07:46:37.081Z] [INFO] Maven Surefire Report Plugin ....................... SUCCESS [ 11.968 s]
[2020-01-16T07:46:37.081Z] [INFO] Maven Surefire Integration Tests ................... SUCCESS [52:32 min]
[2020-01-16T07:46:37.081Z] [INFO] Surefire Shared Utils .............................. SUCCESS [  2.172 s]
[2020-01-16T07:46:37.081Z] [INFO] ------------------------------------------------------------------------
[2020-01-16T07:46:37.081Z] [INFO] BUILD SUCCESS
[2020-01-16T07:46:37.081Z] [INFO] ------------------------------------------------------------------------
[2020-01-16T07:46:37.081Z] [INFO] Total time:  57:29 min
[2020-01-16T07:46:37.081Z] [INFO] Finished at: 2020-01-16T07:46:36Z
[2020-01-16T07:46:37.081Z] [INFO] ------------------------------------------------------------------------
[Pipeline] }
[Pipeline] // withEnv
[Pipeline] }
[Pipeline] // stage
[Pipeline] cleanWs
[2020-01-16T07:46:37.842Z] [WS-CLEANUP] Deleting project workspace...
[2020-01-16T07:46:37.842Z] [WS-CLEANUP] Deferred wipeout is used...
[2020-01-16T07:46:38.158Z] [WS-CLEANUP] done
[Pipeline] }
[Pipeline] // ws
[Pipeline] }
[Pipeline] // timestamps
[Pipeline] }
[Pipeline] // node
[Pipeline] }
[2020-01-16T07:47:08.647Z] [INFO] Tests run: 6, Failures: 0, Errors: 0, Skipped: 0, Time elapsed: 54.157 s - in org.apache.maven.surefire.its.jiras.Surefire946KillMainProcessInReusableForkIT
[2020-01-16T07:47:08.648Z] [INFO] Running org.apache.maven.surefire.its.jiras.Surefire972BizarreNoClassDefIT
[2020-01-16T07:47:11.850Z] [INFO] Tests run: 1, Failures: 0, Errors: 0, Skipped: 0, Time elapsed: 5.887 s - in org.apache.maven.surefire.its.jiras.Surefire972BizarreNoClassDefIT
[2020-01-16T07:47:11.850Z] [INFO] Running org.apache.maven.surefire.its.jiras.Surefire975DefaultVMEncodingIT
[2020-01-16T07:47:18.325Z] [INFO] Tests run: 1, Failures: 0, Errors: 0, Skipped: 0, Time elapsed: 5.819 s - in org.apache.maven.surefire.its.jiras.Surefire975DefaultVMEncodingIT
[2020-01-16T07:47:18.325Z] [INFO] Running org.apache.maven.surefire.its.jiras.Surefire979WrongClassLoaderIT
[2020-01-16T07:47:21.524Z] [INFO] Tests run: 1, Failures: 0, Errors: 0, Skipped: 0, Time elapsed: 3.919 s - in org.apache.maven.surefire.its.jiras.Surefire979WrongClassLoaderIT
[2020-01-16T07:47:21.525Z] [INFO] Running org.apache.maven.surefire.its.jiras.Surefire985ParameterizedRunnerAndCategoriesIT
[2020-01-16T07:47:25.706Z] [INFO] Tests run: 1, Failures: 0, Errors: 0, Skipped: 0, Time elapsed: 3.531 s - in org.apache.maven.surefire.its.jiras.Surefire985ParameterizedRunnerAndCategoriesIT
[2020-01-16T07:47:25.706Z] [INFO] Running org.apache.maven.surefire.its.jiras.Surefire995CategoryInheritanceIT
[2020-01-16T07:47:43.851Z] [INFO] Tests run: 5, Failures: 0, Errors: 0, Skipped: 0, Time elapsed: 16.928 s - in org.apache.maven.surefire.its.jiras.Surefire995CategoryInheritanceIT
[2020-01-16T07:47:43.851Z] [INFO]
[2020-01-16T07:47:43.851Z] [INFO] Results:
[2020-01-16T07:47:43.851Z] [INFO]
[2020-01-16T07:47:43.851Z] [WARNING] Tests run: 861, Failures: 0, Errors: 0, Skipped: 228
[2020-01-16T07:47:43.851Z] [INFO]
[2020-01-16T07:47:43.851Z] [INFO]
[2020-01-16T07:47:43.851Z] [INFO] --- maven-checkstyle-plugin:3.0.0:check (checkstyle-check) @ surefire-its ---
[2020-01-16T07:47:43.851Z] [INFO]
[2020-01-16T07:47:43.851Z] [INFO] --- maven-failsafe-plugin:3.0.0-M4:verify (default) @ surefire-its ---
[2020-01-16T07:47:43.851Z] [INFO] Failsafe report directory: /home/jenkins/jenkins-slave/workspace/maven2surefire-jvm-communication@2/surefire-its/target/failsafe-reports
[2020-01-16T07:47:43.851Z] [INFO]
[2020-01-16T07:47:43.851Z] [INFO] --- maven-install-plugin:2.5.2:install (default-install) @ surefire-its ---
[2020-01-16T07:47:43.851Z] [INFO] Skipping artifact installation
[2020-01-16T07:47:43.851Z] [INFO]
[2020-01-16T07:47:43.851Z] [INFO] ----------< org.apache.maven.surefire:surefire-shared-utils >-----------
[2020-01-16T07:47:43.851Z] [INFO] Building Surefire Shared Utils 3.0.0-SNAPSHOT                    [26/26]
[2020-01-16T07:47:43.851Z] [INFO] --------------------------------[ jar ]---------------------------------
[2020-01-16T07:47:43.851Z] [INFO]
[2020-01-16T07:47:43.851Z] [INFO] --- maven-clean-plugin:3.1.0:clean (default-clean) @ surefire-shared-utils ---
[2020-01-16T07:47:43.851Z] [INFO]
[2020-01-16T07:47:43.851Z] [INFO] --- maven-enforcer-plugin:3.0.0-M2:enforce (enforce-maven-version) @ surefire-shared-utils ---
[2020-01-16T07:47:43.851Z] [INFO]
[2020-01-16T07:47:43.851Z] [INFO] --- maven-enforcer-plugin:3.0.0-M2:enforce (enforce-bytecode-version) @ surefire-shared-utils ---
[2020-01-16T07:47:43.851Z] [INFO]
[2020-01-16T07:47:43.851Z] [INFO] --- maven-enforcer-plugin:3.0.0-M2:enforce (ban-known-bad-maven-versions) @ surefire-shared-utils ---
[2020-01-16T07:47:43.851Z] [INFO]
[2020-01-16T07:47:43.851Z] [INFO] --- maven-enforcer-plugin:3.0.0-M2:enforce (enforce-java) @ surefire-shared-utils ---
[2020-01-16T07:47:43.851Z] [INFO]
[2020-01-16T07:47:43.851Z] [INFO] --- maven-enforcer-plugin:3.0.0-M2:enforce (enforce-maven) @ surefire-shared-utils ---
[2020-01-16T07:47:43.851Z] [INFO]
[2020-01-16T07:47:43.851Z] [INFO] --- apache-rat-plugin:0.12:check (rat-check) @ surefire-shared-utils ---
[2020-01-16T07:47:43.851Z] [INFO] Enabled default license matchers.
[2020-01-16T07:47:43.851Z] [INFO] Will parse SCM ignores for exclusions...
[2020-01-16T07:47:43.851Z] [INFO] Finished adding exclusions from SCM ignore files.
[2020-01-16T07:47:43.851Z] [INFO] 61 implicit excludes (use -debug for more details).
[2020-01-16T07:47:43.851Z] [INFO] Exclude: .repository/**
[2020-01-16T07:47:43.851Z] [INFO] Exclude: .maven/spy.log
[2020-01-16T07:47:43.851Z] [INFO] Exclude: dependency-reduced-pom.xml
[2020-01-16T07:47:43.851Z] [INFO] Exclude: .java-version
[2020-01-16T07:47:43.851Z] [INFO] Exclude: Jenkinsfile
[2020-01-16T07:47:43.851Z] [INFO] Exclude: README.md
[2020-01-16T07:47:43.851Z] [INFO] Exclude: .editorconfig
[2020-01-16T07:47:43.851Z] [INFO] Exclude: .gitignore
[2020-01-16T07:47:43.851Z] [INFO] Exclude: .git/**/*
[2020-01-16T07:47:43.851Z] [INFO] Exclude: **/.github/**
[2020-01-16T07:47:43.851Z] [INFO] Exclude: **/.idea
[2020-01-16T07:47:43.851Z] [INFO] Exclude: **/.svn/**/*
[2020-01-16T07:47:43.851Z] [INFO] Exclude: **/*.iml
[2020-01-16T07:47:43.851Z] [INFO] Exclude: **/*.ipr
[2020-01-16T07:47:43.851Z] [INFO] Exclude: **/*.iws
[2020-01-16T07:47:43.851Z] [INFO] Exclude: **/*.versionsBackup
[2020-01-16T07:47:43.851Z] [INFO] Exclude: **/dependency-reduced-pom.xml
[2020-01-16T07:47:43.851Z] [INFO] Exclude: .repository/**
[2020-01-16T07:47:43.851Z] [INFO] Exclude: src/test/resources/**/*
[2020-01-16T07:47:43.851Z] [INFO] Exclude: src/test/resources/**/*.css
[2020-01-16T07:47:43.851Z] [INFO] Exclude: **/*.jj
[2020-01-16T07:47:43.851Z] [INFO] Exclude: src/main/resources/META-INF/services/org.apache.maven.surefire.providerapi.SurefireProvider
[2020-01-16T07:47:43.851Z] [INFO] Exclude: DEPENDENCIES
[2020-01-16T07:47:43.851Z] [INFO] Exclude: .m2/**
[2020-01-16T07:47:43.851Z] [INFO] Exclude: .m2
[2020-01-16T07:47:43.851Z] [INFO] Exclude: .travis.yml
[2020-01-16T07:47:43.851Z] [INFO] 1 resources included (use -debug for more details)
[2020-01-16T07:47:43.851Z] [INFO] Rat check: Summary over all files. Unapproved: 0, unknown: 0, generated: 0, approved: 1 licenses.
[2020-01-16T07:47:43.851Z] [INFO]
[2020-01-16T07:47:43.851Z] [INFO] --- maven-compiler-plugin:3.7.0:compile (compile-generated) @ surefire-shared-utils ---
[2020-01-16T07:47:43.851Z] [INFO] No sources to compile
[2020-01-16T07:47:43.851Z] [INFO]
[2020-01-16T07:47:43.851Z] [INFO] --- maven-remote-resources-plugin:1.5:process (process-resource-bundles) @ surefire-shared-utils ---
[2020-01-16T07:47:43.851Z] [INFO]
[2020-01-16T07:47:43.851Z] [INFO] --- maven-resources-plugin:3.1.0:resources (default-resources) @ surefire-shared-utils ---
[2020-01-16T07:47:43.851Z] [INFO] Using 'UTF-8' encoding to copy filtered resources.
[2020-01-16T07:47:43.851Z] [INFO] skip non existing resourceDirectory /home/jenkins/jenkins-slave/workspace/maven2surefire-jvm-communication@2/surefire-shared-utils/src/main/resources
[2020-01-16T07:47:43.851Z] [INFO] Copying 3 resources
[2020-01-16T07:47:43.851Z] [INFO]
[2020-01-16T07:47:43.851Z] [INFO] --- maven-compiler-plugin:3.7.0:compile (default-compile) @ surefire-shared-utils ---
[2020-01-16T07:47:43.851Z] [INFO] No sources to compile
[2020-01-16T07:47:43.851Z] [INFO]
[2020-01-16T07:47:43.851Z] [INFO] --- animal-sniffer-maven-plugin:1.17:check (signature-check) @ surefire-shared-utils ---
[2020-01-16T07:47:43.851Z] [INFO] Checking unresolved references to org.codehaus.mojo.signature:java17:1.0
[2020-01-16T07:47:44.577Z] [INFO]
[2020-01-16T07:47:44.577Z] [INFO] --- maven-resources-plugin:3.1.0:testResources (default-testResources) @ surefire-shared-utils ---
[2020-01-16T07:47:44.577Z] [INFO] Using 'UTF-8' encoding to copy filtered resources.
[2020-01-16T07:47:44.577Z] [INFO] skip non existing resourceDirectory /home/jenkins/jenkins-slave/workspace/maven2surefire-jvm-communication@2/surefire-shared-utils/src/test/resources
[2020-01-16T07:47:44.577Z] [INFO] Copying 3 resources
[2020-01-16T07:47:44.577Z] [INFO]
[2020-01-16T07:47:44.577Z] [INFO] --- maven-compiler-plugin:3.7.0:testCompile (default-testCompile) @ surefire-shared-utils ---
[2020-01-16T07:47:44.577Z] [INFO] No sources to compile
[2020-01-16T07:47:44.577Z] [INFO]
[2020-01-16T07:47:44.577Z] [INFO] --- maven-surefire-plugin:3.0.0-M4:test (default-test) @ surefire-shared-utils ---
[2020-01-16T07:47:44.577Z] [INFO]
[2020-01-16T07:47:44.577Z] [INFO] --- maven-jar-plugin:3.1.0:jar (default-jar) @ surefire-shared-utils ---
[2020-01-16T07:47:44.577Z] [INFO] Building jar: /home/jenkins/jenkins-slave/workspace/maven2surefire-jvm-communication@2/surefire-shared-utils/target/surefire-shared-utils-3.0.0-SNAPSHOT.jar
[2020-01-16T07:47:44.577Z] [INFO]
[2020-01-16T07:47:44.577Z] [INFO] --- maven-site-plugin:3.8.2:attach-descriptor (attach-descriptor) @ surefire-shared-utils ---
[2020-01-16T07:47:44.577Z] [INFO] Skipping because packaging 'jar' is not pom.
[2020-01-16T07:47:44.577Z] [INFO]
[2020-01-16T07:47:44.577Z] [INFO] --- maven-shade-plugin:3.1.1:shade (default) @ surefire-shared-utils ---
[2020-01-16T07:47:44.577Z] [INFO] Including org.apache.maven.shared:maven-shared-utils:jar:3.1.0 in the shaded jar.
[2020-01-16T07:47:44.577Z] [INFO] Including commons-io:commons-io:jar:2.6 in the shaded jar.
[2020-01-16T07:47:44.577Z] [INFO] Including org.apache.commons:commons-lang3:jar:3.8.1 in the shaded jar.
[2020-01-16T07:47:44.577Z] [INFO] Including org.apache.commons:commons-compress:jar:1.19 in the shaded jar.
[2020-01-16T07:47:44.577Z] [INFO] Including commons-codec:commons-codec:jar:1.11 in the shaded jar.
[2020-01-16T07:47:45.346Z] [INFO] Replacing original artifact with shaded artifact.
[2020-01-16T07:47:45.346Z] [INFO] Replacing /home/jenkins/jenkins-slave/workspace/maven2surefire-jvm-communication@2/surefire-shared-utils/target/surefire-shared-utils-3.0.0-SNAPSHOT.jar with /home/jenkins/jenkins-slave/workspace/maven2surefire-jvm-communication@2/surefire-shared-utils/target/surefire-shared-utils-3.0.0-SNAPSHOT-shaded.jar
[2020-01-16T07:47:45.346Z] [INFO] Dependency-reduced POM written at: /home/jenkins/jenkins-slave/workspace/maven2surefire-jvm-communication@2/surefire-shared-utils/dependency-reduced-pom.xml
[2020-01-16T07:47:45.346Z] [INFO]
[2020-01-16T07:47:45.346Z] [INFO] --- maven-checkstyle-plugin:3.0.0:check (checkstyle-check) @ surefire-shared-utils ---
[2020-01-16T07:47:46.062Z] [INFO]
[2020-01-16T07:47:46.062Z] [INFO] --- maven-install-plugin:2.5.2:install (default-install) @ surefire-shared-utils ---
[2020-01-16T07:47:46.062Z] [INFO] Installing /home/jenkins/jenkins-slave/workspace/maven2surefire-jvm-communication@2/surefire-shared-utils/target/surefire-shared-utils-3.0.0-SNAPSHOT.jar to /home/jenkins/jenkins-slave/workspace/maven2surefire-jvm-communication@2/.m2/org/apache/maven/surefire/surefire-shared-utils/3.0.0-SNAPSHOT/surefire-shared-utils-3.0.0-SNAPSHOT.jar
[2020-01-16T07:47:46.062Z] [INFO] Installing /home/jenkins/jenkins-slave/workspace/maven2surefire-jvm-communication@2/surefire-shared-utils/dependency-reduced-pom.xml to /home/jenkins/jenkins-slave/workspace/maven2surefire-jvm-communication@2/.m2/org/apache/maven/surefire/surefire-shared-utils/3.0.0-SNAPSHOT/surefire-shared-utils-3.0.0-SNAPSHOT.pom
[2020-01-16T07:47:46.062Z] [INFO] ------------------------------------------------------------------------
[2020-01-16T07:47:46.062Z] [INFO] Reactor Summary for Apache Maven Surefire 3.0.0-SNAPSHOT:
[2020-01-16T07:47:46.062Z] [INFO]
[2020-01-16T07:47:46.062Z] [INFO] Apache Maven Surefire .............................. SUCCESS [ 14.004 s]
[2020-01-16T07:47:46.062Z] [INFO] SureFire Logger API ................................ SUCCESS [  8.017 s]
[2020-01-16T07:47:46.062Z] [INFO] SureFire API ....................................... SUCCESS [  8.541 s]
[2020-01-16T07:47:46.062Z] [INFO] Surefire Extensions API ............................ SUCCESS [  3.964 s]
[2020-01-16T07:47:46.062Z] [INFO] Surefire Extensions SPI ............................ SUCCESS [  1.723 s]
[2020-01-16T07:47:46.062Z] [INFO] SureFire Booter .................................... SUCCESS [ 11.858 s]
[2020-01-16T07:47:46.062Z] [INFO] Maven Surefire Test-Grouping Support ............... SUCCESS [  4.241 s]
[2020-01-16T07:47:46.062Z] [INFO] SureFire Providers ................................. SUCCESS [  0.807 s]
[2020-01-16T07:47:46.062Z] [INFO] Shared JUnit3 Provider Code ........................ SUCCESS [  3.085 s]
[2020-01-16T07:47:46.062Z] [INFO] Shared Java 5 Provider Base ........................ SUCCESS [  3.360 s]
[2020-01-16T07:47:46.062Z] [INFO] Shared JUnit4 Provider Code ........................ SUCCESS [  3.674 s]
[2020-01-16T07:47:46.062Z] [INFO] Shared JUnit48 Provider Code ....................... SUCCESS [  4.352 s]
[2020-01-16T07:47:46.062Z] [INFO] SureFire JUnit Runner .............................. SUCCESS [  3.332 s]
[2020-01-16T07:47:46.062Z] [INFO] SureFire JUnit4 Runner ............................. SUCCESS [  3.297 s]
[2020-01-16T07:47:46.062Z] [INFO] Maven Surefire Common .............................. SUCCESS [ 27.871 s]
[2020-01-16T07:47:46.062Z] [INFO] SureFire JUnitCore Runner .......................... SUCCESS [02:21 min]
[2020-01-16T07:47:46.062Z] [INFO] SureFire JUnit Platform Runner ..................... SUCCESS [  8.840 s]
[2020-01-16T07:47:46.062Z] [INFO] SureFire TestNG Utils .............................. SUCCESS [  3.625 s]
[2020-01-16T07:47:46.062Z] [INFO] SureFire TestNG Runner ............................. SUCCESS [  3.869 s]
[2020-01-16T07:47:46.062Z] [INFO] ShadeFire JUnit3 Provider .......................... SUCCESS [  1.096 s]
[2020-01-16T07:47:46.062Z] [INFO] Surefire Report Parser ............................. SUCCESS [  4.418 s]
[2020-01-16T07:47:46.062Z] [INFO] Maven Surefire Plugin .............................. SUCCESS [  8.549 s]
[2020-01-16T07:47:46.062Z] [INFO] Maven Failsafe Plugin .............................. SUCCESS [  8.349 s]
[2020-01-16T07:47:46.062Z] [INFO] Maven Surefire Report Plugin ....................... SUCCESS [ 12.809 s]
[2020-01-16T07:47:46.062Z] [INFO] Maven Surefire Integration Tests ................... SUCCESS [46:29 min]
[2020-01-16T07:47:46.062Z] [INFO] Surefire Shared Utils .............................. SUCCESS [  2.256 s]
[2020-01-16T07:47:46.062Z] [INFO] ------------------------------------------------------------------------
[2020-01-16T07:47:46.062Z] [INFO] BUILD SUCCESS
[2020-01-16T07:47:46.062Z] [INFO] ------------------------------------------------------------------------
[2020-01-16T07:47:46.062Z] [INFO] Total time:  51:28 min
[2020-01-16T07:47:46.062Z] [INFO] Finished at: 2020-01-16T07:47:45Z
[2020-01-16T07:47:46.062Z] [INFO] ------------------------------------------------------------------------
[Pipeline] }
[Pipeline] // withEnv
[Pipeline] }
[Pipeline] // stage
[Pipeline] cleanWs
[2020-01-16T07:47:46.786Z] [WS-CLEANUP] Deleting project workspace...
[2020-01-16T07:47:46.786Z] [WS-CLEANUP] Deferred wipeout is used...
[2020-01-16T07:47:47.101Z] [WS-CLEANUP] done
[Pipeline] }
[Pipeline] // ws
[Pipeline] }
[Pipeline] // timestamps
[Pipeline] }
[Pipeline] // node
[Pipeline] }
Aborted by slachiewicz
[Pipeline] // node
[Pipeline] // node
[Pipeline] // node
[Pipeline] // node
[Pipeline] // node
[Pipeline] }
Failed in branch windows-jdk14-maven3.6.x
[Pipeline] }
Failed in branch windows-jdk13-maven3.6.x
[Pipeline] }
Failed in branch windows-jdk11-maven3.6.x
[Pipeline] }
Failed in branch windows-jdk8-maven3.6.x
[Pipeline] }
Failed in branch windows-jdk7-maven3.6.x
[Pipeline] // parallel
[Pipeline] echo
org.jenkinsci.plugins.workflow.steps.FlowInterruptedException: org.jenkinsci.plugins.workflow.steps.FlowInterruptedException
[Pipeline] echo
Build result: FAILURE
[Pipeline] jiraIssueSelector
[Pipeline] echo
The authors of changes [slachiewicz].
[Pipeline] echo
Sending email ...
[Pipeline] emailext