Build failed in Jenkins: Maven TLP » maven-surefire » maven2surefire-jvm-communication #24

classic Classic list List threaded Threaded
4 messages Options
Reply | Threaded
Open this post in threaded view
|

Build failed in Jenkins: Maven TLP » maven-surefire » maven2surefire-jvm-communication #24

Apache Jenkins Server-2
See https://builds.apache.org/job/maven-box/job/maven-surefire/job/maven2surefire-jvm-communication/24/

No changes.

No tests ran.

Build log:
[...truncated 41981 lines...]
[2020-01-01T01:26:32.433Z] [INFO] [loading ZipFileIndexFileObject[C:\Users\jenkins\AppData\Local\Temp\3\jenkins-maven-box-maven-surefire-maven2surefire-jvm-communication-24\.m2\org\apache\maven\maven-core\3.0\maven-core-3.0.jar(org/apache/maven/artifact/resolver/filter/AbstractScopeArtifactFilter.class)]]
[2020-01-01T01:26:32.433Z] [INFO] [loading ZipFileIndexFileObject[C:\Users\jenkins\AppData\Local\Temp\3\jenkins-maven-box-maven-surefire-maven2surefire-jvm-communication-24\.m2\org\apache\maven\maven-model\3.0\maven-model-3.0.jar(org/apache/maven/model/Plugin.class)]]
[2020-01-01T01:26:32.433Z] [INFO] [loading ZipFileIndexFileObject[C:\Users\jenkins\AppData\Local\Temp\3\jenkins-maven-box-maven-surefire-maven2surefire-jvm-communication-24\.m2\org\apache\maven\maven-model\3.0\maven-model-3.0.jar(org/apache/maven/model/ConfigurationContainer.class)]]
[2020-01-01T01:26:32.433Z] [INFO] [loading ZipFileIndexFileObject[f:\jenkins\tools\java\latest1.8\lib\ct.sym(META-INF/sym/rt.jar/java/nio/file/attribute/FileAttribute.class)]]
[2020-01-01T01:26:32.433Z] [INFO] [wrote RegularFileObject[C:\Users\jenkins\AppData\Local\Temp\3\jenkins-maven-box-maven-surefire-maven2surefire-jvm-communication-24\maven-surefire-common\target\classes\org\apache\maven\plugin\surefire\AbstractSurefireMojo$TestNgProviderInfo.class]]
[2020-01-01T01:26:32.433Z] [INFO] [wrote RegularFileObject[C:\Users\jenkins\AppData\Local\Temp\3\jenkins-maven-box-maven-surefire-maven2surefire-jvm-communication-24\maven-surefire-common\target\classes\org\apache\maven\plugin\surefire\AbstractSurefireMojo$JUnit3ProviderInfo.class]]
[2020-01-01T01:26:32.433Z] [INFO] [wrote RegularFileObject[C:\Users\jenkins\AppData\Local\Temp\3\jenkins-maven-box-maven-surefire-maven2surefire-jvm-communication-24\maven-surefire-common\target\classes\org\apache\maven\plugin\surefire\AbstractSurefireMojo$JUnit4ProviderInfo.class]]
[2020-01-01T01:26:32.433Z] [INFO] [wrote RegularFileObject[C:\Users\jenkins\AppData\Local\Temp\3\jenkins-maven-box-maven-surefire-maven2surefire-jvm-communication-24\maven-surefire-common\target\classes\org\apache\maven\plugin\surefire\AbstractSurefireMojo$JUnitPlatformProviderInfo.class]]
[2020-01-01T01:26:32.433Z] [INFO] [wrote RegularFileObject[C:\Users\jenkins\AppData\Local\Temp\3\jenkins-maven-box-maven-surefire-maven2surefire-jvm-communication-24\maven-surefire-common\target\classes\org\apache\maven\plugin\surefire\AbstractSurefireMojo$JUnitCoreProviderInfo.class]]
[2020-01-01T01:26:32.433Z] [INFO] [wrote RegularFileObject[C:\Users\jenkins\AppData\Local\Temp\3\jenkins-maven-box-maven-surefire-maven2surefire-jvm-communication-24\maven-surefire-common\target\classes\org\apache\maven\plugin\surefire\AbstractSurefireMojo$DynamicProviderInfo.class]]
[2020-01-01T01:26:32.433Z] [INFO] [wrote RegularFileObject[C:\Users\jenkins\AppData\Local\Temp\3\jenkins-maven-box-maven-surefire-maven2surefire-jvm-communication-24\maven-surefire-common\target\classes\org\apache\maven\plugin\surefire\AbstractSurefireMojo$ProviderList.class]]
[2020-01-01T01:26:32.433Z] [INFO] [wrote RegularFileObject[C:\Users\jenkins\AppData\Local\Temp\3\jenkins-maven-box-maven-surefire-maven2surefire-jvm-communication-24\maven-surefire-common\target\classes\org\apache\maven\plugin\surefire\AbstractSurefireMojo$ClasspathCache.class]]
[2020-01-01T01:26:32.433Z] [INFO] [wrote RegularFileObject[C:\Users\jenkins\AppData\Local\Temp\3\jenkins-maven-box-maven-surefire-maven2surefire-jvm-communication-24\maven-surefire-common\target\classes\org\apache\maven\plugin\surefire\AbstractSurefireMojo$1.class]]
[2020-01-01T01:26:32.433Z] [INFO] [loading ZipFileIndexFileObject[C:\Users\jenkins\AppData\Local\Temp\3\jenkins-maven-box-maven-surefire-maven2surefire-jvm-communication-24\surefire-booter\target\surefire-booter-3.0.0-SNAPSHOT.jar(org/apache/maven/surefire/booter/TypeEncodedValue.class)]]
[2020-01-01T01:26:32.433Z] [INFO] [wrote RegularFileObject[C:\Users\jenkins\AppData\Local\Temp\3\jenkins-maven-box-maven-surefire-maven2surefire-jvm-communication-24\maven-surefire-common\target\classes\org\apache\maven\plugin\surefire\AbstractSurefireMojo.class]]
[2020-01-01T01:26:32.433Z] [INFO] [checking org.apache.maven.plugin.surefire.booterclient.ProviderDetector]
[2020-01-01T01:26:32.433Z] [INFO] [wrote RegularFileObject[C:\Users\jenkins\AppData\Local\Temp\3\jenkins-maven-box-maven-surefire-maven2surefire-jvm-communication-24\maven-surefire-common\target\classes\org\apache\maven\plugin\surefire\booterclient\ProviderDetector.class]]
[2020-01-01T01:26:32.433Z] [INFO] [checking org.apache.maven.plugin.surefire.TestClassPath]
[2020-01-01T01:26:32.433Z] [INFO] [wrote RegularFileObject[C:\Users\jenkins\AppData\Local\Temp\3\jenkins-maven-box-maven-surefire-maven2surefire-jvm-communication-24\maven-surefire-common\target\classes\org\apache\maven\plugin\surefire\TestClassPath.class]]
[2020-01-01T01:26:32.433Z] [INFO] [checking org.apache.maven.plugin.surefire.ProviderInfo]
[2020-01-01T01:26:32.433Z] [INFO] [wrote RegularFileObject[C:\Users\jenkins\AppData\Local\Temp\3\jenkins-maven-box-maven-surefire-maven2surefire-jvm-communication-24\maven-surefire-common\target\classes\org\apache\maven\plugin\surefire\ProviderInfo.class]]
[2020-01-01T01:26:32.433Z] [INFO] [checking org.apache.maven.plugin.surefire.SurefireProperties]
[2020-01-01T01:26:32.433Z] [INFO] [loading ZipFileIndexFileObject[f:\jenkins\tools\java\latest1.8\lib\ct.sym(META-INF/sym/rt.jar/java/util/function/BiFunction.class)]]
[2020-01-01T01:26:32.433Z] [INFO] [loading ZipFileIndexFileObject[f:\jenkins\tools\java\latest1.8\lib\ct.sym(META-INF/sym/rt.jar/java/util/function/Function.class)]]
[2020-01-01T01:26:32.433Z] [INFO] [loading ZipFileIndexFileObject[f:\jenkins\tools\java\latest1.8\lib\ct.sym(META-INF/sym/rt.jar/java/util/function/BiConsumer.class)]]
[2020-01-01T01:26:32.433Z] [INFO] [loading ZipFileIndexFileObject[f:\jenkins\tools\java\latest1.8\lib\ct.sym(META-INF/sym/rt.jar/java/io/Reader.class)]]
[2020-01-01T01:26:32.433Z] [INFO] [wrote RegularFileObject[C:\Users\jenkins\AppData\Local\Temp\3\jenkins-maven-box-maven-surefire-maven2surefire-jvm-communication-24\maven-surefire-common\target\classes\org\apache\maven\plugin\surefire\SurefireProperties.class]]
[2020-01-01T01:26:32.433Z] [INFO] [checking org.apache.maven.plugin.surefire.booterclient.ForkNumberBucket]
[2020-01-01T01:26:32.433Z] [INFO] [wrote RegularFileObject[C:\Users\jenkins\AppData\Local\Temp\3\jenkins-maven-box-maven-surefire-maven2surefire-jvm-communication-24\maven-surefire-common\target\classes\org\apache\maven\plugin\surefire\booterclient\ForkNumberBucket.class]]
[2020-01-01T01:26:32.433Z] [INFO] [checking org.apache.maven.plugin.surefire.booterclient.lazytestprovider.TestLessInputStream]
[2020-01-01T01:26:32.433Z] [INFO] [loading ZipFileIndexFileObject[f:\jenkins\tools\java\latest1.8\lib\ct.sym(META-INF/sym/rt.jar/java/util/concurrent/locks/ReadWriteLock.class)]]
[2020-01-01T01:26:32.433Z] [INFO] [loading ZipFileIndexFileObject[f:\jenkins\tools\java\latest1.8\lib\ct.sym(META-INF/sym/rt.jar/java/util/concurrent/locks/ReentrantReadWriteLock$WriteLock.class)]]
[2020-01-01T01:26:32.433Z] [INFO] [loading ZipFileIndexFileObject[f:\jenkins\tools\java\latest1.8\lib\ct.sym(META-INF/sym/rt.jar/java/util/concurrent/locks/ReentrantReadWriteLock$ReadLock.class)]]
[2020-01-01T01:26:32.433Z] [INFO] [checking org.apache.maven.plugin.surefire.booterclient.lazytestprovider.DefaultCommandReader]
[2020-01-01T01:26:32.433Z] [INFO] [checking org.apache.maven.plugin.surefire.booterclient.lazytestprovider.AbstractCommandReader]
[2020-01-01T01:26:32.433Z] [INFO] [wrote RegularFileObject[C:\Users\jenkins\AppData\Local\Temp\3\jenkins-maven-box-maven-surefire-maven2surefire-jvm-communication-24\maven-surefire-common\target\classes\org\apache\maven\plugin\surefire\booterclient\lazytestprovider\TestLessInputStream$TestLessInputStreamBuilder$1.class]]
[2020-01-01T01:26:32.433Z] [INFO] [wrote RegularFileObject[C:\Users\jenkins\AppData\Local\Temp\3\jenkins-maven-box-maven-surefire-maven2surefire-jvm-communication-24\maven-surefire-common\target\classes\org\apache\maven\plugin\surefire\booterclient\lazytestprovider\TestLessInputStream$TestLessInputStreamBuilder$CIt.class]]
[2020-01-01T01:26:32.434Z] [INFO] [wrote RegularFileObject[C:\Users\jenkins\AppData\Local\Temp\3\jenkins-maven-box-maven-surefire-maven2surefire-jvm-communication-24\maven-surefire-common\target\classes\org\apache\maven\plugin\surefire\booterclient\lazytestprovider\TestLessInputStream$TestLessInputStreamBuilder$ImmediateCommands.class]]
[2020-01-01T01:26:32.434Z] [INFO] [wrote RegularFileObject[C:\Users\jenkins\AppData\Local\Temp\3\jenkins-maven-box-maven-surefire-maven2surefire-jvm-communication-24\maven-surefire-common\target\classes\org\apache\maven\plugin\surefire\booterclient\lazytestprovider\TestLessInputStream$TestLessInputStreamBuilder$CachableCommands.class]]
[2020-01-01T01:26:32.434Z] [INFO] [wrote RegularFileObject[C:\Users\jenkins\AppData\Local\Temp\3\jenkins-maven-box-maven-surefire-maven2surefire-jvm-communication-24\maven-surefire-common\target\classes\org\apache\maven\plugin\surefire\booterclient\lazytestprovider\TestLessInputStream$TestLessInputStreamBuilder$Node.class]]
[2020-01-01T01:26:32.434Z] [INFO] [wrote RegularFileObject[C:\Users\jenkins\AppData\Local\Temp\3\jenkins-maven-box-maven-surefire-maven2surefire-jvm-communication-24\maven-surefire-common\target\classes\org\apache\maven\plugin\surefire\booterclient\lazytestprovider\TestLessInputStream$TestLessInputStreamBuilder.class]]
[2020-01-01T01:26:32.434Z] [INFO] [wrote RegularFileObject[C:\Users\jenkins\AppData\Local\Temp\3\jenkins-maven-box-maven-surefire-maven2surefire-jvm-communication-24\maven-surefire-common\target\classes\org\apache\maven\plugin\surefire\booterclient\lazytestprovider\TestLessInputStream$1.class]]
[2020-01-01T01:26:32.434Z] [INFO] [wrote RegularFileObject[C:\Users\jenkins\AppData\Local\Temp\3\jenkins-maven-box-maven-surefire-maven2surefire-jvm-communication-24\maven-surefire-common\target\classes\org\apache\maven\plugin\surefire\booterclient\lazytestprovider\TestLessInputStream.class]]
[2020-01-01T01:26:32.434Z] [INFO] [wrote RegularFileObject[C:\Users\jenkins\AppData\Local\Temp\3\jenkins-maven-box-maven-surefire-maven2surefire-jvm-communication-24\maven-surefire-common\target\classes\org\apache\maven\plugin\surefire\booterclient\lazytestprovider\DefaultCommandReader.class]]
[2020-01-01T01:26:32.434Z] [INFO] [wrote RegularFileObject[C:\Users\jenkins\AppData\Local\Temp\3\jenkins-maven-box-maven-surefire-maven2surefire-jvm-communication-24\maven-surefire-common\target\classes\org\apache\maven\plugin\surefire\booterclient\lazytestprovider\AbstractCommandReader.class]]
[2020-01-01T01:26:32.434Z] [INFO] [checking org.apache.maven.plugin.surefire.booterclient.lazytestprovider.DefferedChannelCommandSender]
[2020-01-01T01:26:32.434Z] [INFO] [wrote RegularFileObject[C:\Users\jenkins\AppData\Local\Temp\3\jenkins-maven-box-maven-surefire-maven2surefire-jvm-communication-24\maven-surefire-common\target\classes\org\apache\maven\plugin\surefire\booterclient\lazytestprovider\DefferedChannelCommandSender.class]]
[2020-01-01T01:26:32.434Z] [INFO] [checking org.apache.maven.plugin.surefire.booterclient.ForkStarter]
[2020-01-01T01:26:32.434Z] [INFO] [loading ZipFileIndexFileObject[f:\jenkins\tools\java\latest1.8\lib\ct.sym(META-INF/sym/rt.jar/java/util/concurrent/Executor.class)]]
[2020-01-01T01:26:32.434Z] [INFO] [loading ZipFileIndexFileObject[f:\jenkins\tools\java\latest1.8\lib\ct.sym(META-INF/sym/rt.jar/java/util/concurrent/Delayed.class)]]
[2020-01-01T01:26:32.434Z] [INFO] [loading ZipFileIndexFileObject[f:\jenkins\tools\java\latest1.8\lib\ct.sym(META-INF/sym/rt.jar/java/util/concurrent/AbstractExecutorService.class)]]
[2020-01-01T01:26:32.434Z] [INFO] [loading ZipFileIndexFileObject[f:\jenkins\tools\java\latest1.8\lib\ct.sym(META-INF/sym/rt.jar/java/lang/Readable.class)]]
[2020-01-01T01:26:32.434Z] [INFO] [loading ZipFileIndexFileObject[f:\jenkins\tools\java\latest1.8\lib\ct.sym(META-INF/sym/rt.jar/java/util/RandomAccess.class)]]
[2020-01-01T01:26:32.434Z] [INFO] [loading ZipFileIndexFileObject[f:\jenkins\tools\java\latest1.8\lib\ct.sym(META-INF/sym/rt.jar/java/nio/channels/WritableByteChannel.class)]]
[2020-01-01T01:26:32.434Z] [INFO] [loading ZipFileIndexFileObject[f:\jenkins\tools\java\latest1.8\lib\ct.sym(META-INF/sym/rt.jar/java/nio/channels/ReadableByteChannel.class)]]
[2020-01-01T01:26:32.434Z] [INFO] [checking org.apache.maven.plugin.surefire.InPluginVMSurefireStarter]
[2020-01-01T01:26:32.434Z] [INFO] [checking org.apache.maven.plugin.surefire.booterclient.ChecksumCalculator]
[2020-01-01T01:26:32.434Z] [INFO] [loading ZipFileIndexFileObject[f:\jenkins\tools\java\latest1.8\lib\ct.sym(META-INF/sym/rt.jar/java/security/MessageDigestSpi.class)]]
[2020-01-01T01:26:32.434Z] [INFO] [loading ZipFileIndexFileObject[f:\jenkins\tools\java\latest1.8\lib\ct.sym(META-INF/sym/rt.jar/java/security/GeneralSecurityException.class)]]
[2020-01-01T01:26:32.434Z] [INFO] [checking org.apache.maven.surefire.providerapi.ServiceLoader]
[2020-01-01T01:26:32.434Z] [INFO] [checking org.apache.maven.plugin.surefire.booterclient.output.ForkClient]
[2020-01-01T01:26:32.434Z] [INFO] [checking org.apache.maven.plugin.surefire.booterclient.lazytestprovider.TestProvidingInputStream]
[2020-01-01T01:26:32.434Z] [INFO] [checking org.apache.maven.plugin.surefire.booterclient.output.ForkedChannelDecoder]
[2020-01-01T01:26:32.434Z] [INFO] [loading ZipFileIndexFileObject[C:\Users\jenkins\AppData\Local\Temp\3\jenkins-maven-box-maven-surefire-maven2surefire-jvm-communication-24\.m2\commons-codec\commons-codec\1.11\commons-codec-1.11.jar(org/apache/commons/codec/binary/BaseNCodec.class)]]
[2020-01-01T01:26:32.434Z] [INFO] [loading ZipFileIndexFileObject[C:\Users\jenkins\AppData\Local\Temp\3\jenkins-maven-box-maven-surefire-maven2surefire-jvm-communication-24\.m2\commons-codec\commons-codec\1.11\commons-codec-1.11.jar(org/apache/commons/codec/BinaryEncoder.class)]]
[2020-01-01T01:26:32.434Z] [INFO] [loading ZipFileIndexFileObject[C:\Users\jenkins\AppData\Local\Temp\3\jenkins-maven-box-maven-surefire-maven2surefire-jvm-communication-24\.m2\commons-codec\commons-codec\1.11\commons-codec-1.11.jar(org/apache/commons/codec/Encoder.class)]]
[2020-01-01T01:26:32.434Z] [INFO] [loading ZipFileIndexFileObject[C:\Users\jenkins\AppData\Local\Temp\3\jenkins-maven-box-maven-surefire-maven2surefire-jvm-communication-24\.m2\commons-codec\commons-codec\1.11\commons-codec-1.11.jar(org/apache/commons/codec/BinaryDecoder.class)]]
[2020-01-01T01:26:32.434Z] [INFO] [loading ZipFileIndexFileObject[C:\Users\jenkins\AppData\Local\Temp\3\jenkins-maven-box-maven-surefire-maven2surefire-jvm-communication-24\.m2\commons-codec\commons-codec\1.11\commons-codec-1.11.jar(org/apache/commons/codec/Decoder.class)]]
[2020-01-01T01:26:32.434Z] [INFO] [checking org.apache.maven.plugin.surefire.booterclient.output.ForkedChannelDecoderErrorHandler]
[2020-01-01T01:26:32.434Z] [INFO] [checking org.apache.maven.plugin.surefire.booterclient.output.ForkedProcessPropertyEventListener]
[2020-01-01T01:26:32.434Z] [INFO] [checking org.apache.maven.plugin.surefire.booterclient.output.ForkedProcessStackTraceEventListener]
[2020-01-01T01:26:32.434Z] [INFO] [checking org.apache.maven.plugin.surefire.booterclient.output.ForkedProcessExitErrorListener]
[2020-01-01T01:26:32.434Z] [INFO] [checking org.apache.maven.plugin.surefire.booterclient.output.ForkedProcessReportEventListener]
[2020-01-01T01:26:32.434Z] [INFO] [checking org.apache.maven.plugin.surefire.booterclient.output.ForkedProcessEventListener]
[2020-01-01T01:26:32.434Z] [INFO] [checking org.apache.maven.plugin.surefire.ConfigurableProviderInfo]
[2020-01-01T01:26:32.434Z] [INFO] [checking org.apache.maven.plugin.surefire.extensions.StdErrAdapter]
[2020-01-01T01:26:32.434Z] [INFO] [checking org.apache.maven.plugin.surefire.extensions.junit5.JUnit5StatelessTestsetInfoReporter]
[2020-01-01T01:26:32.434Z] [INFO] [checking org.apache.maven.plugin.surefire.extensions.SurefireForkChannel]
[2020-01-01T01:26:32.434Z] [INFO] [loading ZipFileIndexFileObject[f:\jenkins\tools\java\latest1.8\lib\ct.sym(META-INF/sym/rt.jar/java/net/SocketOption.class)]]
[2020-01-01T01:26:32.434Z] [INFO] [loading ZipFileIndexFileObject[f:\jenkins\tools\java\latest1.8\lib\ct.sym(META-INF/sym/rt.jar/java/net/SocketAddress.class)]]
[2020-01-01T01:26:32.434Z] [INFO] [checking org.apache.maven.plugin.surefire.booterclient.BooterSerializer]
[2020-01-01T01:26:32.434Z] [INFO] [checking org.apache.maven.plugin.surefire.report.NullConsoleOutputReceiver]
[2020-01-01T01:26:32.434Z] [INFO] [checking org.apache.maven.plugin.surefire.report.NullConsoleReporter]
[2020-01-01T01:26:32.434Z] [INFO] [checking org.apache.maven.plugin.surefire.report.NullFileReporter]
[2020-01-01T01:26:32.434Z] [INFO] [checking org.apache.maven.plugin.surefire.util.SpecificFileFilter]
[2020-01-01T01:26:32.434Z] [INFO] [checking org.apache.maven.plugin.surefire.extensions.NetworkingProcessExecutor]
[2020-01-01T01:26:32.434Z] [INFO] [loading ZipFileIndexFileObject[f:\jenkins\tools\java\latest1.8\lib\ct.sym(META-INF/sym/rt.jar/java/nio/channels/AsynchronousByteChannel.class)]]
[2020-01-01T01:26:32.434Z] [INFO] [loading ZipFileIndexFileObject[C:\Users\jenkins\AppData\Local\Temp\3\jenkins-maven-box-maven-surefire-maven2surefire-jvm-communication-24\.m2\org\apache\maven\surefire\surefire-shared-utils\3.0.0-M4\surefire-shared-utils-3.0.0-M4.jar(org/apache/maven/surefire/shared/utils/cli/CommandLineCallable.class)]]
[2020-01-01T01:26:32.434Z] [INFO] [checking org.apache.maven.plugin.surefire.booterclient.output.NativeStdErrStreamConsumer]
[2020-01-01T01:26:32.434Z] [INFO] [checking org.apache.maven.plugin.surefire.report.NullStatelessXmlReporter]
[2020-01-01T01:26:32.434Z] [INFO] [checking org.apache.maven.plugin.surefire.extensions.PipeProcessExecutor]
[2020-01-01T01:26:32.434Z] [INFO] [checking org.apache.maven.plugin.surefire.util.DirectoryScanner]
[2020-01-01T01:26:32.434Z] [INFO] [checking org.apache.maven.plugin.surefire.report.ConsoleOutputFileReporter]
[2020-01-01T01:26:32.434Z] [INFO] [checking org.apache.maven.plugin.surefire.booterclient.ClasspathForkConfiguration]
[2020-01-01T01:26:32.434Z] [INFO] [checking org.apache.maven.plugin.surefire.extensions.LegacyForkNodeFactory]
[2020-01-01T01:26:32.434Z] [INFO] [checking org.apache.maven.plugin.surefire.extensions.junit5.JUnit5Xml30StatelessReporter]
[2020-01-01T01:26:32.434Z] [INFO] [checking org.apache.maven.plugin.surefire.booterclient.output.MultipleFailureException]
[2020-01-01T01:26:32.434Z] [INFO] [checking org.apache.maven.plugin.surefire.booterclient.output.ThreadedStreamConsumer]
[2020-01-01T01:26:32.434Z] [INFO] [checking org.apache.maven.plugin.surefire.util.FileScanner]
[2020-01-01T01:26:32.434Z] [INFO] [checking org.apache.maven.plugin.surefire.extensions.StdOutAdapter]
[2020-01-01T01:26:32.434Z] [INFO] [total 3623ms]
[2020-01-01T01:26:32.434Z] [INFO] -------------------------------------------------------------
[2020-01-01T01:26:32.434Z] [ERROR] COMPILATION ERROR :
[2020-01-01T01:26:32.434Z] [INFO] -------------------------------------------------------------
[2020-01-01T01:26:32.434Z] [ERROR] C:\Users\jenkins\AppData\Local\Temp\3\jenkins-maven-box-maven-surefire-maven2surefire-jvm-communication-24\maven-surefire-common\src\main\java\org\apache\maven\plugin\surefire\booterclient\ForkStarter.java:[638,91] error: incompatible types: AbstractCommandReader cannot be converted to InputStream
[2020-01-01T01:26:32.434Z] [ERROR] C:\Users\jenkins\AppData\Local\Temp\3\jenkins-maven-box-maven-surefire-maven2surefire-jvm-communication-24\maven-surefire-common\src\main\java\org\apache\maven\plugin\surefire\booterclient\ForkStarter.java:[645,42] error: incompatible types: NativeStdErrStreamConsumer cannot be converted to StreamConsumer
[2020-01-01T01:26:32.434Z] [INFO] 2 errors
[2020-01-01T01:26:32.434Z] [INFO] -------------------------------------------------------------
[2020-01-01T01:26:32.434Z] [INFO] ------------------------------------------------------------------------
[2020-01-01T01:26:32.434Z] [INFO] Reactor Summary for Apache Maven Surefire 3.0.0-SNAPSHOT:
[2020-01-01T01:26:32.434Z] [INFO]
[2020-01-01T01:26:32.435Z] [INFO] Apache Maven Surefire .............................. SUCCESS [01:11 min]
[2020-01-01T01:26:32.435Z] [INFO] SureFire Logger API ................................ SUCCESS [ 22.850 s]
[2020-01-01T01:26:32.435Z] [INFO] SureFire API ....................................... SUCCESS [ 12.445 s]
[2020-01-01T01:26:32.435Z] [INFO] Surefire Extensions API ............................ SUCCESS [  6.628 s]
[2020-01-01T01:26:32.435Z] [INFO] Surefire Extensions SPI ............................ SUCCESS [  3.155 s]
[2020-01-01T01:26:32.435Z] [INFO] SureFire Booter .................................... SUCCESS [ 15.721 s]
[2020-01-01T01:26:32.435Z] [INFO] Maven Surefire Test-Grouping Support ............... SUCCESS [ 11.160 s]
[2020-01-01T01:26:32.435Z] [INFO] SureFire Providers ................................. SUCCESS [  1.268 s]
[2020-01-01T01:26:32.435Z] [INFO] Shared JUnit3 Provider Code ........................ SUCCESS [  4.338 s]
[2020-01-01T01:26:32.435Z] [INFO] Shared Java 5 Provider Base ........................ SUCCESS [  5.847 s]
[2020-01-01T01:26:32.435Z] [INFO] Shared JUnit4 Provider Code ........................ SUCCESS [  6.539 s]
[2020-01-01T01:26:32.435Z] [INFO] Shared JUnit48 Provider Code ....................... SUCCESS [  6.538 s]
[2020-01-01T01:26:32.435Z] [INFO] SureFire JUnit Runner .............................. SUCCESS [  5.078 s]
[2020-01-01T01:26:32.435Z] [INFO] SureFire JUnit4 Runner ............................. SUCCESS [  4.760 s]
[2020-01-01T01:26:32.435Z] [INFO] Maven Surefire Common .............................. FAILURE [ 10.493 s]
[2020-01-01T01:26:32.435Z] [INFO] SureFire JUnitCore Runner .......................... SKIPPED
[2020-01-01T01:26:32.435Z] [INFO] SureFire JUnit Platform Runner ..................... SKIPPED
[2020-01-01T01:26:32.435Z] [INFO] SureFire TestNG Utils .............................. SKIPPED
[2020-01-01T01:26:32.435Z] [INFO] SureFire TestNG Runner ............................. SKIPPED
[2020-01-01T01:26:32.435Z] [INFO] ShadeFire JUnit3 Provider .......................... SKIPPED
[2020-01-01T01:26:32.435Z] [INFO] Surefire Report Parser ............................. SKIPPED
[2020-01-01T01:26:32.435Z] [INFO] Maven Surefire Plugin .............................. SKIPPED
[2020-01-01T01:26:32.435Z] [INFO] Maven Failsafe Plugin .............................. SKIPPED
[2020-01-01T01:26:32.435Z] [INFO] Maven Surefire Report Plugin ....................... SKIPPED
[2020-01-01T01:26:32.435Z] [INFO] Maven Surefire Integration Tests ................... SKIPPED
[2020-01-01T01:26:32.435Z] [INFO] Surefire Shared Utils .............................. SKIPPED
[2020-01-01T01:26:32.435Z] [INFO] ------------------------------------------------------------------------
[2020-01-01T01:26:32.435Z] [INFO] BUILD FAILURE
[2020-01-01T01:26:32.435Z] [INFO] ------------------------------------------------------------------------
[2020-01-01T01:26:32.435Z] [INFO] Total time:  03:10 min
[2020-01-01T01:26:32.435Z] [INFO] Finished at: 2019-12-31T17:26:31-08:00
[2020-01-01T01:26:32.435Z] [INFO] ------------------------------------------------------------------------
[2020-01-01T01:26:32.435Z] [ERROR] Failed to execute goal org.apache.maven.plugins:maven-compiler-plugin:3.7.0:compile (default-compile) on project maven-surefire-common: Compilation failure: Compilation failure:
[2020-01-01T01:26:32.435Z] [ERROR] C:\Users\jenkins\AppData\Local\Temp\3\jenkins-maven-box-maven-surefire-maven2surefire-jvm-communication-24\maven-surefire-common\src\main\java\org\apache\maven\plugin\surefire\booterclient\ForkStarter.java:[638,91] error: incompatible types: AbstractCommandReader cannot be converted to InputStream
[2020-01-01T01:26:32.435Z] [ERROR] C:\Users\jenkins\AppData\Local\Temp\3\jenkins-maven-box-maven-surefire-maven2surefire-jvm-communication-24\maven-surefire-common\src\main\java\org\apache\maven\plugin\surefire\booterclient\ForkStarter.java:[645,42] error: incompatible types: NativeStdErrStreamConsumer cannot be converted to StreamConsumer
[2020-01-01T01:26:32.435Z] [ERROR] -> [Help 1]
[2020-01-01T01:26:32.435Z] org.apache.maven.lifecycle.LifecycleExecutionException: Failed to execute goal org.apache.maven.plugins:maven-compiler-plugin:3.7.0:compile (default-compile) on project maven-surefire-common: Compilation failure
[2020-01-01T01:26:32.435Z]     at org.apache.maven.lifecycle.internal.MojoExecutor.execute (MojoExecutor.java:215)
[2020-01-01T01:26:32.435Z]     at org.apache.maven.lifecycle.internal.MojoExecutor.execute (MojoExecutor.java:156)
[2020-01-01T01:26:32.435Z]     at org.apache.maven.lifecycle.internal.MojoExecutor.execute (MojoExecutor.java:148)
[2020-01-01T01:26:32.435Z]     at org.apache.maven.lifecycle.internal.LifecycleModuleBuilder.buildProject (LifecycleModuleBuilder.java:117)
[2020-01-01T01:26:32.435Z]     at org.apache.maven.lifecycle.internal.LifecycleModuleBuilder.buildProject (LifecycleModuleBuilder.java:81)
[2020-01-01T01:26:32.435Z]     at org.apache.maven.lifecycle.internal.builder.singlethreaded.SingleThreadedBuilder.build (SingleThreadedBuilder.java:56)
[2020-01-01T01:26:32.435Z]     at org.apache.maven.lifecycle.internal.LifecycleStarter.execute (LifecycleStarter.java:128)
[2020-01-01T01:26:32.435Z]     at org.apache.maven.DefaultMaven.doExecute (DefaultMaven.java:305)
[2020-01-01T01:26:32.435Z]     at org.apache.maven.DefaultMaven.doExecute (DefaultMaven.java:192)
[2020-01-01T01:26:32.435Z]     at org.apache.maven.DefaultMaven.execute (DefaultMaven.java:105)
[2020-01-01T01:26:32.435Z]     at org.apache.maven.cli.MavenCli.execute (MavenCli.java:956)
[2020-01-01T01:26:32.435Z]     at org.apache.maven.cli.MavenCli.doMain (MavenCli.java:288)
[2020-01-01T01:26:32.435Z]     at org.apache.maven.cli.MavenCli.main (MavenCli.java:192)
[2020-01-01T01:26:32.435Z]     at sun.reflect.NativeMethodAccessorImpl.invoke0 (Native Method)
[2020-01-01T01:26:32.435Z]     at sun.reflect.NativeMethodAccessorImpl.invoke (NativeMethodAccessorImpl.java:62)
[2020-01-01T01:26:32.435Z]     at sun.reflect.DelegatingMethodAccessorImpl.invoke (DelegatingMethodAccessorImpl.java:43)
[2020-01-01T01:26:32.435Z]     at java.lang.reflect.Method.invoke (Method.java:498)
[2020-01-01T01:26:32.435Z]     at org.codehaus.plexus.classworlds.launcher.Launcher.launchEnhanced (Launcher.java:282)
[2020-01-01T01:26:32.435Z]     at org.codehaus.plexus.classworlds.launcher.Launcher.launch (Launcher.java:225)
[2020-01-01T01:26:32.435Z]     at org.codehaus.plexus.classworlds.launcher.Launcher.mainWithExitCode (Launcher.java:406)
[2020-01-01T01:26:32.435Z]     at org.codehaus.plexus.classworlds.launcher.Launcher.main (Launcher.java:347)
[2020-01-01T01:26:32.435Z] Caused by: org.apache.maven.plugin.compiler.CompilationFailureException: Compilation failure
[2020-01-01T01:26:32.435Z]     at org.apache.maven.plugin.compiler.AbstractCompilerMojo.execute (AbstractCompilerMojo.java:1161)
[2020-01-01T01:26:32.435Z]     at org.apache.maven.plugin.compiler.CompilerMojo.execute (CompilerMojo.java:168)
[2020-01-01T01:26:32.435Z]     at org.apache.maven.plugin.DefaultBuildPluginManager.executeMojo (DefaultBuildPluginManager.java:137)
[2020-01-01T01:26:32.435Z]     at org.apache.maven.lifecycle.internal.MojoExecutor.execute (MojoExecutor.java:210)
[2020-01-01T01:26:32.435Z]     at org.apache.maven.lifecycle.internal.MojoExecutor.execute (MojoExecutor.java:156)
[2020-01-01T01:26:32.435Z]     at org.apache.maven.lifecycle.internal.MojoExecutor.execute (MojoExecutor.java:148)
[2020-01-01T01:26:32.435Z]     at org.apache.maven.lifecycle.internal.LifecycleModuleBuilder.buildProject (LifecycleModuleBuilder.java:117)
[2020-01-01T01:26:32.435Z]     at org.apache.maven.lifecycle.internal.LifecycleModuleBuilder.buildProject (LifecycleModuleBuilder.java:81)
[2020-01-01T01:26:32.435Z]     at org.apache.maven.lifecycle.internal.builder.singlethreaded.SingleThreadedBuilder.build (SingleThreadedBuilder.java:56)
[2020-01-01T01:26:32.435Z]     at org.apache.maven.lifecycle.internal.LifecycleStarter.execute (LifecycleStarter.java:128)
[2020-01-01T01:26:32.435Z]     at org.apache.maven.DefaultMaven.doExecute (DefaultMaven.java:305)
[2020-01-01T01:26:32.435Z]     at org.apache.maven.DefaultMaven.doExecute (DefaultMaven.java:192)
[2020-01-01T01:26:32.435Z]     at org.apache.maven.DefaultMaven.execute (DefaultMaven.java:105)
[2020-01-01T01:26:32.435Z]     at org.apache.maven.cli.MavenCli.execute (MavenCli.java:956)
[2020-01-01T01:26:32.435Z]     at org.apache.maven.cli.MavenCli.doMain (MavenCli.java:288)
[2020-01-01T01:26:32.435Z]     at org.apache.maven.cli.MavenCli.main (MavenCli.java:192)
[2020-01-01T01:26:32.435Z]     at sun.reflect.NativeMethodAccessorImpl.invoke0 (Native Method)
[2020-01-01T01:26:32.436Z]     at sun.reflect.NativeMethodAccessorImpl.invoke (NativeMethodAccessorImpl.java:62)
[2020-01-01T01:26:32.436Z]     at sun.reflect.DelegatingMethodAccessorImpl.invoke (DelegatingMethodAccessorImpl.java:43)
[2020-01-01T01:26:32.436Z]     at java.lang.reflect.Method.invoke (Method.java:498)
[2020-01-01T01:26:32.436Z]     at org.codehaus.plexus.classworlds.launcher.Launcher.launchEnhanced (Launcher.java:282)
[2020-01-01T01:26:32.436Z]     at org.codehaus.plexus.classworlds.launcher.Launcher.launch (Launcher.java:225)
[2020-01-01T01:26:32.436Z]     at org.codehaus.plexus.classworlds.launcher.Launcher.mainWithExitCode (Launcher.java:406)
[2020-01-01T01:26:32.436Z]     at org.codehaus.plexus.classworlds.launcher.Launcher.main (Launcher.java:347)
[2020-01-01T01:26:32.436Z] [ERROR]
[2020-01-01T01:26:32.436Z] [ERROR] Re-run Maven using the -X switch to enable full debug logging.
[2020-01-01T01:26:32.436Z] [ERROR]
[2020-01-01T01:26:32.436Z] [ERROR] For more information about the errors and possible solutions, please read the following articles:
[2020-01-01T01:26:32.436Z] [ERROR] [Help 1] http://cwiki.apache.org/confluence/display/MAVEN/MojoFailureException
[2020-01-01T01:26:32.436Z] [ERROR]
[2020-01-01T01:26:32.436Z] [ERROR] After correcting the problems, you can resume the build with the command
[2020-01-01T01:26:32.436Z] [ERROR]   mvn <args> -rf :maven-surefire-common
[Pipeline] }
[Pipeline] // withEnv
[Pipeline] }
[Pipeline] }
[Pipeline] // withEnv
[Pipeline] // stage
[Pipeline] fileExists
[Pipeline] }
[Pipeline] // stage
[Pipeline] fileExists
[Pipeline] fileExists
[Pipeline] fileExists
[Pipeline] archiveArtifacts
[2020-01-01T01:26:32.728Z] Archiving artifacts
[Pipeline] archiveArtifacts
[2020-01-01T01:26:32.766Z] Archiving artifacts
[Pipeline] cleanWs
[2020-01-01T01:26:32.813Z] [WS-CLEANUP] Deleting project workspace...
[2020-01-01T01:26:32.813Z] [WS-CLEANUP] Deferred wipeout is used...
[Pipeline] cleanWs
[2020-01-01T01:26:32.856Z] [WS-CLEANUP] Deleting project workspace...
[2020-01-01T01:26:32.856Z] [WS-CLEANUP] Deferred wipeout is used...
[2020-01-01T01:26:32.867Z] [WS-CLEANUP] done
[Pipeline] }
[2020-01-01T01:26:32.900Z] [WS-CLEANUP] done
[Pipeline] // ws
[Pipeline] }
[Pipeline] }
[Pipeline] // ws
[Pipeline] // timestamps
[Pipeline] }
[Pipeline] }
[Pipeline] // timestamps
[Pipeline] // node
[Pipeline] }
[Pipeline] }
[Pipeline] // node
[Pipeline] }
[Pipeline] // parallel
[Pipeline] echo
Build result: FAILURE
[Pipeline] jiraIssueSelector
[Pipeline] echo
The authors of changes [].
[Pipeline] echo
Sending email ...
[Pipeline] emailext
Reply | Threaded
Open this post in threaded view
|

Build failed in Jenkins: Maven TLP » maven-surefire » maven2surefire-jvm-communication #25

Apache Jenkins Server-2
See https://builds.apache.org/job/maven-box/job/maven-surefire/job/maven2surefire-jvm-communication/25/

Changes:

* H30 is having issues

No tests ran.

Build log:
[...truncated 20948 lines...]
[2020-01-12T05:30:49.537Z] [INFO] [checking org.apache.maven.plugin.surefire.report.ConsoleReporter]
[2020-01-12T05:30:49.537Z] [INFO] [checking org.apache.maven.plugin.surefire.report.ReporterUtils]
[2020-01-12T05:30:49.537Z] [INFO] [loading ZipFileIndexFileObject[f:\jenkins\tools\java\latest1.8\lib\ct.sym(META-INF/sym/rt.jar/java/text/Format.class)]]
[2020-01-12T05:30:49.537Z] [INFO] [checking org.apache.maven.plugin.surefire.report.WrappedReportEntry]
[2020-01-12T05:30:49.537Z] [INFO] [checking org.apache.maven.plugin.surefire.StartupReportConfiguration]
[2020-01-12T05:30:49.537Z] [INFO] [checking org.apache.maven.plugin.surefire.report.ReportEntryType]
[2020-01-12T05:30:49.537Z] [INFO] [loading ZipFileIndexFileObject[f:\jenkins\tools\java\latest1.8\lib\ct.sym(META-INF/sym/rt.jar/java/lang/CloneNotSupportedException.class)]]
[2020-01-12T05:30:49.537Z] [INFO] [checking org.apache.maven.plugin.surefire.report.DefaultReporterFactory]
[2020-01-12T05:30:49.537Z] [INFO] [loading ZipFileIndexFileObject[f:\jenkins\tools\java\latest1.8\lib\ct.sym(META-INF/sym/rt.jar/java/util/SortedMap.class)]]
[2020-01-12T05:30:49.537Z] [INFO] [checking org.apache.maven.plugin.surefire.SurefireProperties]
[2020-01-12T05:30:49.537Z] [INFO] [loading ZipFileIndexFileObject[f:\jenkins\tools\java\latest1.8\lib\ct.sym(META-INF/sym/rt.jar/java/util/function/BiFunction.class)]]
[2020-01-12T05:30:49.537Z] [INFO] [loading ZipFileIndexFileObject[f:\jenkins\tools\java\latest1.8\lib\ct.sym(META-INF/sym/rt.jar/java/util/function/Function.class)]]
[2020-01-12T05:30:49.537Z] [INFO] [loading ZipFileIndexFileObject[f:\jenkins\tools\java\latest1.8\lib\ct.sym(META-INF/sym/rt.jar/java/util/function/BiConsumer.class)]]
[2020-01-12T05:30:49.537Z] [INFO] [loading ZipFileIndexFileObject[f:\jenkins\tools\java\latest1.8\lib\ct.sym(META-INF/sym/rt.jar/java/io/FileDescriptor.class)]]
[2020-01-12T05:30:49.537Z] [INFO] [checking org.apache.maven.plugin.surefire.booterclient.lazytestprovider.TestProvidingInputStream]
[2020-01-12T05:30:49.537Z] [INFO] [checking org.apache.maven.plugin.surefire.booterclient.Platform]
[2020-01-12T05:30:49.537Z] [INFO] [checking org.apache.maven.plugin.surefire.booterclient.ProviderDetector]
[2020-01-12T05:30:49.537Z] [INFO] [checking org.apache.maven.plugin.surefire.extensions.SurefireStatelessReporter]
[2020-01-12T05:30:49.537Z] [INFO] [loading ZipFileIndexFileObject[f:\jenkins\tools\java\latest1.8\lib\ct.sym(META-INF/sym/rt.jar/java/lang/InstantiationException.class)]]
[2020-01-12T05:30:49.537Z] [INFO] [loading ZipFileIndexFileObject[f:\jenkins\tools\java\latest1.8\lib\ct.sym(META-INF/sym/rt.jar/java/lang/IllegalAccessException.class)]]
[2020-01-12T05:30:49.537Z] [INFO] [loading ZipFileIndexFileObject[f:\jenkins\tools\java\latest1.8\lib\ct.sym(META-INF/sym/rt.jar/java/lang/NoSuchMethodException.class)]]
[2020-01-12T05:30:49.537Z] [INFO] [loading ZipFileIndexFileObject[f:\jenkins\tools\java\latest1.8\lib\ct.sym(META-INF/sym/rt.jar/java/lang/SecurityException.class)]]
[2020-01-12T05:30:49.537Z] [INFO] [loading ZipFileIndexFileObject[f:\jenkins\tools\java\latest1.8\lib\ct.sym(META-INF/sym/rt.jar/java/lang/reflect/Method.class)]]
[2020-01-12T05:30:49.537Z] [INFO] [loading ZipFileIndexFileObject[f:\jenkins\tools\java\latest1.8\lib\ct.sym(META-INF/sym/rt.jar/java/lang/reflect/Executable.class)]]
[2020-01-12T05:30:49.538Z] [INFO] [loading ZipFileIndexFileObject[f:\jenkins\tools\java\latest1.8\lib\ct.sym(META-INF/sym/rt.jar/java/lang/reflect/Member.class)]]
[2020-01-12T05:30:49.538Z] [INFO] [loading ZipFileIndexFileObject[f:\jenkins\tools\java\latest1.8\lib\ct.sym(META-INF/sym/rt.jar/java/lang/reflect/AccessibleObject.class)]]
[2020-01-12T05:30:49.538Z] [INFO] [loading ZipFileIndexFileObject[f:\jenkins\tools\java\latest1.8\lib\ct.sym(META-INF/sym/rt.jar/java/lang/ReflectiveOperationException.class)]]
[2020-01-12T05:30:49.538Z] [INFO] [checking org.apache.maven.plugin.surefire.extensions.DefaultStatelessReportMojoConfiguration]
[2020-01-12T05:30:49.538Z] [INFO] [checking org.apache.maven.plugin.surefire.extensions.SurefireConsoleOutputReporter]
[2020-01-12T05:30:49.538Z] [INFO] [checking org.apache.maven.plugin.surefire.extensions.SurefireStatelessTestsetInfoReporter]
[2020-01-12T05:30:49.538Z] [INFO] [checking org.apache.maven.plugin.surefire.log.PluginConsoleLogger]
[2020-01-12T05:30:49.538Z] [INFO] [checking org.apache.maven.plugin.surefire.TestClassPath]
[2020-01-12T05:30:49.538Z] [INFO] [checking org.apache.maven.plugin.surefire.ProviderInfo]
[2020-01-12T05:30:49.538Z] [INFO] [checking org.apache.maven.plugin.surefire.InPluginVMSurefireStarter]
[2020-01-12T05:30:49.538Z] [INFO] [checking org.apache.maven.plugin.surefire.JdkAttributes]
[2020-01-12T05:30:49.538Z] [INFO] [checking org.apache.maven.plugin.surefire.booterclient.ChecksumCalculator]
[2020-01-12T05:30:49.538Z] [INFO] [loading ZipFileIndexFileObject[f:\jenkins\tools\java\latest1.8\lib\ct.sym(META-INF/sym/rt.jar/java/security/MessageDigestSpi.class)]]
[2020-01-12T05:30:49.538Z] [INFO] [loading ZipFileIndexFileObject[f:\jenkins\tools\java\latest1.8\lib\ct.sym(META-INF/sym/rt.jar/java/security/GeneralSecurityException.class)]]
[2020-01-12T05:30:49.538Z] [INFO] [checking org.apache.maven.plugin.surefire.SurefireReportParameters]
[2020-01-12T05:30:49.538Z] [INFO] [checking org.apache.maven.plugin.surefire.booterclient.lazytestprovider.FlushReceiverProvider]
[2020-01-12T05:30:49.538Z] [INFO] [checking org.apache.maven.plugin.surefire.booterclient.output.ForkedChannelDecoder]
[2020-01-12T05:30:49.538Z] [INFO] [loading ZipFileIndexFileObject[C:\Users\jenkins\AppData\Local\Temp\2\jenkins-maven-box-maven-surefire-maven2surefire-jvm-communication-25\.m2\commons-codec\commons-codec\1.11\commons-codec-1.11.jar(org/apache/commons/codec/binary/BaseNCodec.class)]]
[2020-01-12T05:30:49.538Z] [INFO] [loading ZipFileIndexFileObject[C:\Users\jenkins\AppData\Local\Temp\2\jenkins-maven-box-maven-surefire-maven2surefire-jvm-communication-25\.m2\commons-codec\commons-codec\1.11\commons-codec-1.11.jar(org/apache/commons/codec/BinaryEncoder.class)]]
[2020-01-12T05:30:49.538Z] [INFO] [loading ZipFileIndexFileObject[C:\Users\jenkins\AppData\Local\Temp\2\jenkins-maven-box-maven-surefire-maven2surefire-jvm-communication-25\.m2\commons-codec\commons-codec\1.11\commons-codec-1.11.jar(org/apache/commons/codec/Encoder.class)]]
[2020-01-12T05:30:49.538Z] [INFO] [loading ZipFileIndexFileObject[C:\Users\jenkins\AppData\Local\Temp\2\jenkins-maven-box-maven-surefire-maven2surefire-jvm-communication-25\.m2\commons-codec\commons-codec\1.11\commons-codec-1.11.jar(org/apache/commons/codec/BinaryDecoder.class)]]
[2020-01-12T05:30:49.538Z] [INFO] [loading ZipFileIndexFileObject[C:\Users\jenkins\AppData\Local\Temp\2\jenkins-maven-box-maven-surefire-maven2surefire-jvm-communication-25\.m2\commons-codec\commons-codec\1.11\commons-codec-1.11.jar(org/apache/commons/codec/Decoder.class)]]
[2020-01-12T05:30:49.538Z] [INFO] [checking org.apache.maven.plugin.surefire.booterclient.output.ForkedChannelDecoderErrorHandler]
[2020-01-12T05:30:49.538Z] [INFO] [checking org.apache.maven.plugin.surefire.booterclient.lazytestprovider.OutputStreamFlushableCommandline]
[2020-01-12T05:30:49.538Z] [INFO] [checking org.apache.maven.plugin.surefire.runorder.StatisticsReporter]
[2020-01-12T05:30:49.538Z] [INFO] [loading ZipFileIndexFileObject[C:\Users\jenkins\AppData\Local\Temp\2\jenkins-maven-box-maven-surefire-maven2surefire-jvm-communication-25\surefire-api\target\surefire-api-3.0.0-SNAPSHOT.jar(org/apache/maven/plugin/surefire/runorder/RunEntryStatistics.class)]]
[2020-01-12T05:30:49.538Z] [INFO] [checking org.apache.maven.plugin.surefire.report.Utf8RecodingDeferredFileOutputStream]
[2020-01-12T05:30:49.538Z] [INFO] [loading ZipFileIndexFileObject[C:\Users\jenkins\AppData\Local\Temp\2\jenkins-maven-box-maven-surefire-maven2surefire-jvm-communication-25\.m2\org\apache\maven\surefire\surefire-shared-utils\3.0.0-M4\surefire-shared-utils-3.0.0-M4.jar(org/apache/maven/surefire/shared/io/output/ThresholdingOutputStream.class)]]
[2020-01-12T05:30:49.538Z] [INFO] [checking org.apache.maven.plugin.surefire.report.TestSetRunListener]
[2020-01-12T05:30:49.538Z] [INFO] [checking org.apache.maven.surefire.report.RunStatistics]
[2020-01-12T05:30:49.538Z] [INFO] [checking org.apache.maven.plugin.surefire.report.TestMethodStats]
[2020-01-12T05:30:49.538Z] [INFO] [checking org.apache.maven.surefire.providerapi.ServiceLoader]
[2020-01-12T05:30:49.538Z] [INFO] [checking org.apache.maven.plugin.surefire.booterclient.lazytestprovider.FlushReceiver]
[2020-01-12T05:30:49.538Z] [INFO] [checking org.apache.maven.plugin.surefire.booterclient.output.ForkedProcessPropertyEventListener]
[2020-01-12T05:30:49.538Z] [INFO] [checking org.apache.maven.plugin.surefire.booterclient.output.ForkedProcessStackTraceEventListener]
[2020-01-12T05:30:49.538Z] [INFO] [checking org.apache.maven.plugin.surefire.booterclient.output.ForkedProcessExitErrorListener]
[2020-01-12T05:30:49.538Z] [INFO] [checking org.apache.maven.plugin.surefire.booterclient.output.ForkedProcessReportEventListener]
[2020-01-12T05:30:49.538Z] [INFO] [checking org.apache.maven.plugin.surefire.booterclient.output.ForkedProcessStandardOutErrEventListener]
[2020-01-12T05:30:49.538Z] [INFO] [checking org.apache.maven.plugin.surefire.booterclient.output.ForkedProcessStringEventListener]
[2020-01-12T05:30:49.538Z] [INFO] [checking org.apache.maven.plugin.surefire.booterclient.output.ForkedProcessEventListener]
[2020-01-12T05:30:49.538Z] [INFO] [checking org.apache.maven.plugin.surefire.booterclient.BooterSerializer]
[2020-01-12T05:30:49.538Z] [INFO] [checking org.apache.maven.plugin.surefire.booterclient.output.DeserializedStacktraceWriter]
[2020-01-12T05:30:49.539Z] [INFO] [checking org.apache.maven.plugin.surefire.util.FileScanner]
[2020-01-12T05:30:49.539Z] [INFO] [checking org.apache.maven.plugin.surefire.booterclient.output.InPluginProcessDumpSingleton]
[2020-01-12T05:30:49.539Z] [INFO] [checking org.apache.maven.plugin.surefire.report.NullFileReporter]
[2020-01-12T05:30:49.539Z] [INFO] [loading ZipFileIndexFileObject[f:\jenkins\tools\java\latest1.8\lib\ct.sym(META-INF/sym/rt.jar/java/io/Writer.class)]]
[2020-01-12T05:30:49.539Z] [INFO] [loading ZipFileIndexFileObject[f:\jenkins\tools\java\latest1.8\lib\ct.sym(META-INF/sym/rt.jar/java/nio/charset/CharsetEncoder.class)]]
[2020-01-12T05:30:49.539Z] [INFO] [checking org.apache.maven.plugin.surefire.report.FileReporterUtils]
[2020-01-12T05:30:49.539Z] [INFO] [checking org.apache.maven.plugin.surefire.report.FileReporter]
[2020-01-12T05:30:49.539Z] [INFO] [checking org.apache.maven.plugin.surefire.booterclient.JarManifestForkConfiguration]
[2020-01-12T05:30:49.539Z] [INFO] [loading ZipFileIndexFileObject[f:\jenkins\tools\java\latest1.8\lib\ct.sym(META-INF/sym/rt.jar/java/nio/channels/SeekableByteChannel.class)]]
[2020-01-12T05:30:49.539Z] [INFO] [loading ZipFileIndexFileObject[C:\Users\jenkins\AppData\Local\Temp\2\jenkins-maven-box-maven-surefire-maven2surefire-jvm-communication-25\.m2\org\apache\maven\surefire\surefire-shared-utils\3.0.0-M4\surefire-shared-utils-3.0.0-M4.jar(org/apache/maven/surefire/shared/compress/archivers/ArchiveOutputStream.class)]]
[2020-01-12T05:30:49.539Z] [INFO] [loading ZipFileIndexFileObject[C:\Users\jenkins\AppData\Local\Temp\2\jenkins-maven-box-maven-surefire-maven2surefire-jvm-communication-25\.m2\org\apache\maven\surefire\surefire-shared-utils\3.0.0-M4\surefire-shared-utils-3.0.0-M4.jar(org/apache/maven/surefire/shared/compress/archivers/ArchiveEntry.class)]]
[2020-01-12T05:30:49.539Z] [INFO] [loading ZipFileIndexFileObject[f:\jenkins\tools\java\latest1.8\lib\ct.sym(META-INF/sym/rt.jar/java/nio/file/LinkOption.class)]]
[2020-01-12T05:30:49.539Z] [INFO] [loading ZipFileIndexFileObject[f:\jenkins\tools\java\latest1.8\lib\ct.sym(META-INF/sym/rt.jar/java/util/jar/Attributes.class)]]
[2020-01-12T05:30:49.539Z] [INFO] [checking org.apache.maven.plugin.surefire.booterclient.AbstractClasspathForkConfiguration]
[2020-01-12T05:30:49.539Z] [INFO] [checking org.apache.maven.plugin.surefire.util.Relocator]
[2020-01-12T05:30:49.539Z] [INFO] [checking org.apache.maven.plugin.surefire.booterclient.DefaultForkConfiguration]
[2020-01-12T05:30:49.539Z] [INFO] [checking org.apache.maven.plugin.surefire.booterclient.ModularClasspathForkConfiguration]
[2020-01-12T05:30:49.539Z] [INFO] [checking org.apache.maven.plugin.surefire.util.SpecificFileFilter]
[2020-01-12T05:30:49.539Z] [INFO] [checking org.apache.maven.plugin.surefire.extensions.StdOutAdapter]
[2020-01-12T05:30:49.539Z] [INFO] [checking org.apache.maven.plugin.surefire.report.NullStatisticsReporter]
[2020-01-12T05:30:49.539Z] [INFO] [checking org.apache.maven.plugin.surefire.report.DirectConsoleOutput]
[2020-01-12T05:30:49.539Z] [INFO] [checking org.apache.maven.plugin.surefire.report.TestcycleConsoleOutputReceiver]
[2020-01-12T05:30:49.539Z] [INFO] [checking org.apache.maven.plugin.surefire.extensions.junit5.JUnit5ConsoleOutputReporter]
[2020-01-12T05:30:49.539Z] [INFO] [checking org.apache.maven.plugin.surefire.report.NullStatelessXmlReporter]
[2020-01-12T05:30:49.539Z] [INFO] [loading ZipFileIndexFileObject[f:\jenkins\tools\java\latest1.8\lib\ct.sym(META-INF/sym/rt.jar/java/io/PrintWriter.class)]]
[2020-01-12T05:30:49.539Z] [INFO] [checking org.apache.maven.plugin.surefire.report.StatelessXmlReporter]
[2020-01-12T05:30:49.539Z] [INFO] [checking org.apache.maven.plugin.surefire.extensions.SurefireForkNodeFactory]
[2020-01-12T05:30:49.539Z] [INFO] [checking org.apache.maven.plugin.surefire.ConfigurableProviderInfo]
[2020-01-12T05:30:49.539Z] [INFO] [checking org.apache.maven.plugin.surefire.booterclient.output.NativeStdErrStreamConsumer]
[2020-01-12T05:30:49.539Z] [INFO] [checking org.apache.maven.plugin.surefire.report.ConsoleOutputFileReporter]
[2020-01-12T05:30:49.539Z] [INFO] [checking org.apache.maven.plugin.surefire.extensions.StdErrAdapter]
[2020-01-12T05:30:49.539Z] [INFO] [checking org.apache.maven.plugin.surefire.report.NullConsoleOutputReceiver]
[2020-01-12T05:30:49.539Z] [INFO] [checking org.apache.maven.plugin.surefire.extensions.LegacyForkNodeFactory]
[2020-01-12T05:30:49.539Z] [INFO] [checking org.apache.maven.plugin.surefire.booterclient.output.NativeStdOutStreamConsumer]
[2020-01-12T05:30:49.539Z] [INFO] [checking org.apache.maven.plugin.surefire.extensions.PipeProcessExecutor]
[2020-01-12T05:30:49.539Z] [INFO] [loading ZipFileIndexFileObject[C:\Users\jenkins\AppData\Local\Temp\2\jenkins-maven-box-maven-surefire-maven2surefire-jvm-communication-25\.m2\org\apache\maven\surefire\surefire-shared-utils\3.0.0-M4\surefire-shared-utils-3.0.0-M4.jar(org/apache/maven/surefire/shared/utils/cli/CommandLineCallable.class)]]
[2020-01-12T05:30:49.539Z] [INFO] [checking org.apache.maven.plugin.surefire.report.NullConsoleReporter]
[2020-01-12T05:30:49.539Z] [INFO] [checking org.apache.maven.plugin.surefire.extensions.LegacyForkChannel]
[2020-01-12T05:30:49.539Z] [INFO] [checking org.apache.maven.plugin.surefire.ClasspathCache]
[2020-01-12T05:30:49.539Z] [INFO] [checking org.apache.maven.plugin.surefire.CommonReflector]
[2020-01-12T05:30:49.539Z] [INFO] [loading ZipFileIndexFileObject[f:\jenkins\tools\java\latest1.8\lib\ct.sym(META-INF/sym/rt.jar/java/lang/ClassNotFoundException.class)]]
[2020-01-12T05:30:49.539Z] [INFO] [checking org.apache.maven.plugin.surefire.extensions.NetworkingProcessExecutor]
[2020-01-12T05:30:49.539Z] [INFO] [loading ZipFileIndexFileObject[f:\jenkins\tools\java\latest1.8\lib\ct.sym(META-INF/sym/rt.jar/java/nio/channels/AsynchronousByteChannel.class)]]
[2020-01-12T05:30:49.539Z] [INFO] [checking org.apache.maven.plugin.surefire.util.DirectoryScanner]
[2020-01-12T05:30:49.539Z] [INFO] [checking org.apache.maven.plugin.surefire.extensions.SurefireForkChannel]
[2020-01-12T05:30:49.539Z] [INFO] [loading ZipFileIndexFileObject[f:\jenkins\tools\java\latest1.8\lib\ct.sym(META-INF/sym/rt.jar/java/net/SocketOption.class)]]
[2020-01-12T05:30:49.539Z] [INFO] [loading ZipFileIndexFileObject[f:\jenkins\tools\java\latest1.8\lib\ct.sym(META-INF/sym/rt.jar/java/net/SocketAddress.class)]]
[2020-01-12T05:30:49.539Z] [INFO] [checking org.apache.maven.plugin.surefire.booterclient.ClasspathForkConfiguration]
[2020-01-12T05:30:49.539Z] [INFO] [checking org.apache.maven.plugin.surefire.extensions.junit5.JUnit5StatelessTestsetInfoReporter]
[2020-01-12T05:30:49.540Z] [INFO] [checking org.apache.maven.plugin.surefire.extensions.junit5.JUnit5Xml30StatelessReporter]
[2020-01-12T05:30:49.540Z] [INFO] [checking org.apache.maven.plugin.surefire.booterclient.lazytestprovider.OutputStreamFlushReceiver]
[2020-01-12T05:30:49.540Z] [INFO] [total 2465ms]
[2020-01-12T05:30:49.540Z] [INFO] -------------------------------------------------------------
[2020-01-12T05:30:49.540Z] [ERROR] COMPILATION ERROR :
[2020-01-12T05:30:49.540Z] [INFO] -------------------------------------------------------------
[2020-01-12T05:30:49.540Z] [ERROR] C:\Users\jenkins\AppData\Local\Temp\2\jenkins-maven-box-maven-surefire-maven2surefire-jvm-communication-25\maven-surefire-common\src\main\java\org\apache\maven\plugin\surefire\booterclient\ForkStarter.java:[638,91] error: incompatible types: AbstractCommandReader cannot be converted to InputStream
[2020-01-12T05:30:49.540Z] [ERROR] C:\Users\jenkins\AppData\Local\Temp\2\jenkins-maven-box-maven-surefire-maven2surefire-jvm-communication-25\maven-surefire-common\src\main\java\org\apache\maven\plugin\surefire\booterclient\ForkStarter.java:[645,42] error: incompatible types: NativeStdErrStreamConsumer cannot be converted to StreamConsumer
[2020-01-12T05:30:49.540Z] [INFO] 2 errors
[2020-01-12T05:30:49.540Z] [INFO] -------------------------------------------------------------
[2020-01-12T05:30:49.540Z] [INFO] ------------------------------------------------------------------------
[2020-01-12T05:30:49.540Z] [INFO] Reactor Summary for Apache Maven Surefire 3.0.0-SNAPSHOT:
[2020-01-12T05:30:49.540Z] [INFO]
[2020-01-12T05:30:49.540Z] [INFO] Apache Maven Surefire .............................. SUCCESS [01:11 min]
[2020-01-12T05:30:49.540Z] [INFO] SureFire Logger API ................................ SUCCESS [ 25.194 s]
[2020-01-12T05:30:49.540Z] [INFO] SureFire API ....................................... SUCCESS [ 12.019 s]
[2020-01-12T05:30:49.540Z] [INFO] Surefire Extensions API ............................ SUCCESS [  6.084 s]
[2020-01-12T05:30:49.540Z] [INFO] Surefire Extensions SPI ............................ SUCCESS [  2.988 s]
[2020-01-12T05:30:49.540Z] [INFO] SureFire Booter .................................... SUCCESS [ 16.574 s]
[2020-01-12T05:30:49.540Z] [INFO] Maven Surefire Test-Grouping Support ............... SUCCESS [ 10.986 s]
[2020-01-12T05:30:49.540Z] [INFO] SureFire Providers ................................. SUCCESS [  1.379 s]
[2020-01-12T05:30:49.540Z] [INFO] Shared JUnit3 Provider Code ........................ SUCCESS [  4.286 s]
[2020-01-12T05:30:49.540Z] [INFO] Shared Java 5 Provider Base ........................ SUCCESS [  4.891 s]
[2020-01-12T05:30:49.540Z] [INFO] Shared JUnit4 Provider Code ........................ SUCCESS [  5.967 s]
[2020-01-12T05:30:49.540Z] [INFO] Shared JUnit48 Provider Code ....................... SUCCESS [  6.679 s]
[2020-01-12T05:30:49.540Z] [INFO] SureFire JUnit Runner .............................. SUCCESS [  4.776 s]
[2020-01-12T05:30:49.540Z] [INFO] SureFire JUnit4 Runner ............................. SUCCESS [  4.438 s]
[2020-01-12T05:30:49.540Z] [INFO] Maven Surefire Common .............................. FAILURE [  9.339 s]
[2020-01-12T05:30:49.540Z] [INFO] SureFire JUnitCore Runner .......................... SKIPPED
[2020-01-12T05:30:49.540Z] [INFO] SureFire JUnit Platform Runner ..................... SKIPPED
[2020-01-12T05:30:49.540Z] [INFO] SureFire TestNG Utils .............................. SKIPPED
[2020-01-12T05:30:49.540Z] [INFO] SureFire TestNG Runner ............................. SKIPPED
[2020-01-12T05:30:49.540Z] [INFO] ShadeFire JUnit3 Provider .......................... SKIPPED
[2020-01-12T05:30:49.540Z] [INFO] Surefire Report Parser ............................. SKIPPED
[2020-01-12T05:30:49.540Z] [INFO] Maven Surefire Plugin .............................. SKIPPED
[2020-01-12T05:30:49.540Z] [INFO] Maven Failsafe Plugin .............................. SKIPPED
[2020-01-12T05:30:49.540Z] [INFO] Maven Surefire Report Plugin ....................... SKIPPED
[2020-01-12T05:30:49.540Z] [INFO] Maven Surefire Integration Tests ................... SKIPPED
[2020-01-12T05:30:49.540Z] [INFO] Surefire Shared Utils .............................. SKIPPED
[2020-01-12T05:30:49.540Z] [INFO] ------------------------------------------------------------------------
[2020-01-12T05:30:49.540Z] [INFO] BUILD FAILURE
[2020-01-12T05:30:49.540Z] [INFO] ------------------------------------------------------------------------
[2020-01-12T05:30:49.540Z] [INFO] Total time:  03:08 min
[2020-01-12T05:30:49.541Z] [INFO] Finished at: 2020-01-11T21:30:49-08:00
[2020-01-12T05:30:49.541Z] [INFO] ------------------------------------------------------------------------
[2020-01-12T05:30:49.541Z] [ERROR] Failed to execute goal org.apache.maven.plugins:maven-compiler-plugin:3.7.0:compile (default-compile) on project maven-surefire-common: Compilation failure: Compilation failure:
[2020-01-12T05:30:49.541Z] [ERROR] C:\Users\jenkins\AppData\Local\Temp\2\jenkins-maven-box-maven-surefire-maven2surefire-jvm-communication-25\maven-surefire-common\src\main\java\org\apache\maven\plugin\surefire\booterclient\ForkStarter.java:[638,91] error: incompatible types: AbstractCommandReader cannot be converted to InputStream
[2020-01-12T05:30:49.541Z] [ERROR] C:\Users\jenkins\AppData\Local\Temp\2\jenkins-maven-box-maven-surefire-maven2surefire-jvm-communication-25\maven-surefire-common\src\main\java\org\apache\maven\plugin\surefire\booterclient\ForkStarter.java:[645,42] error: incompatible types: NativeStdErrStreamConsumer cannot be converted to StreamConsumer
[2020-01-12T05:30:49.541Z] [ERROR] -> [Help 1]
[2020-01-12T05:30:49.541Z] org.apache.maven.lifecycle.LifecycleExecutionException: Failed to execute goal org.apache.maven.plugins:maven-compiler-plugin:3.7.0:compile (default-compile) on project maven-surefire-common: Compilation failure
[2020-01-12T05:30:49.541Z]     at org.apache.maven.lifecycle.internal.MojoExecutor.execute (MojoExecutor.java:215)
[2020-01-12T05:30:49.541Z]     at org.apache.maven.lifecycle.internal.MojoExecutor.execute (MojoExecutor.java:156)
[2020-01-12T05:30:49.541Z]     at org.apache.maven.lifecycle.internal.MojoExecutor.execute (MojoExecutor.java:148)
[2020-01-12T05:30:49.541Z]     at org.apache.maven.lifecycle.internal.LifecycleModuleBuilder.buildProject (LifecycleModuleBuilder.java:117)
[2020-01-12T05:30:49.541Z]     at org.apache.maven.lifecycle.internal.LifecycleModuleBuilder.buildProject (LifecycleModuleBuilder.java:81)
[2020-01-12T05:30:49.541Z]     at org.apache.maven.lifecycle.internal.builder.singlethreaded.SingleThreadedBuilder.build (SingleThreadedBuilder.java:56)
[2020-01-12T05:30:49.541Z]     at org.apache.maven.lifecycle.internal.LifecycleStarter.execute (LifecycleStarter.java:128)
[2020-01-12T05:30:49.541Z]     at org.apache.maven.DefaultMaven.doExecute (DefaultMaven.java:305)
[2020-01-12T05:30:49.541Z]     at org.apache.maven.DefaultMaven.doExecute (DefaultMaven.java:192)
[2020-01-12T05:30:49.541Z]     at org.apache.maven.DefaultMaven.execute (DefaultMaven.java:105)
[2020-01-12T05:30:49.541Z]     at org.apache.maven.cli.MavenCli.execute (MavenCli.java:956)
[2020-01-12T05:30:49.541Z]     at org.apache.maven.cli.MavenCli.doMain (MavenCli.java:288)
[2020-01-12T05:30:49.541Z]     at org.apache.maven.cli.MavenCli.main (MavenCli.java:192)
[2020-01-12T05:30:49.541Z]     at sun.reflect.NativeMethodAccessorImpl.invoke0 (Native Method)
[2020-01-12T05:30:49.541Z]     at sun.reflect.NativeMethodAccessorImpl.invoke (NativeMethodAccessorImpl.java:62)
[2020-01-12T05:30:49.541Z]     at sun.reflect.DelegatingMethodAccessorImpl.invoke (DelegatingMethodAccessorImpl.java:43)
[2020-01-12T05:30:49.541Z]     at java.lang.reflect.Method.invoke (Method.java:498)
[2020-01-12T05:30:49.541Z]     at org.codehaus.plexus.classworlds.launcher.Launcher.launchEnhanced (Launcher.java:282)
[2020-01-12T05:30:49.541Z]     at org.codehaus.plexus.classworlds.launcher.Launcher.launch (Launcher.java:225)
[2020-01-12T05:30:49.541Z]     at org.codehaus.plexus.classworlds.launcher.Launcher.mainWithExitCode (Launcher.java:406)
[2020-01-12T05:30:49.541Z]     at org.codehaus.plexus.classworlds.launcher.Launcher.main (Launcher.java:347)
[2020-01-12T05:30:49.541Z] Caused by: org.apache.maven.plugin.compiler.CompilationFailureException: Compilation failure
[2020-01-12T05:30:49.541Z]     at org.apache.maven.plugin.compiler.AbstractCompilerMojo.execute (AbstractCompilerMojo.java:1161)
[2020-01-12T05:30:49.541Z]     at org.apache.maven.plugin.compiler.CompilerMojo.execute (CompilerMojo.java:168)
[2020-01-12T05:30:49.541Z]     at org.apache.maven.plugin.DefaultBuildPluginManager.executeMojo (DefaultBuildPluginManager.java:137)
[2020-01-12T05:30:49.541Z]     at org.apache.maven.lifecycle.internal.MojoExecutor.execute (MojoExecutor.java:210)
[2020-01-12T05:30:49.541Z]     at org.apache.maven.lifecycle.internal.MojoExecutor.execute (MojoExecutor.java:156)
[2020-01-12T05:30:49.541Z]     at org.apache.maven.lifecycle.internal.MojoExecutor.execute (MojoExecutor.java:148)
[2020-01-12T05:30:49.541Z]     at org.apache.maven.lifecycle.internal.LifecycleModuleBuilder.buildProject (LifecycleModuleBuilder.java:117)
[2020-01-12T05:30:49.541Z]     at org.apache.maven.lifecycle.internal.LifecycleModuleBuilder.buildProject (LifecycleModuleBuilder.java:81)
[2020-01-12T05:30:49.541Z]     at org.apache.maven.lifecycle.internal.builder.singlethreaded.SingleThreadedBuilder.build (SingleThreadedBuilder.java:56)
[2020-01-12T05:30:49.541Z]     at org.apache.maven.lifecycle.internal.LifecycleStarter.execute (LifecycleStarter.java:128)
[2020-01-12T05:30:49.541Z]     at org.apache.maven.DefaultMaven.doExecute (DefaultMaven.java:305)
[2020-01-12T05:30:49.541Z]     at org.apache.maven.DefaultMaven.doExecute (DefaultMaven.java:192)
[2020-01-12T05:30:49.541Z]     at org.apache.maven.DefaultMaven.execute (DefaultMaven.java:105)
[2020-01-12T05:30:49.541Z]     at org.apache.maven.cli.MavenCli.execute (MavenCli.java:956)
[2020-01-12T05:30:49.541Z]     at org.apache.maven.cli.MavenCli.doMain (MavenCli.java:288)
[2020-01-12T05:30:49.541Z]     at org.apache.maven.cli.MavenCli.main (MavenCli.java:192)
[2020-01-12T05:30:49.541Z]     at sun.reflect.NativeMethodAccessorImpl.invoke0 (Native Method)
[2020-01-12T05:30:49.541Z]     at sun.reflect.NativeMethodAccessorImpl.invoke (NativeMethodAccessorImpl.java:62)
[2020-01-12T05:30:49.541Z]     at sun.reflect.DelegatingMethodAccessorImpl.invoke (DelegatingMethodAccessorImpl.java:43)
[2020-01-12T05:30:49.541Z]     at java.lang.reflect.Method.invoke (Method.java:498)
[2020-01-12T05:30:49.541Z]     at org.codehaus.plexus.classworlds.launcher.Launcher.launchEnhanced (Launcher.java:282)
[2020-01-12T05:30:49.541Z]     at org.codehaus.plexus.classworlds.launcher.Launcher.launch (Launcher.java:225)
[2020-01-12T05:30:49.541Z]     at org.codehaus.plexus.classworlds.launcher.Launcher.mainWithExitCode (Launcher.java:406)
[2020-01-12T05:30:49.541Z]     at org.codehaus.plexus.classworlds.launcher.Launcher.main (Launcher.java:347)
[2020-01-12T05:30:49.541Z] [ERROR]
[2020-01-12T05:30:49.541Z] [ERROR] Re-run Maven using the -X switch to enable full debug logging.
[2020-01-12T05:30:49.541Z] [ERROR]
[2020-01-12T05:30:49.542Z] [ERROR] For more information about the errors and possible solutions, please read the following articles:
[2020-01-12T05:30:49.542Z] [ERROR] [Help 1] http://cwiki.apache.org/confluence/display/MAVEN/MojoFailureException
[2020-01-12T05:30:49.542Z] [ERROR]
[2020-01-12T05:30:49.542Z] [ERROR] After correcting the problems, you can resume the build with the command
[2020-01-12T05:30:49.542Z] [ERROR]   mvn <args> -rf :maven-surefire-common
[Pipeline] }
[Pipeline] // withEnv
[Pipeline] }
[Pipeline] // stage
[Pipeline] fileExists
[Pipeline] fileExists
[Pipeline] archiveArtifacts
[2020-01-12T05:30:49.853Z] Archiving artifacts
[Pipeline] cleanWs
[2020-01-12T05:30:49.916Z] [WS-CLEANUP] Deleting project workspace...
[2020-01-12T05:30:49.916Z] [WS-CLEANUP] Deferred wipeout is used...
[2020-01-12T05:30:49.962Z] [WS-CLEANUP] done
[Pipeline] }
[Pipeline] // ws
[Pipeline] }
[Pipeline] // timestamps
[Pipeline] }
[Pipeline] // node
[Pipeline] }
[Pipeline] // parallel
[Pipeline] echo
hudson.AbortException: hudson.AbortException: Error cloning remote repo 'origin'
[Pipeline] echo
Build result: FAILURE
[Pipeline] jiraIssueSelector
[Pipeline] echo
The authors of changes [rfscholte].
[Pipeline] echo
Sending email ...
[Pipeline] emailext
Reply | Threaded
Open this post in threaded view
|

Build failed in Jenkins: Maven TLP » maven-surefire » maven2surefire-jvm-communication #26

Apache Jenkins Server-2
See https://builds.apache.org/job/maven-box/job/maven-surefire/job/maven2surefire-jvm-communication/26/

Changes:

* used reader of Command-s instead of InputStream

No tests ran.

Build log:
[...truncated 33293 lines...]
[2020-01-12T05:34:47.764Z] [INFO] SureFire Logger API ................................ SUCCESS [  8.942 s]
[2020-01-12T05:34:47.764Z] [INFO] SureFire API ....................................... SUCCESS [  9.181 s]
[2020-01-12T05:34:47.764Z] [INFO] Surefire Extensions API ............................ SUCCESS [  4.900 s]
[2020-01-12T05:34:47.764Z] [INFO] Surefire Extensions SPI ............................ SUCCESS [  2.808 s]
[2020-01-12T05:34:47.764Z] [INFO] SureFire Booter .................................... SUCCESS [  9.811 s]
[2020-01-12T05:34:47.764Z] [INFO] Maven Surefire Test-Grouping Support ............... SUCCESS [  5.946 s]
[2020-01-12T05:34:47.764Z] [INFO] SureFire Providers ................................. SUCCESS [  1.532 s]
[2020-01-12T05:34:47.764Z] [INFO] Shared JUnit3 Provider Code ........................ SUCCESS [  4.014 s]
[2020-01-12T05:34:47.764Z] [INFO] Shared Java 5 Provider Base ........................ SUCCESS [  4.735 s]
[2020-01-12T05:34:47.764Z] [INFO] Shared JUnit4 Provider Code ........................ SUCCESS [  4.927 s]
[2020-01-12T05:34:47.764Z] [INFO] Shared JUnit48 Provider Code ....................... SUCCESS [  5.481 s]
[2020-01-12T05:34:47.764Z] [INFO] SureFire JUnit Runner .............................. SUCCESS [  4.442 s]
[2020-01-12T05:34:47.764Z] [INFO] SureFire JUnit4 Runner ............................. SUCCESS [  4.434 s]
[2020-01-12T05:34:47.764Z] [INFO] Maven Surefire Common .............................. SUCCESS [ 19.007 s]
[2020-01-12T05:34:47.764Z] [INFO] SureFire JUnitCore Runner .......................... SUCCESS [ 10.365 s]
[2020-01-12T05:34:47.764Z] [INFO] SureFire JUnit Platform Runner ..................... SUCCESS [  9.771 s]
[2020-01-12T05:34:47.764Z] [INFO] SureFire TestNG Utils .............................. SUCCESS [  4.565 s]
[2020-01-12T05:34:47.764Z] [INFO] SureFire TestNG Runner ............................. SUCCESS [  5.293 s]
[2020-01-12T05:34:47.764Z] [INFO] ShadeFire JUnit3 Provider .......................... SUCCESS [  2.032 s]
[2020-01-12T05:34:47.764Z] [INFO] Surefire Report Parser ............................. SUCCESS [  5.641 s]
[2020-01-12T05:34:47.764Z] [INFO] Maven Surefire Plugin .............................. SUCCESS [ 12.031 s]
[2020-01-12T05:34:47.765Z] [INFO] Maven Failsafe Plugin .............................. SUCCESS [ 10.085 s]
[2020-01-12T05:34:47.765Z] [INFO] Maven Surefire Report Plugin ....................... SUCCESS [ 13.486 s]
[2020-01-12T05:34:47.765Z] [INFO] Maven Surefire Integration Tests ................... SUCCESS [ 12.794 s]
[2020-01-12T05:34:47.765Z] [INFO] Surefire Shared Utils .............................. SUCCESS [  3.520 s]
[2020-01-12T05:34:47.765Z] [INFO] ------------------------------------------------------------------------
[2020-01-12T05:34:47.765Z] [INFO] BUILD SUCCESS
[2020-01-12T05:34:47.765Z] [INFO] ------------------------------------------------------------------------
[2020-01-12T05:34:47.765Z] [INFO] Total time:  03:19 min
[2020-01-12T05:34:47.765Z] [INFO] Finished at: 2020-01-12T05:34:47Z
[2020-01-12T05:34:47.765Z] [INFO] ------------------------------------------------------------------------
[Pipeline] }
[Pipeline] // withEnv
[Pipeline] }
[Pipeline] // stage
[Pipeline] cleanWs
[2020-01-12T05:34:48.534Z] [WS-CLEANUP] Deleting project workspace...
[2020-01-12T05:34:48.534Z] [WS-CLEANUP] Deferred wipeout is used...
[2020-01-12T05:34:48.806Z] [INFO]
[2020-01-12T05:34:48.806Z] [INFO] --- maven-checkstyle-plugin:3.0.0:check (checkstyle-check) @ surefire-shared-utils ---
[2020-01-12T05:34:48.806Z] [INFO]
[2020-01-12T05:34:48.806Z] [INFO] --- maven-install-plugin:2.5.2:install (default-install) @ surefire-shared-utils ---
[2020-01-12T05:34:48.807Z] [INFO] Installing /home/jenkins/jenkins-slave/workspace/maven2surefire-jvm-communication@2/surefire-shared-utils/target/surefire-shared-utils-3.0.0-SNAPSHOT.jar to /home/jenkins/jenkins-slave/workspace/maven2surefire-jvm-communication@2/.m2/org/apache/maven/surefire/surefire-shared-utils/3.0.0-SNAPSHOT/surefire-shared-utils-3.0.0-SNAPSHOT.jar
[2020-01-12T05:34:48.807Z] [INFO] Installing /home/jenkins/jenkins-slave/workspace/maven2surefire-jvm-communication@2/surefire-shared-utils/dependency-reduced-pom.xml to /home/jenkins/jenkins-slave/workspace/maven2surefire-jvm-communication@2/.m2/org/apache/maven/surefire/surefire-shared-utils/3.0.0-SNAPSHOT/surefire-shared-utils-3.0.0-SNAPSHOT.pom
[2020-01-12T05:34:48.807Z] [INFO] ------------------------------------------------------------------------
[2020-01-12T05:34:48.807Z] [INFO] Reactor Summary for Apache Maven Surefire 3.0.0-SNAPSHOT:
[2020-01-12T05:34:48.807Z] [INFO]
[2020-01-12T05:34:48.807Z] [INFO] Apache Maven Surefire .............................. SUCCESS [ 17.392 s]
[2020-01-12T05:34:48.807Z] [INFO] SureFire Logger API ................................ SUCCESS [  8.310 s]
[2020-01-12T05:34:48.807Z] [INFO] SureFire API ....................................... SUCCESS [  9.074 s]
[2020-01-12T05:34:48.807Z] [INFO] Surefire Extensions API ............................ SUCCESS [  4.782 s]
[2020-01-12T05:34:48.807Z] [INFO] Surefire Extensions SPI ............................ SUCCESS [  2.743 s]
[2020-01-12T05:34:48.807Z] [INFO] SureFire Booter .................................... SUCCESS [  9.264 s]
[2020-01-12T05:34:48.807Z] [INFO] Maven Surefire Test-Grouping Support ............... SUCCESS [  5.862 s]
[2020-01-12T05:34:48.807Z] [INFO] SureFire Providers ................................. SUCCESS [  1.531 s]
[2020-01-12T05:34:48.807Z] [INFO] Shared JUnit3 Provider Code ........................ SUCCESS [  3.910 s]
[2020-01-12T05:34:48.807Z] [INFO] Shared Java 5 Provider Base ........................ SUCCESS [  4.638 s]
[2020-01-12T05:34:48.807Z] [INFO] Shared JUnit4 Provider Code ........................ SUCCESS [  4.982 s]
[2020-01-12T05:34:48.807Z] [INFO] Shared JUnit48 Provider Code ....................... SUCCESS [  5.345 s]
[2020-01-12T05:34:48.807Z] [INFO] SureFire JUnit Runner .............................. SUCCESS [  4.392 s]
[2020-01-12T05:34:48.807Z] [INFO] SureFire JUnit4 Runner ............................. SUCCESS [  4.360 s]
[2020-01-12T05:34:48.807Z] [INFO] Maven Surefire Common .............................. SUCCESS [ 18.204 s]
[2020-01-12T05:34:48.807Z] [INFO] SureFire JUnitCore Runner .......................... SUCCESS [ 10.149 s]
[2020-01-12T05:34:48.807Z] [INFO] SureFire JUnit Platform Runner ..................... SUCCESS [  9.551 s]
[2020-01-12T05:34:48.807Z] [INFO] SureFire TestNG Utils .............................. SUCCESS [  4.476 s]
[2020-01-12T05:34:48.807Z] [INFO] SureFire TestNG Runner ............................. SUCCESS [  5.297 s]
[2020-01-12T05:34:48.807Z] [INFO] ShadeFire JUnit3 Provider .......................... SUCCESS [  2.031 s]
[2020-01-12T05:34:48.807Z] [INFO] Surefire Report Parser ............................. SUCCESS [  5.609 s]
[2020-01-12T05:34:48.807Z] [INFO] Maven Surefire Plugin .............................. SUCCESS [ 11.896 s]
[2020-01-12T05:34:48.807Z] [INFO] Maven Failsafe Plugin .............................. SUCCESS [  9.891 s]
[2020-01-12T05:34:48.807Z] [INFO] Maven Surefire Report Plugin ....................... SUCCESS [ 13.293 s]
[2020-01-12T05:34:48.807Z] [INFO] Maven Surefire Integration Tests ................... SUCCESS [ 12.432 s]
[2020-01-12T05:34:48.807Z] [INFO] Surefire Shared Utils .............................. SUCCESS [  3.402 s]
[2020-01-12T05:34:48.807Z] [INFO] ------------------------------------------------------------------------
[2020-01-12T05:34:48.807Z] [INFO] BUILD SUCCESS
[2020-01-12T05:34:48.807Z] [INFO] ------------------------------------------------------------------------
[2020-01-12T05:34:48.807Z] [INFO] Total time:  03:14 min
[2020-01-12T05:34:48.807Z] [INFO] Finished at: 2020-01-12T05:34:51Z
[2020-01-12T05:34:48.807Z] [INFO] ------------------------------------------------------------------------
[2020-01-12T05:34:48.861Z] [WS-CLEANUP] done
[Pipeline] }
[Pipeline] // ws
[Pipeline] }
[Pipeline] // timestamps
[Pipeline] }
[Pipeline] // node
[Pipeline] }
[Pipeline] }
[Pipeline] // withEnv
[Pipeline] }
[Pipeline] // stage
[Pipeline] cleanWs
[2020-01-12T05:34:50.029Z] [WS-CLEANUP] Deleting project workspace...
[2020-01-12T05:34:50.029Z] [WS-CLEANUP] Deferred wipeout is used...
[2020-01-12T05:34:50.693Z] [WS-CLEANUP] done
[Pipeline] }
[Pipeline] // ws
[Pipeline] }
[Pipeline] // timestamps
[Pipeline] }
[Pipeline] // node
[Pipeline] }
[2020-01-12T05:37:31.668Z] [INFO]
[2020-01-12T05:37:31.668Z] [INFO] --- jacoco-maven-plugin:0.8.5:report (default-cli) @ surefire-shared-utils ---
[2020-01-12T05:37:31.668Z] [INFO] Skipping JaCoCo execution due to missing execution data file.
[2020-01-12T05:37:31.668Z] [INFO] ------------------------------------------------------------------------
[2020-01-12T05:37:31.668Z] [INFO] Reactor Summary for Apache Maven Surefire 3.0.0-SNAPSHOT:
[2020-01-12T05:37:31.668Z] [INFO]
[2020-01-12T05:37:31.668Z] [INFO] Apache Maven Surefire .............................. SUCCESS [ 19.625 s]
[2020-01-12T05:37:31.668Z] [INFO] SureFire Logger API ................................ SUCCESS [  7.263 s]
[2020-01-12T05:37:31.668Z] [INFO] SureFire API ....................................... SUCCESS [  9.325 s]
[2020-01-12T05:37:31.668Z] [INFO] Surefire Extensions API ............................ SUCCESS [  4.880 s]
[2020-01-12T05:37:31.668Z] [INFO] Surefire Extensions SPI ............................ SUCCESS [  2.847 s]
[2020-01-12T05:37:31.668Z] [INFO] SureFire Booter .................................... SUCCESS [  9.464 s]
[2020-01-12T05:37:31.668Z] [INFO] Maven Surefire Test-Grouping Support ............... SUCCESS [  5.896 s]
[2020-01-12T05:37:31.668Z] [INFO] SureFire Providers ................................. SUCCESS [  1.547 s]
[2020-01-12T05:37:31.668Z] [INFO] Shared JUnit3 Provider Code ........................ SUCCESS [  3.996 s]
[2020-01-12T05:37:31.668Z] [INFO] Shared Java 5 Provider Base ........................ SUCCESS [  4.609 s]
[2020-01-12T05:37:31.668Z] [INFO] Shared JUnit4 Provider Code ........................ SUCCESS [  4.947 s]
[2020-01-12T05:37:31.668Z] [INFO] Shared JUnit48 Provider Code ....................... SUCCESS [  5.362 s]
[2020-01-12T05:37:31.668Z] [INFO] SureFire JUnit Runner .............................. SUCCESS [  4.429 s]
[2020-01-12T05:37:31.668Z] [INFO] SureFire JUnit4 Runner ............................. SUCCESS [  4.353 s]
[2020-01-12T05:37:31.668Z] [INFO] Maven Surefire Common .............................. SUCCESS [ 18.881 s]
[2020-01-12T05:37:31.668Z] [INFO] SureFire JUnitCore Runner .......................... SUCCESS [ 10.200 s]
[2020-01-12T05:37:31.668Z] [INFO] SureFire JUnit Platform Runner ..................... SUCCESS [  9.669 s]
[2020-01-12T05:37:31.668Z] [INFO] SureFire TestNG Utils .............................. SUCCESS [  4.519 s]
[2020-01-12T05:37:31.668Z] [INFO] SureFire TestNG Runner ............................. SUCCESS [  5.524 s]
[2020-01-12T05:37:31.668Z] [INFO] ShadeFire JUnit3 Provider .......................... SUCCESS [  2.016 s]
[2020-01-12T05:37:31.668Z] [INFO] Surefire Report Parser ............................. SUCCESS [  5.626 s]
[2020-01-12T05:37:31.668Z] [INFO] Maven Surefire Plugin .............................. SUCCESS [ 11.712 s]
[2020-01-12T05:37:31.668Z] [INFO] Maven Failsafe Plugin .............................. SUCCESS [  9.975 s]
[2020-01-12T05:37:31.668Z] [INFO] Maven Surefire Report Plugin ....................... SUCCESS [ 13.250 s]
[2020-01-12T05:37:31.668Z] [INFO] Maven Surefire Integration Tests ................... SUCCESS [ 12.699 s]
[2020-01-12T05:37:31.668Z] [INFO] Surefire Shared Utils .............................. SUCCESS [02:40 min]
[2020-01-12T05:37:31.668Z] [INFO] ------------------------------------------------------------------------
[2020-01-12T05:37:31.668Z] [INFO] BUILD SUCCESS
[2020-01-12T05:37:31.668Z] [INFO] ------------------------------------------------------------------------
[2020-01-12T05:37:31.668Z] [INFO] Total time:  05:55 min
[2020-01-12T05:37:31.668Z] [INFO] Finished at: 2020-01-12T05:37:19Z
[2020-01-12T05:37:31.668Z] [INFO] ------------------------------------------------------------------------
[Pipeline] }
[Pipeline] // withEnv
[Pipeline] }
[Pipeline] // stage
[Pipeline] openTasks
[2020-01-12T05:37:32.947Z] [TASKS] Scanning folder '/home/jenkins/jenkins-slave/workspace/maven2surefire-jvm-communication@2' for files matching the pattern '**/maven-failsafe-plugin/src/main/java,**/maven-surefire-common/src/main/java,**/maven-surefire-plugin/src/main/java,**/maven-surefire-report-plugin/src/main/java,**/surefire-api/src/main/java,**/surefire-booter/src/main/java,**/surefire-extensions-api/src/main/java,**/surefire-grouper/src/main/java,**/surefire-its/src/main/java,**/surefire-logger-api/src/main/java,**/surefire-providers/**/src/main/java,**/surefire-report-parser/src/main/java' - excludes: null
[2020-01-12T05:37:32.947Z] [TASKS] Found 0 files to scan for tasks
[2020-01-12T05:37:32.947Z] [TASKS] Found 0 open tasks.
[2020-01-12T05:37:32.947Z] Skipping warnings blame since pipelines do not have an SCM link.%n
[2020-01-12T05:37:32.985Z] [TASKS] Computing warning deltas based on reference build #23
[Pipeline] jacoco
[2020-01-12T05:37:33.172Z] [JaCoCo plugin] Collecting JaCoCo coverage data...
[2020-01-12T05:37:33.172Z] [JaCoCo plugin] **/*.exec;**/maven-failsafe-plugin/target/classes,**/maven-surefire-common/target/classes,**/maven-surefire-plugin/target/classes,**/maven-surefire-report-plugin/target/classes,**/surefire-api/target/classes,**/surefire-booter/target/classes,**/surefire-extensions-api/target/classes,**/surefire-grouper/target/classes,**/surefire-its/target/classes,**/surefire-logger-api/target/classes,**/surefire-providers/**/target/classes,**/surefire-report-parser/target/classes;**/maven-failsafe-plugin/src/main/java,**/maven-surefire-common/src/main/java,**/maven-surefire-plugin/src/main/java,**/maven-surefire-report-plugin/src/main/java,**/surefire-api/src/main/java,**/surefire-booter/src/main/java,**/surefire-extensions-api/src/main/java,**/surefire-grouper/src/main/java,**/surefire-its/src/main/java,**/surefire-logger-api/src/main/java,**/surefire-providers/**/src/main/java,**/surefire-report-parser/src/main/java; locations are configured
[2020-01-12T05:37:33.770Z] [JaCoCo plugin] Number of found exec files for pattern **/*.exec: 0
[2020-01-12T05:37:35.040Z] [JaCoCo plugin] Saving matched execfiles:  
[2020-01-12T05:37:35.363Z] [JaCoCo plugin] Saving matched class directories for class-pattern: **/maven-failsafe-plugin/target/classes,**/maven-surefire-common/target/classes,**/maven-surefire-plugin/target/classes,**/maven-surefire-report-plugin/target/classes,**/surefire-api/target/classes,**/surefire-booter/target/classes,**/surefire-extensions-api/target/classes,**/surefire-grouper/target/classes,**/surefire-its/target/classes,**/surefire-logger-api/target/classes,**/surefire-providers/**/target/classes,**/surefire-report-parser/target/classes:
[2020-01-12T05:37:35.857Z] [JaCoCo plugin]  - /home/jenkins/jenkins-slave/workspace/maven2surefire-jvm-communication@2/maven-failsafe-plugin/target/classes 4 files
[2020-01-12T05:37:36.020Z] [JaCoCo plugin]  - /home/jenkins/jenkins-slave/workspace/maven2surefire-jvm-communication@2/maven-surefire-common/target/classes 160 files
[2020-01-12T05:37:36.191Z] [JaCoCo plugin]  - /home/jenkins/jenkins-slave/workspace/maven2surefire-jvm-communication@2/maven-surefire-plugin/target/classes 2 files
[2020-01-12T05:37:36.404Z] [JaCoCo plugin]  - /home/jenkins/jenkins-slave/workspace/maven2surefire-jvm-communication@2/maven-surefire-report-plugin/target/classes 10 files
[2020-01-12T05:37:36.599Z] [JaCoCo plugin]  - /home/jenkins/jenkins-slave/workspace/maven2surefire-jvm-communication@2/surefire-api/target/classes 94 files
[2020-01-12T05:37:36.771Z] [JaCoCo plugin]  - /home/jenkins/jenkins-slave/workspace/maven2surefire-jvm-communication@2/surefire-booter/target/classes 49 files
[2020-01-12T05:37:36.948Z] [JaCoCo plugin]  - /home/jenkins/jenkins-slave/workspace/maven2surefire-jvm-communication@2/surefire-extensions-api/target/classes 23 files
[2020-01-12T05:37:37.178Z] [JaCoCo plugin]  - /home/jenkins/jenkins-slave/workspace/maven2surefire-jvm-communication@2/surefire-grouper/target/classes 17 files
[2020-01-12T05:37:37.342Z] [JaCoCo plugin]  - /home/jenkins/jenkins-slave/workspace/maven2surefire-jvm-communication@2/surefire-its/target/classes 0 files
[2020-01-12T05:37:37.507Z] [JaCoCo plugin]  - /home/jenkins/jenkins-slave/workspace/maven2surefire-jvm-communication@2/surefire-logger-api/target/classes 6 files
[2020-01-12T05:37:37.669Z] [JaCoCo plugin]  - /home/jenkins/jenkins-slave/workspace/maven2surefire-jvm-communication@2/surefire-providers/common-java5/target/classes 5 files
[2020-01-12T05:37:37.840Z] [JaCoCo plugin]  - /home/jenkins/jenkins-slave/workspace/maven2surefire-jvm-communication@2/surefire-providers/common-junit3/target/classes 2 files
[2020-01-12T05:37:38.007Z] [JaCoCo plugin]  - /home/jenkins/jenkins-slave/workspace/maven2surefire-jvm-communication@2/surefire-providers/common-junit4/target/classes 13 files
[2020-01-12T05:37:38.174Z] [JaCoCo plugin]  - /home/jenkins/jenkins-slave/workspace/maven2surefire-jvm-communication@2/surefire-providers/common-junit48/target/classes 10 files
[2020-01-12T05:37:38.340Z] [JaCoCo plugin]  - /home/jenkins/jenkins-slave/workspace/maven2surefire-jvm-communication@2/surefire-providers/surefire-junit-platform/target/classes 5 files
[2020-01-12T05:37:38.504Z] [JaCoCo plugin]  - /home/jenkins/jenkins-slave/workspace/maven2surefire-jvm-communication@2/surefire-providers/surefire-junit3/target/classes 7 files
[2020-01-12T05:37:38.699Z] [JaCoCo plugin]  - /home/jenkins/jenkins-slave/workspace/maven2surefire-jvm-communication@2/surefire-providers/surefire-junit4/target/classes 4 files
[2020-01-12T05:37:38.863Z] [JaCoCo plugin]  - /home/jenkins/jenkins-slave/workspace/maven2surefire-jvm-communication@2/surefire-providers/surefire-junit47/target/classes 53 files
[2020-01-12T05:37:39.042Z] [JaCoCo plugin]  - /home/jenkins/jenkins-slave/workspace/maven2surefire-jvm-communication@2/surefire-providers/surefire-testng-utils/target/classes 6 files
[2020-01-12T05:37:39.205Z] [JaCoCo plugin]  - /home/jenkins/jenkins-slave/workspace/maven2surefire-jvm-communication@2/surefire-providers/surefire-testng/target/classes 23 files
[2020-01-12T05:37:39.817Z] [JaCoCo plugin]  - /home/jenkins/jenkins-slave/workspace/maven2surefire-jvm-communication@2/surefire-report-parser/target/classes 4 files
[2020-01-12T05:37:39.817Z] [JaCoCo plugin] Saving matched source directories for source-pattern: **/maven-failsafe-plugin/src/main/java,**/maven-surefire-common/src/main/java,**/maven-surefire-plugin/src/main/java,**/maven-surefire-report-plugin/src/main/java,**/surefire-api/src/main/java,**/surefire-booter/src/main/java,**/surefire-extensions-api/src/main/java,**/surefire-grouper/src/main/java,**/surefire-its/src/main/java,**/surefire-logger-api/src/main/java,**/surefire-providers/**/src/main/java,**/surefire-report-parser/src/main/java:
[2020-01-12T05:37:39.817Z] [JaCoCo plugin] Source Inclusions: **/*.java
[2020-01-12T05:37:39.985Z] [JaCoCo plugin] Source Exclusions:
[2020-01-12T05:37:40.227Z] [JaCoCo plugin] - /home/jenkins/jenkins-slave/workspace/maven2surefire-jvm-communication@2/maven-failsafe-plugin/src/main/java 3 files
[2020-01-12T05:37:40.474Z] [JaCoCo plugin] - /home/jenkins/jenkins-slave/workspace/maven2surefire-jvm-communication@2/maven-surefire-common/src/main/java 96 files
[2020-01-12T05:37:40.642Z] [JaCoCo plugin] - /home/jenkins/jenkins-slave/workspace/maven2surefire-jvm-communication@2/maven-surefire-plugin/src/main/java 1 files
[2020-01-12T05:37:40.844Z] [JaCoCo plugin] - /home/jenkins/jenkins-slave/workspace/maven2surefire-jvm-communication@2/maven-surefire-report-plugin/src/main/java 7 files
[2020-01-12T05:37:41.031Z] [JaCoCo plugin] - /home/jenkins/jenkins-slave/workspace/maven2surefire-jvm-communication@2/surefire-api/src/main/java 74 files
[2020-01-12T05:37:41.199Z] [JaCoCo plugin] - /home/jenkins/jenkins-slave/workspace/maven2surefire-jvm-communication@2/surefire-booter/src/main/java 30 files
[2020-01-12T05:37:41.362Z] [JaCoCo plugin] - /home/jenkins/jenkins-slave/workspace/maven2surefire-jvm-communication@2/surefire-extensions-api/src/main/java 21 files
[2020-01-12T05:37:41.526Z] [JaCoCo plugin] - /home/jenkins/jenkins-slave/workspace/maven2surefire-jvm-communication@2/surefire-grouper/src/main/java 6 files
[2020-01-12T05:37:41.689Z] [JaCoCo plugin] - /home/jenkins/jenkins-slave/workspace/maven2surefire-jvm-communication@2/surefire-logger-api/src/main/java 6 files
[2020-01-12T05:37:41.851Z] [JaCoCo plugin] - /home/jenkins/jenkins-slave/workspace/maven2surefire-jvm-communication@2/surefire-providers/common-java5/src/main/java 5 files
[2020-01-12T05:37:42.018Z] [JaCoCo plugin] - /home/jenkins/jenkins-slave/workspace/maven2surefire-jvm-communication@2/surefire-providers/common-junit3/src/main/java 2 files
[2020-01-12T05:37:42.185Z] [JaCoCo plugin] - /home/jenkins/jenkins-slave/workspace/maven2surefire-jvm-communication@2/surefire-providers/common-junit4/src/main/java 10 files
[2020-01-12T05:37:42.349Z] [JaCoCo plugin] - /home/jenkins/jenkins-slave/workspace/maven2surefire-jvm-communication@2/surefire-providers/common-junit48/src/main/java 10 files
[2020-01-12T05:37:42.514Z] [JaCoCo plugin] - /home/jenkins/jenkins-slave/workspace/maven2surefire-jvm-communication@2/surefire-providers/surefire-junit-platform/src/main/java 4 files
[2020-01-12T05:37:42.677Z] [JaCoCo plugin] - /home/jenkins/jenkins-slave/workspace/maven2surefire-jvm-communication@2/surefire-providers/surefire-junit3/src/main/java 6 files
[2020-01-12T05:37:42.874Z] [JaCoCo plugin] - /home/jenkins/jenkins-slave/workspace/maven2surefire-jvm-communication@2/surefire-providers/surefire-junit4/src/main/java 2 files
[2020-01-12T05:37:43.037Z] [JaCoCo plugin] - /home/jenkins/jenkins-slave/workspace/maven2surefire-jvm-communication@2/surefire-providers/surefire-junit47/src/main/java 39 files
[2020-01-12T05:37:43.208Z] [JaCoCo plugin] - /home/jenkins/jenkins-slave/workspace/maven2surefire-jvm-communication@2/surefire-providers/surefire-testng-utils/src/main/java 6 files
[2020-01-12T05:37:43.371Z] [JaCoCo plugin] - /home/jenkins/jenkins-slave/workspace/maven2surefire-jvm-communication@2/surefire-providers/surefire-testng/src/main/java 17 files
[2020-01-12T05:37:43.371Z] [JaCoCo plugin] - /home/jenkins/jenkins-slave/workspace/maven2surefire-jvm-communication@2/surefire-report-parser/src/main/java 4 files
[2020-01-12T05:37:43.371Z] [JaCoCo plugin] Loading inclusions files..
[2020-01-12T05:37:43.371Z] [JaCoCo plugin] inclusions: []
[2020-01-12T05:37:43.371Z] [JaCoCo plugin] exclusions: []
[2020-01-12T05:37:43.474Z] [JaCoCo plugin] Thresholds: JacocoHealthReportThresholds [minClass=0, maxClass=0, minMethod=0, maxMethod=0, minLine=0, maxLine=0, minBranch=0, maxBranch=0, minInstruction=0, maxInstruction=0, minComplexity=0, maxComplexity=0]
[2020-01-12T05:37:43.474Z] [JaCoCo plugin] Publishing the results..
[2020-01-12T05:37:43.572Z] [JaCoCo plugin] Loading packages..
[2020-01-12T05:37:43.580Z] [JaCoCo plugin] Done.
[2020-01-12T05:37:43.580Z] [JaCoCo plugin] Overall coverage: class: 0, method: 0, line: 0, branch: 0, instruction: 0
[Pipeline] junit
[2020-01-12T05:37:43.772Z] Recording test results
[2020-01-12T05:37:44.404Z] None of the test reports contained any result
[Pipeline] cleanWs
[2020-01-12T05:37:44.735Z] [WS-CLEANUP] Deleting project workspace...
[2020-01-12T05:37:44.735Z] [WS-CLEANUP] Deferred wipeout is used...
[2020-01-12T05:37:45.052Z] [WS-CLEANUP] done
[Pipeline] }
[Pipeline] // ws
[Pipeline] }
[Pipeline] // timestamps
[Pipeline] }
[Pipeline] // node
[Pipeline] }
Aborted by tibordigana
[Pipeline] // node
[Pipeline] // node
[Pipeline] // node
[Pipeline] // node
[Pipeline] // node
[Pipeline] }
Failed in branch windows-jdk14-maven3.6.x
[Pipeline] }
Failed in branch windows-jdk13-maven3.6.x
[Pipeline] }
Failed in branch windows-jdk11-maven3.6.x
[Pipeline] }
Failed in branch windows-jdk8-maven3.6.x
[Pipeline] }
Failed in branch windows-jdk7-maven3.6.x
[Pipeline] // parallel
[Pipeline] echo
org.jenkinsci.plugins.workflow.steps.FlowInterruptedException: org.jenkinsci.plugins.workflow.steps.FlowInterruptedException
[Pipeline] echo
Build result: FAILURE
[Pipeline] jiraIssueSelector
[Pipeline] echo
The authors of changes [tibordigana].
[Pipeline] echo
Sending email ...
[Pipeline] emailext
Reply | Threaded
Open this post in threaded view
|

Build succeeded in Jenkins: Maven TLP » maven-surefire » maven2surefire-jvm-communication #27

Apache Jenkins Server-2