Build failed in Jenkins: Maven TLP » maven-surefire » master #91

classic Classic list List threaded Threaded
2 messages Options
Reply | Threaded
Open this post in threaded view
|

Build failed in Jenkins: Maven TLP » maven-surefire » master #91

Apache Jenkins Server-2
See https://builds.apache.org/job/maven-box/job/maven-surefire/job/master/91/

Changes:

* [SUREFIRE-1590] Deploy multiple versions of Report XSD
* [SUREFIRE-1590] Deploy multiple versions of Report XSD
* [SUREFIRE-1590] Deploy multiple versions of Report XSD
* [SUREFIRE-1590] Deploy multiple versions of Report XSD
* [SUREFIRE-1590] Deploy multiple versions of Report XSD
* [SUREFIRE-1590] Deploy multiple versions of Report XSD
* [SUREFIRE-1590] Deploy multiple versions of Report XSD
* [SUREFIRE-1590] Deploy multiple versions of Report XSD
* [SUREFIRE-1590] Deploy multiple versions of Report XSD
* [SUREFIRE-1590] Deploy multiple versions of Report XSD
* [SUREFIRE-1590] Deploy multiple versions of Report XSD
* [SUREFIRE-1590] Deploy multiple versions of Report XSD
* [SUREFIRE-1590] Deploy multiple versions of Report XSD
* [SUREFIRE-1590] Deploy multiple versions of Report XSD
* [SUREFIRE-1590] Deploy multiple versions of Report XSD
* [SUREFIRE-1590] Deploy multiple versions of Report XSD
* [SUREFIRE-1590] Deploy multiple versions of Report XSD
* [SUREFIRE-1590] Deploy multiple versions of Report XSD

All tests passed

Build log:
[...truncated 44.96 MB...]
[windows-jdk7-maven3.2.x] Running org.apache.maven.surefire.its.Java9FullApiIT
[windows-jdk7-maven3.2.x] Tests run: 3, Failures: 0, Errors: 0, Skipped: 3, Time elapsed: 0.001 sec
[windows-jdk7-maven3.2.x]
[windows-jdk7-maven3.2.x] Results :
[windows-jdk7-maven3.2.x]
[windows-jdk7-maven3.2.x] Tests run: 781, Failures: 0, Errors: 0, Skipped: 163
[windows-jdk7-maven3.2.x]
[windows-jdk7-maven3.2.x] [INFO]
[windows-jdk7-maven3.2.x] [INFO] --- maven-checkstyle-plugin:3.0.0:check (checkstyle-check) @ surefire-its ---
[windows-jdk7-maven3.2.x] [INFO]
[windows-jdk7-maven3.2.x] [INFO] --- maven-failsafe-plugin:2.12.4:verify (default) @ surefire-its ---
[windows-jdk7-maven3.2.x] [INFO] Failsafe report directory: F:\jenkins\jenkins-slave\workspace\n-box_maven-surefire_master-CK52RLZV7R5PVUUYTYVCEEENMKBFPX7NV3GV6YB4YGV3EM4ZIPOQ@2\surefire-its\target\failsafe-reports
[windows-jdk7-maven3.2.x] [INFO]
[windows-jdk7-maven3.2.x] [INFO] --- maven-install-plugin:2.5.2:install (default-install) @ surefire-its ---
[windows-jdk7-maven3.2.x] [INFO] Skipping artifact installation
[windows-jdk7-maven3.2.x] [INFO]
[windows-jdk7-maven3.2.x] [INFO] --- jacoco-maven-plugin:0.8.2:report (default-cli) @ surefire-its ---
[windows-jdk7-maven3.2.x] [INFO] Skipping JaCoCo execution because property jacoco.skip is set.
[windows-jdk7-maven3.2.x] [INFO] ------------------------------------------------------------------------
[windows-jdk7-maven3.2.x] [INFO] Reactor Summary:
[windows-jdk7-maven3.2.x] [INFO]
[windows-jdk7-maven3.2.x] [INFO] Apache Maven Surefire .............................. SUCCESS [ 55.776 s]
[windows-jdk7-maven3.2.x] [INFO] SureFire Logger API ................................ SUCCESS [ 11.770 s]
[windows-jdk7-maven3.2.x] [INFO] SureFire API ....................................... SUCCESS [ 20.108 s]
[windows-jdk7-maven3.2.x] [INFO] SureFire Booter .................................... SUCCESS [ 19.036 s]
[windows-jdk7-maven3.2.x] [INFO] Maven Surefire Test-Grouping Support ............... SUCCESS [ 11.380 s]
[windows-jdk7-maven3.2.x] [INFO] SureFire Providers ................................. SUCCESS [  1.499 s]
[windows-jdk7-maven3.2.x] [INFO] Shared JUnit3 Provider Code ........................ SUCCESS [  5.995 s]
[windows-jdk7-maven3.2.x] [INFO] Shared Java 5 Provider Base ........................ SUCCESS [  7.778 s]
[windows-jdk7-maven3.2.x] [INFO] Shared JUnit4 Provider Code ........................ SUCCESS [  7.829 s]
[windows-jdk7-maven3.2.x] [INFO] Shared JUnit48 Provider Code ....................... SUCCESS [  8.774 s]
[windows-jdk7-maven3.2.x] [INFO] SureFire JUnit Runner .............................. SUCCESS [  6.714 s]
[windows-jdk7-maven3.2.x] [INFO] SureFire JUnit4 Runner ............................. SUCCESS [  6.845 s]
[windows-jdk7-maven3.2.x] [INFO] Maven Surefire Common .............................. SUCCESS [ 42.012 s]
[windows-jdk7-maven3.2.x] [INFO] SureFire JUnitCore Runner .......................... SUCCESS [02:22 min]
[windows-jdk7-maven3.2.x] [INFO] SureFire JUnit Platform Runner ..................... SUCCESS [ 11.954 s]
[windows-jdk7-maven3.2.x] [INFO] SureFire TestNG Utils .............................. SUCCESS [  7.679 s]
[windows-jdk7-maven3.2.x] [INFO] SureFire TestNG Runner ............................. SUCCESS [  7.936 s]
[windows-jdk7-maven3.2.x] [INFO] ShadeFire JUnit3 Provider .......................... SUCCESS [  2.409 s]
[windows-jdk7-maven3.2.x] [INFO] Surefire Report Parser ............................. SUCCESS [  8.610 s]
[windows-jdk7-maven3.2.x] [INFO] Maven Surefire Plugin .............................. SUCCESS [ 18.126 s]
[windows-jdk7-maven3.2.x] [INFO] Maven Failsafe Plugin .............................. SUCCESS [01:53 min]
[windows-jdk7-maven3.2.x] [INFO] Maven Surefire Report Plugin ....................... SUCCESS [ 23.111 s]
[windows-jdk7-maven3.2.x] [INFO] Maven Surefire Integration Tests ................... SUCCESS [  01:29 h]
[windows-jdk7-maven3.2.x] [INFO] ------------------------------------------------------------------------
[windows-jdk7-maven3.2.x] [INFO] BUILD SUCCESS
[windows-jdk7-maven3.2.x] [INFO] ------------------------------------------------------------------------
[windows-jdk7-maven3.2.x] [INFO] Total time: 01:38 h
[windows-jdk7-maven3.2.x] [INFO] Finished at: 2018-11-27T16:29:18-08:00
[windows-jdk7-maven3.2.x] [INFO] Final Memory: 52M/173M
[windows-jdk7-maven3.2.x] [INFO] ------------------------------------------------------------------------
[Pipeline] [windows-jdk7-maven3.2.x] }
[Pipeline] [windows-jdk7-maven3.2.x] // withEnv
[Pipeline] [windows-jdk7-maven3.2.x] }
[Pipeline] [windows-jdk7-maven3.2.x] // stage
[Pipeline] [windows-jdk7-maven3.2.x] stage
[Pipeline] [windows-jdk7-maven3.2.x] { (reporting windows-jdk7-maven3.2.x)
[Pipeline] [windows-jdk7-maven3.2.x] fileExists
[Pipeline] [windows-jdk7-maven3.2.x] zip
[windows-jdk7-maven3.2.x] Writing zip file of f:\jenkins\jenkins-slave\workspace\n-box_maven-surefire_master-CK52RLZV7R5PVUUYTYVCEEENMKBFPX7NV3GV6YB4YGV3EM4ZIPOQ@2\maven-failsafe-plugin\target\it to f:\jenkins\jenkins-slave\workspace\n-box_maven-surefire_master-CK52RLZV7R5PVUUYTYVCEEENMKBFPX7NV3GV6YB4YGV3EM4ZIPOQ@2\maven-failsafe-plugin--windows-jdk7-maven3.2.x.zip
[windows-jdk7-maven3.2.x] Zipped 84 entries.
[windows-jdk7-maven3.2.x] Archiving f:\jenkins\jenkins-slave\workspace\n-box_maven-surefire_master-CK52RLZV7R5PVUUYTYVCEEENMKBFPX7NV3GV6YB4YGV3EM4ZIPOQ@2\maven-failsafe-plugin--windows-jdk7-maven3.2.x.zip
[Pipeline] [windows-jdk7-maven3.2.x] fileExists
[Pipeline] [windows-jdk7-maven3.2.x] zip
[windows-jdk7-maven3.2.x] Writing zip file of f:\jenkins\jenkins-slave\workspace\n-box_maven-surefire_master-CK52RLZV7R5PVUUYTYVCEEENMKBFPX7NV3GV6YB4YGV3EM4ZIPOQ@2\surefire-its\target to f:\jenkins\jenkins-slave\workspace\n-box_maven-surefire_master-CK52RLZV7R5PVUUYTYVCEEENMKBFPX7NV3GV6YB4YGV3EM4ZIPOQ@2\surefire-its--windows-jdk7-maven3.2.x.zip
[windows-jdk8-maven3.5.x] Running org.apache.maven.surefire.its.jiras.Surefire705ParallelForkTimeoutIT
[windows-jdk8-maven3.5.x] Tests run: 1, Failures: 0, Errors: 0, Skipped: 0, Time elapsed: 10.962 sec
[windows-jdk8-maven3.5.x] Running org.apache.maven.surefire.its.jiras.Surefire733AllOverrridesCapturedIT
[windows-jdk8-maven3.5.x] Tests run: 1, Failures: 0, Errors: 0, Skipped: 0, Time elapsed: 8.669 sec
[windows-jdk7-maven3.2.x] Zipped 16020 entries.
[windows-jdk7-maven3.2.x] Archiving f:\jenkins\jenkins-slave\workspace\n-box_maven-surefire_master-CK52RLZV7R5PVUUYTYVCEEENMKBFPX7NV3GV6YB4YGV3EM4ZIPOQ@2\surefire-its--windows-jdk7-maven3.2.x.zip
[Pipeline] [windows-jdk7-maven3.2.x] archiveArtifacts
[windows-jdk7-maven3.2.x] Archiving artifacts
[windows-jdk8-maven3.5.x] Running org.apache.maven.surefire.its.jiras.Surefire735ForkFailWithRedirectConsoleOutputIT
[windows-jdk8-maven3.5.x] Tests run: 2, Failures: 0, Errors: 0, Skipped: 0, Time elapsed: 14.84 sec
[Pipeline] [windows-jdk7-maven3.2.x] }
[Pipeline] [windows-jdk7-maven3.2.x] // stage
[Pipeline] [windows-jdk7-maven3.2.x] stage
[Pipeline] [windows-jdk7-maven3.2.x] { (cleanup windows-jdk7-maven3.2.x)
[Pipeline] [windows-jdk7-maven3.2.x] cleanWs
[windows-jdk7-maven3.2.x] [WS-CLEANUP] Deleting project workspace...[WS-CLEANUP] done
[Pipeline] [windows-jdk7-maven3.2.x] }
[Pipeline] [windows-jdk7-maven3.2.x] // stage
[Pipeline] [windows-jdk7-maven3.2.x] }
[Pipeline] [windows-jdk7-maven3.2.x] // timestamps
[Pipeline] [windows-jdk7-maven3.2.x] }
[Pipeline] [windows-jdk7-maven3.2.x] // node
[Pipeline] [windows-jdk7-maven3.2.x] }
[windows-jdk8-maven3.5.x] Running org.apache.maven.surefire.its.jiras.Surefire740TruncatedCommaIT
[windows-jdk8-maven3.5.x] Tests run: 1, Failures: 0, Errors: 0, Skipped: 0, Time elapsed: 7.743 sec
[windows-jdk8-maven3.5.x] Running org.apache.maven.surefire.its.jiras.Surefire747MethodParallelWithSuiteCountIT
[windows-jdk8-maven3.5.x] Tests run: 2, Failures: 0, Errors: 0, Skipped: 0, Time elapsed: 28.059 sec
[windows-jdk8-maven3.5.x] Running org.apache.maven.surefire.its.jiras.Surefire772BothReportsIT
[windows-jdk8-maven3.5.x] Tests run: 3, Failures: 0, Errors: 0, Skipped: 0, Time elapsed: 15.316 sec
[windows-jdk8-maven3.5.x] Running org.apache.maven.surefire.its.jiras.Surefire772NoFailsafeReportsIT
[windows-jdk8-maven3.5.x] Tests run: 4, Failures: 0, Errors: 0, Skipped: 0, Time elapsed: 20.876 sec
[windows-jdk8-maven3.5.x] Running org.apache.maven.surefire.its.jiras.Surefire772NoSurefireReportsIT
[windows-jdk8-maven3.5.x] Tests run: 4, Failures: 0, Errors: 0, Skipped: 0, Time elapsed: 20.515 sec
[windows-jdk8-maven3.5.x] Running org.apache.maven.surefire.its.jiras.Surefire772SpecifiedReportsIT
[windows-jdk8-maven3.5.x] Tests run: 3, Failures: 0, Errors: 0, Skipped: 0, Time elapsed: 15.617 sec
[windows-jdk8-maven3.5.x] Running org.apache.maven.surefire.its.jiras.Surefire801ForkModeNoneClassLoaderIT
[windows-jdk8-maven3.5.x] Tests run: 1, Failures: 0, Errors: 0, Skipped: 0, Time elapsed: 6.502 sec
[windows-jdk8-maven3.5.x] Running org.apache.maven.surefire.its.jiras.Surefire803MultiFailsafeExecsIT
[windows-jdk8-maven3.5.x] Tests run: 2, Failures: 0, Errors: 0, Skipped: 0, Time elapsed: 30.853 sec
[windows-jdk8-maven3.5.x] Running org.apache.maven.surefire.its.jiras.Surefire806SpecifiedTestControlsIT
[windows-jdk8-maven3.5.x] Tests run: 3, Failures: 0, Errors: 0, Skipped: 2, Time elapsed: 8.232 sec
[windows-jdk8-maven3.5.x] Running org.apache.maven.surefire.its.jiras.Surefire809GroupExpressionsIT
[windows-jdk8-maven3.5.x] Tests run: 6, Failures: 0, Errors: 0, Skipped: 0, Time elapsed: 50.489 sec
[windows-jdk8-maven3.5.x] Running org.apache.maven.surefire.its.jiras.Surefire812Log4JClassLoaderIT
[windows-jdk8-maven3.5.x] Tests run: 1, Failures: 0, Errors: 0, Skipped: 0, Time elapsed: 9.765 sec
[windows-jdk8-maven3.5.x] Running org.apache.maven.surefire.its.jiras.Surefire817SystemExitIT
[windows-jdk8-maven3.5.x] Tests run: 1, Failures: 0, Errors: 0, Skipped: 0, Time elapsed: 9.126 sec
[windows-jdk8-maven3.5.x] Running org.apache.maven.surefire.its.jiras.Surefire818NpeIgnoresTestsIT
[windows-jdk8-maven3.5.x] Tests run: 1, Failures: 0, Errors: 0, Skipped: 0, Time elapsed: 10.614 sec
[windows-jdk8-maven3.5.x] Running org.apache.maven.surefire.its.jiras.Surefire828EmptyGroupExprIT
[windows-jdk8-maven3.5.x] Tests run: 4, Failures: 0, Errors: 0, Skipped: 0, Time elapsed: 35.262 sec
[windows-jdk8-maven3.5.x] Running org.apache.maven.surefire.its.jiras.Surefire832ProviderSelectionIT
[windows-jdk8-maven3.5.x] Tests run: 1, Failures: 0, Errors: 0, Skipped: 0, Time elapsed: 9.14 sec
[windows-jdk8-maven3.5.x] Running org.apache.maven.surefire.its.jiras.Surefire839TestWithoutCategoriesIT
[windows-jdk8-maven3.5.x] Tests run: 2, Failures: 0, Errors: 0, Skipped: 0, Time elapsed: 17.644 sec
[windows-jdk8-maven3.5.x] Running org.apache.maven.surefire.its.jiras.Surefire847AdditionalFailureIT
[windows-jdk8-maven3.5.x] Tests run: 1, Failures: 0, Errors: 0, Skipped: 0, Time elapsed: 10.778 sec
[windows-jdk8-maven3.5.x] Running org.apache.maven.surefire.its.jiras.Surefire855AllowFailsafeUseArtifactFileIT
[windows-jdk8-maven3.5.x] Tests run: 4, Failures: 0, Errors: 0, Skipped: 0, Time elapsed: 71.466 sec
[windows-jdk8-maven3.5.x] Running org.apache.maven.surefire.its.jiras.Surefire901MIssingResultfileWhenNoTestsIT
[windows-jdk8-maven3.5.x] Tests run: 1, Failures: 0, Errors: 0, Skipped: 0, Time elapsed: 7.358 sec
[windows-jdk8-maven3.5.x] Running org.apache.maven.surefire.its.jiras.Surefire907PerThreadWithoutThreadCountIT
[windows-jdk8-maven3.5.x] Tests run: 1, Failures: 0, Errors: 0, Skipped: 0, Time elapsed: 6.362 sec
[windows-jdk8-maven3.5.x] Running org.apache.maven.surefire.its.jiras.Surefire920TestFailureIgnoreWithTimeoutIT
[windows-jdk8-maven3.5.x] Tests run: 2, Failures: 0, Errors: 0, Skipped: 0, Time elapsed: 18.803 sec
[windows-jdk8-maven3.5.x] Running org.apache.maven.surefire.its.jiras.Surefire926FailureWith2ProvidersIT
[windows-jdk8-maven3.5.x] Tests run: 1, Failures: 0, Errors: 0, Skipped: 0, Time elapsed: 12.341 sec
[windows-jdk8-maven3.5.x] Running org.apache.maven.surefire.its.jiras.Surefire930TestNgSuiteXmlIT
[windows-jdk8-maven3.5.x] Tests run: 1, Failures: 0, Errors: 0, Skipped: 0, Time elapsed: 10.298 sec
[windows-jdk8-maven3.5.x] Running org.apache.maven.surefire.its.jiras.Surefire943ReportContentIT
[windows-jdk8-maven3.5.x] Tests run: 2, Failures: 0, Errors: 0, Skipped: 0, Time elapsed: 24.743 sec
[windows-jdk8-maven3.5.x] Running org.apache.maven.surefire.its.jiras.Surefire946KillMainProcessInReusableForkIT
[windows-jdk8-maven3.5.x] Tests run: 3, Failures: 0, Errors: 0, Skipped: 0, Time elapsed: 27.921 sec
[windows-jdk8-maven3.5.x] Running org.apache.maven.surefire.its.jiras.Surefire972BizarreNoClassDefIT
[windows-jdk8-maven3.5.x] Tests run: 1, Failures: 0, Errors: 0, Skipped: 0, Time elapsed: 13.571 sec
[windows-jdk8-maven3.5.x] Running org.apache.maven.surefire.its.jiras.Surefire975DefaultVMEncodingIT
[windows-jdk8-maven3.5.x] Tests run: 1, Failures: 0, Errors: 0, Skipped: 0, Time elapsed: 8.561 sec
[windows-jdk8-maven3.5.x] Running org.apache.maven.surefire.its.jiras.Surefire979WrongClassLoaderIT
[windows-jdk8-maven3.5.x] Tests run: 1, Failures: 0, Errors: 0, Skipped: 0, Time elapsed: 8.532 sec
[windows-jdk8-maven3.5.x] Running org.apache.maven.surefire.its.jiras.Surefire985ParameterizedRunnerAndCategoriesIT
[windows-jdk8-maven3.5.x] Tests run: 1, Failures: 0, Errors: 0, Skipped: 0, Time elapsed: 6.596 sec
[windows-jdk8-maven3.5.x] Running org.apache.maven.surefire.its.jiras.Surefire995CategoryInheritanceIT
[windows-jdk8-maven3.5.x] Tests run: 5, Failures: 0, Errors: 0, Skipped: 0, Time elapsed: 35.1 sec
[windows-jdk8-maven3.5.x] Running org.apache.maven.surefire.its.jiras.Surefire1265Java9IT
[windows-jdk8-maven3.5.x] Tests run: 1, Failures: 0, Errors: 0, Skipped: 1, Time elapsed: 0.001 sec
[windows-jdk8-maven3.5.x] Running org.apache.maven.surefire.its.jiras.Surefire1295AttributeJvmCrashesToTestsIT
[windows-jdk8-maven3.5.x] Tests run: 9, Failures: 0, Errors: 0, Skipped: 9, Time elapsed: 0.002 sec
[windows-jdk8-maven3.5.x] Running org.apache.maven.surefire.its.TestMultipleMethodPatternsTestNGIT
[windows-jdk8-maven3.5.x] Tests run: 90, Failures: 0, Errors: 0, Skipped: 41, Time elapsed: 339.341 sec
[windows-jdk8-maven3.5.x] Running org.apache.maven.surefire.its.Java9FullApiIT
[windows-jdk8-maven3.5.x] Tests run: 3, Failures: 0, Errors: 0, Skipped: 3, Time elapsed: 0.009 sec
[windows-jdk8-maven3.5.x] Running org.apache.maven.surefire.its.TestMultipleMethodPatternsIT
[windows-jdk8-maven3.5.x] Tests run: 180, Failures: 0, Errors: 0, Skipped: 87, Time elapsed: 632.586 sec
[windows-jdk8-maven3.5.x] Running org.apache.maven.surefire.its.ModulePathIT
[windows-jdk8-maven3.5.x] Tests run: 2, Failures: 0, Errors: 0, Skipped: 2, Time elapsed: 0.001 sec
[windows-jdk8-maven3.5.x]
[windows-jdk8-maven3.5.x] Results :
[windows-jdk8-maven3.5.x]
[windows-jdk8-maven3.5.x] Tests run: 781, Failures: 0, Errors: 0, Skipped: 147
[windows-jdk8-maven3.5.x]
[windows-jdk8-maven3.5.x] [INFO]
[windows-jdk8-maven3.5.x] [INFO] --- maven-checkstyle-plugin:3.0.0:check (checkstyle-check) @ surefire-its ---
[windows-jdk8-maven3.5.x] [INFO]
[windows-jdk8-maven3.5.x] [INFO] --- maven-failsafe-plugin:2.12.4:verify (default) @ surefire-its ---
[windows-jdk8-maven3.5.x] [INFO] Failsafe report directory: F:\jenkins\jenkins-slave\workspace\n-box_maven-surefire_master-CK52RLZV7R5PVUUYTYVCEEENMKBFPX7NV3GV6YB4YGV3EM4ZIPOQ\surefire-its\target\failsafe-reports
[windows-jdk8-maven3.5.x] [INFO]
[windows-jdk8-maven3.5.x] [INFO] --- maven-install-plugin:2.5.2:install (default-install) @ surefire-its ---
[windows-jdk8-maven3.5.x] [INFO] Skipping artifact installation
[windows-jdk8-maven3.5.x] [INFO]
[windows-jdk8-maven3.5.x] [INFO] --- jacoco-maven-plugin:0.8.2:report (default-cli) @ surefire-its ---
[windows-jdk8-maven3.5.x] [INFO] Skipping JaCoCo execution because property jacoco.skip is set.
[windows-jdk8-maven3.5.x] [INFO] ------------------------------------------------------------------------
[windows-jdk8-maven3.5.x] [INFO] Reactor Summary:
[windows-jdk8-maven3.5.x] [INFO]
[windows-jdk8-maven3.5.x] [INFO] Apache Maven Surefire .............................. SUCCESS [ 55.902 s]
[windows-jdk8-maven3.5.x] [INFO] SureFire Logger API ................................ SUCCESS [ 11.886 s]
[windows-jdk8-maven3.5.x] [INFO] SureFire API ....................................... SUCCESS [ 18.958 s]
[windows-jdk8-maven3.5.x] [INFO] SureFire Booter .................................... SUCCESS [ 20.093 s]
[windows-jdk8-maven3.5.x] [INFO] Maven Surefire Test-Grouping Support ............... SUCCESS [ 11.229 s]
[windows-jdk8-maven3.5.x] [INFO] SureFire Providers ................................. SUCCESS [  1.497 s]
[windows-jdk8-maven3.5.x] [INFO] Shared JUnit3 Provider Code ........................ SUCCESS [  6.013 s]
[windows-jdk8-maven3.5.x] [INFO] Shared Java 5 Provider Base ........................ SUCCESS [  7.605 s]
[windows-jdk8-maven3.5.x] [INFO] Shared JUnit4 Provider Code ........................ SUCCESS [  7.993 s]
[windows-jdk8-maven3.5.x] [INFO] Shared JUnit48 Provider Code ....................... SUCCESS [  8.957 s]
[windows-jdk8-maven3.5.x] [INFO] SureFire JUnit Runner .............................. SUCCESS [  6.567 s]
[windows-jdk8-maven3.5.x] [INFO] SureFire JUnit4 Runner ............................. SUCCESS [  6.980 s]
[windows-jdk8-maven3.5.x] [INFO] Maven Surefire Common .............................. SUCCESS [ 39.555 s]
[windows-jdk8-maven3.5.x] [INFO] SureFire JUnitCore Runner .......................... SUCCESS [02:26 min]
[windows-jdk8-maven3.5.x] [INFO] SureFire JUnit Platform Runner ..................... SUCCESS [ 12.182 s]
[windows-jdk8-maven3.5.x] [INFO] SureFire TestNG Utils .............................. SUCCESS [  7.190 s]
[windows-jdk8-maven3.5.x] [INFO] SureFire TestNG Runner ............................. SUCCESS [  7.565 s]
[windows-jdk8-maven3.5.x] [INFO] ShadeFire JUnit3 Provider .......................... SUCCESS [  2.294 s]
[windows-jdk8-maven3.5.x] [INFO] Surefire Report Parser ............................. SUCCESS [  8.372 s]
[windows-jdk8-maven3.5.x] [INFO] Maven Surefire Plugin .............................. SUCCESS [ 17.432 s]
[windows-jdk8-maven3.5.x] [INFO] Maven Failsafe Plugin .............................. SUCCESS [01:53 min]
[windows-jdk8-maven3.5.x] [INFO] Maven Surefire Report Plugin ....................... SUCCESS [ 22.497 s]
[windows-jdk8-maven3.5.x] [INFO] Maven Surefire Integration Tests ................... SUCCESS [  01:39 h]
[windows-jdk8-maven3.5.x] [INFO] ------------------------------------------------------------------------
[windows-jdk8-maven3.5.x] [INFO] BUILD SUCCESS
[windows-jdk8-maven3.5.x] [INFO] ------------------------------------------------------------------------
[windows-jdk8-maven3.5.x] [INFO] Total time: 01:48 h
[windows-jdk8-maven3.5.x] [INFO] Finished at: 2018-11-27T16:39:15-08:00
[windows-jdk8-maven3.5.x] [INFO] Final Memory: 50M/168M
[windows-jdk8-maven3.5.x] [INFO] ------------------------------------------------------------------------
[Pipeline] [windows-jdk8-maven3.5.x] }
[Pipeline] [windows-jdk8-maven3.5.x] // withEnv
[Pipeline] [windows-jdk8-maven3.5.x] }
[Pipeline] [windows-jdk8-maven3.5.x] // stage
[Pipeline] [windows-jdk8-maven3.5.x] stage
[Pipeline] [windows-jdk8-maven3.5.x] { (reporting windows-jdk8-maven3.5.x)
[Pipeline] [windows-jdk8-maven3.5.x] fileExists
[Pipeline] [windows-jdk8-maven3.5.x] zip
[windows-jdk8-maven3.5.x] Writing zip file of f:\jenkins\jenkins-slave\workspace\n-box_maven-surefire_master-CK52RLZV7R5PVUUYTYVCEEENMKBFPX7NV3GV6YB4YGV3EM4ZIPOQ\maven-failsafe-plugin\target\it to f:\jenkins\jenkins-slave\workspace\n-box_maven-surefire_master-CK52RLZV7R5PVUUYTYVCEEENMKBFPX7NV3GV6YB4YGV3EM4ZIPOQ\maven-failsafe-plugin--windows-jdk8-maven3.5.x.zip
[windows-jdk8-maven3.5.x] Zipped 84 entries.
[windows-jdk8-maven3.5.x] Archiving f:\jenkins\jenkins-slave\workspace\n-box_maven-surefire_master-CK52RLZV7R5PVUUYTYVCEEENMKBFPX7NV3GV6YB4YGV3EM4ZIPOQ\maven-failsafe-plugin--windows-jdk8-maven3.5.x.zip
[Pipeline] [windows-jdk8-maven3.5.x] fileExists
[Pipeline] [windows-jdk8-maven3.5.x] zip
[windows-jdk8-maven3.5.x] Writing zip file of f:\jenkins\jenkins-slave\workspace\n-box_maven-surefire_master-CK52RLZV7R5PVUUYTYVCEEENMKBFPX7NV3GV6YB4YGV3EM4ZIPOQ\surefire-its\target to f:\jenkins\jenkins-slave\workspace\n-box_maven-surefire_master-CK52RLZV7R5PVUUYTYVCEEENMKBFPX7NV3GV6YB4YGV3EM4ZIPOQ\surefire-its--windows-jdk8-maven3.5.x.zip
[windows-jdk8-maven3.5.x] Zipped 16145 entries.
[windows-jdk8-maven3.5.x] Archiving f:\jenkins\jenkins-slave\workspace\n-box_maven-surefire_master-CK52RLZV7R5PVUUYTYVCEEENMKBFPX7NV3GV6YB4YGV3EM4ZIPOQ\surefire-its--windows-jdk8-maven3.5.x.zip
[Pipeline] [windows-jdk8-maven3.5.x] archiveArtifacts
[windows-jdk8-maven3.5.x] Archiving artifacts
[Pipeline] [windows-jdk8-maven3.5.x] }
[Pipeline] [windows-jdk8-maven3.5.x] // stage
[Pipeline] [windows-jdk8-maven3.5.x] stage
[Pipeline] [windows-jdk8-maven3.5.x] { (cleanup windows-jdk8-maven3.5.x)
[Pipeline] [windows-jdk8-maven3.5.x] cleanWs
[windows-jdk8-maven3.5.x] [WS-CLEANUP] Deleting project workspace...[WS-CLEANUP] done
[Pipeline] [windows-jdk8-maven3.5.x] }
[Pipeline] [windows-jdk8-maven3.5.x] // stage
[Pipeline] [windows-jdk8-maven3.5.x] }
[Pipeline] [windows-jdk8-maven3.5.x] // timestamps
[Pipeline] [windows-jdk8-maven3.5.x] }
[Pipeline] [windows-jdk8-maven3.5.x] // node
[Pipeline] [windows-jdk8-maven3.5.x] }
[Pipeline] // parallel
[Pipeline] echo
hudson.AbortException: hudson.AbortException: script returned exit code 1
[Pipeline] stage
[Pipeline] { (notifications)
[Pipeline] echo
Build result: FAILURE
[Pipeline] jiraIssueSelector
[Pipeline] emailext
Reply | Threaded
Open this post in threaded view
|

Build succeeded in Jenkins: Maven TLP » maven-surefire » master #92

Apache Jenkins Server-2