Build failed in Jenkins: Maven TLP » maven-surefire » master #89

classic Classic list List threaded Threaded
2 messages Options
Reply | Threaded
Open this post in threaded view
|

Build failed in Jenkins: Maven TLP » maven-surefire » master #89

Apache Jenkins Server-2
See https://builds.apache.org/job/maven-box/job/maven-surefire/job/master/89/

Changes:

* [SUREFIRE-1707] Forked JVM is killed when GC paused the tests for over

All tests passed

Build log:
[...truncated 93261 lines...]
[2019-11-03T12:04:52.942Z] [INFO] Running org.apache.maven.surefire.its.jiras.Surefire920TestFailureIgnoreWithTimeoutIT
[2019-11-03T12:05:07.842Z] [INFO] Tests run: 2, Failures: 0, Errors: 0, Skipped: 0, Time elapsed: 16.976 s - in org.apache.maven.surefire.its.jiras.Surefire920TestFailureIgnoreWithTimeoutIT
[2019-11-03T12:05:07.842Z] [INFO] Running org.apache.maven.surefire.its.jiras.Surefire926FailureWith2ProvidersIT
[2019-11-03T12:05:07.992Z] [INFO] Tests run: 2, Failures: 0, Errors: 0, Skipped: 0, Time elapsed: 16.394 s - in org.apache.maven.surefire.its.jiras.Surefire920TestFailureIgnoreWithTimeoutIT
[2019-11-03T12:05:07.992Z] [INFO] Running org.apache.maven.surefire.its.jiras.Surefire926FailureWith2ProvidersIT
[2019-11-03T12:05:11.207Z] [INFO] Tests run: 1, Failures: 0, Errors: 0, Skipped: 0, Time elapsed: 4.609 s - in org.apache.maven.surefire.its.jiras.Surefire926FailureWith2ProvidersIT
[2019-11-03T12:05:11.207Z] [INFO] Running org.apache.maven.surefire.its.jiras.Surefire930TestNgSuiteXmlIT
[2019-11-03T12:05:12.268Z] [INFO] Tests run: 1, Failures: 0, Errors: 0, Skipped: 0, Time elapsed: 4.447 s - in org.apache.maven.surefire.its.jiras.Surefire926FailureWith2ProvidersIT
[2019-11-03T12:05:12.268Z] [INFO] Running org.apache.maven.surefire.its.jiras.Surefire930TestNgSuiteXmlIT
[2019-11-03T12:05:20.578Z] [INFO] Tests run: 1, Failures: 0, Errors: 0, Skipped: 0, Time elapsed: 8.094 s - in org.apache.maven.surefire.its.jiras.Surefire930TestNgSuiteXmlIT
[2019-11-03T12:05:20.578Z] [INFO] Running org.apache.maven.surefire.its.jiras.Surefire943ReportContentIT
[2019-11-03T12:05:21.303Z] [INFO] Tests run: 1, Failures: 0, Errors: 0, Skipped: 0, Time elapsed: 9.252 s - in org.apache.maven.surefire.its.jiras.Surefire930TestNgSuiteXmlIT
[2019-11-03T12:05:21.303Z] [INFO] Running org.apache.maven.surefire.its.jiras.Surefire943ReportContentIT
[2019-11-03T12:05:59.497Z] [INFO] Tests run: 2, Failures: 0, Errors: 0, Skipped: 0, Time elapsed: 35.038 s - in org.apache.maven.surefire.its.jiras.Surefire943ReportContentIT
[2019-11-03T12:05:59.497Z] [INFO] Running org.apache.maven.surefire.its.jiras.Surefire946KillMainProcessInReusableForkIT
[2019-11-03T12:06:00.211Z] [INFO] Tests run: 2, Failures: 0, Errors: 0, Skipped: 0, Time elapsed: 33.515 s - in org.apache.maven.surefire.its.jiras.Surefire943ReportContentIT
[2019-11-03T12:06:00.211Z] [INFO] Running org.apache.maven.surefire.its.jiras.Surefire946KillMainProcessInReusableForkIT
[2019-11-03T12:07:07.407Z] [INFO] Tests run: 6, Failures: 0, Errors: 0, Skipped: 0, Time elapsed: 64.59 s - in org.apache.maven.surefire.its.jiras.Surefire946KillMainProcessInReusableForkIT
[2019-11-03T12:07:07.407Z] [INFO] Running org.apache.maven.surefire.its.jiras.Surefire972BizarreNoClassDefIT
[2019-11-03T12:07:08.120Z] [INFO] Tests run: 6, Failures: 0, Errors: 0, Skipped: 0, Time elapsed: 64.974 s - in org.apache.maven.surefire.its.jiras.Surefire946KillMainProcessInReusableForkIT
[2019-11-03T12:07:08.120Z] [INFO] Running org.apache.maven.surefire.its.jiras.Surefire972BizarreNoClassDefIT
[2019-11-03T12:07:11.481Z] [INFO] Tests run: 1, Failures: 0, Errors: 0, Skipped: 0, Time elapsed: 11.887 s - in org.apache.maven.surefire.its.jiras.Surefire972BizarreNoClassDefIT
[2019-11-03T12:07:11.481Z] [INFO] Running org.apache.maven.surefire.its.jiras.Surefire975DefaultVMEncodingIT
[2019-11-03T12:07:11.699Z] [INFO] Tests run: 1, Failures: 0, Errors: 0, Skipped: 0, Time elapsed: 11.568 s - in org.apache.maven.surefire.its.jiras.Surefire972BizarreNoClassDefIT
[2019-11-03T12:07:11.699Z] [INFO] Running org.apache.maven.surefire.its.jiras.Surefire975DefaultVMEncodingIT
[2019-11-03T12:07:18.236Z] [INFO] Tests run: 1, Failures: 0, Errors: 0, Skipped: 0, Time elapsed: 6.421 s - in org.apache.maven.surefire.its.jiras.Surefire975DefaultVMEncodingIT
[2019-11-03T12:07:18.236Z] [INFO] Running org.apache.maven.surefire.its.jiras.Surefire979WrongClassLoaderIT
[2019-11-03T12:07:18.390Z] [INFO] Tests run: 1, Failures: 0, Errors: 0, Skipped: 0, Time elapsed: 6.755 s - in org.apache.maven.surefire.its.jiras.Surefire975DefaultVMEncodingIT
[2019-11-03T12:07:18.391Z] [INFO] Running org.apache.maven.surefire.its.jiras.Surefire979WrongClassLoaderIT
[2019-11-03T12:07:24.905Z] [INFO] Tests run: 1, Failures: 0, Errors: 0, Skipped: 0, Time elapsed: 6.83 s - in org.apache.maven.surefire.its.jiras.Surefire979WrongClassLoaderIT
[2019-11-03T12:07:24.905Z] [INFO] Running org.apache.maven.surefire.its.jiras.Surefire985ParameterizedRunnerAndCategoriesIT
[2019-11-03T12:07:26.621Z] [INFO] Tests run: 1, Failures: 0, Errors: 0, Skipped: 0, Time elapsed: 7.034 s - in org.apache.maven.surefire.its.jiras.Surefire979WrongClassLoaderIT
[2019-11-03T12:07:26.621Z] [INFO] Running org.apache.maven.surefire.its.jiras.Surefire985ParameterizedRunnerAndCategoriesIT
[2019-11-03T12:07:31.698Z] [INFO] Tests run: 1, Failures: 0, Errors: 0, Skipped: 0, Time elapsed: 6.349 s - in org.apache.maven.surefire.its.jiras.Surefire985ParameterizedRunnerAndCategoriesIT
[2019-11-03T12:07:31.698Z] [INFO] Running org.apache.maven.surefire.its.jiras.Surefire995CategoryInheritanceIT
[2019-11-03T12:07:31.988Z] [INFO] Tests run: 1, Failures: 0, Errors: 0, Skipped: 0, Time elapsed: 5.806 s - in org.apache.maven.surefire.its.jiras.Surefire985ParameterizedRunnerAndCategoriesIT
[2019-11-03T12:07:31.988Z] [INFO] Running org.apache.maven.surefire.its.jiras.Surefire995CategoryInheritanceIT
[2019-11-03T12:07:58.705Z] [INFO] Tests run: 5, Failures: 0, Errors: 0, Skipped: 0, Time elapsed: 26.997 s - in org.apache.maven.surefire.its.jiras.Surefire995CategoryInheritanceIT
[2019-11-03T12:07:58.705Z] [INFO]
[2019-11-03T12:07:58.705Z] [INFO] Results:
[2019-11-03T12:07:58.705Z] [INFO]
[2019-11-03T12:07:58.705Z] [ERROR] Errors:
[2019-11-03T12:07:58.705Z] [ERROR]   Surefire1209RerunAndForkCountIT.notReusableForksJUnit4:72 » SurefireVerifier E...
[2019-11-03T12:07:58.705Z] [INFO]
[2019-11-03T12:07:58.705Z] [ERROR] Tests run: 848, Failures: 0, Errors: 1, Skipped: 143
[2019-11-03T12:07:58.705Z] [INFO]
[2019-11-03T12:07:58.705Z] [INFO]
[2019-11-03T12:07:58.705Z] [INFO] --- maven-checkstyle-plugin:3.0.0:check (checkstyle-check) @ surefire-its ---
[2019-11-03T12:08:00.648Z] [INFO]
[2019-11-03T12:08:00.648Z] [INFO] --- maven-failsafe-plugin:3.0.0-M3:verify (default) @ surefire-its ---
[2019-11-03T12:08:00.648Z] [INFO] Failsafe report directory: C:\Users\jenkins\AppData\Local\Temp\3\jenkins-maven-box-maven-surefire-master-89@2\surefire-its\target\failsafe-reports
[2019-11-03T12:08:00.648Z] [INFO] ------------------------------------------------------------------------
[2019-11-03T12:08:00.648Z] [INFO] Reactor Summary:
[2019-11-03T12:08:00.648Z] [INFO]
[2019-11-03T12:08:00.648Z] [INFO] Apache Maven Surefire .............................. SUCCESS [01:08 min]
[2019-11-03T12:08:00.648Z] [INFO] SureFire Logger API ................................ SUCCESS [ 25.518 s]
[2019-11-03T12:08:00.648Z] [INFO] SureFire API ....................................... SUCCESS [ 20.313 s]
[2019-11-03T12:08:00.648Z] [INFO] Surefire Extensions API ............................ SUCCESS [  3.390 s]
[2019-11-03T12:08:00.648Z] [INFO] SureFire Booter .................................... SUCCESS [ 19.067 s]
[2019-11-03T12:08:00.649Z] [INFO] Maven Surefire Test-Grouping Support ............... SUCCESS [ 11.832 s]
[2019-11-03T12:08:00.649Z] [INFO] SureFire Providers ................................. SUCCESS [  1.327 s]
[2019-11-03T12:08:00.649Z] [INFO] Shared JUnit3 Provider Code ........................ SUCCESS [  5.831 s]
[2019-11-03T12:08:00.649Z] [INFO] Shared Java 5 Provider Base ........................ SUCCESS [  7.023 s]
[2019-11-03T12:08:00.649Z] [INFO] Shared JUnit4 Provider Code ........................ SUCCESS [  7.592 s]
[2019-11-03T12:08:00.649Z] [INFO] Shared JUnit48 Provider Code ....................... SUCCESS [  8.607 s]
[2019-11-03T12:08:00.649Z] [INFO] SureFire JUnit Runner .............................. SUCCESS [  6.081 s]
[2019-11-03T12:08:00.649Z] [INFO] SureFire JUnit4 Runner ............................. SUCCESS [ 35.732 s]
[2019-11-03T12:08:00.649Z] [INFO] Maven Surefire Common .............................. SUCCESS [ 54.190 s]
[2019-11-03T12:08:00.649Z] [INFO] SureFire JUnitCore Runner .......................... SUCCESS [02:27 min]
[2019-11-03T12:08:00.649Z] [INFO] SureFire JUnit Platform Runner ..................... SUCCESS [ 13.695 s]
[2019-11-03T12:08:00.649Z] [INFO] SureFire TestNG Utils .............................. SUCCESS [  6.290 s]
[2019-11-03T12:08:00.649Z] [INFO] SureFire TestNG Runner ............................. SUCCESS [  7.101 s]
[2019-11-03T12:08:00.649Z] [INFO] ShadeFire JUnit3 Provider .......................... SUCCESS [  2.037 s]
[2019-11-03T12:08:00.649Z] [INFO] Surefire Report Parser ............................. SUCCESS [  8.768 s]
[2019-11-03T12:08:00.649Z] [INFO] Maven Surefire Plugin .............................. SUCCESS [ 17.338 s]
[2019-11-03T12:08:00.649Z] [INFO] Maven Failsafe Plugin .............................. SUCCESS [01:55 min]
[2019-11-03T12:08:00.649Z] [INFO] Maven Surefire Report Plugin ....................... SUCCESS [ 20.739 s]
[2019-11-03T12:08:00.649Z] [INFO] Maven Surefire Integration Tests ................... FAILURE [  01:24 h]
[2019-11-03T12:08:00.649Z] [INFO] ------------------------------------------------------------------------
[2019-11-03T12:08:00.649Z] [INFO] BUILD FAILURE
[2019-11-03T12:08:00.649Z] [INFO] ------------------------------------------------------------------------
[2019-11-03T12:08:00.649Z] [INFO] Total time: 01:34 h
[2019-11-03T12:08:00.649Z] [INFO] Finished at: 2019-11-03T04:08:00-08:00
[2019-11-03T12:08:00.649Z] [INFO] Final Memory: 51M/172M
[2019-11-03T12:08:00.649Z] [INFO] ------------------------------------------------------------------------
[2019-11-03T12:08:00.649Z] [ERROR] Failed to execute goal org.apache.maven.plugins:maven-failsafe-plugin:3.0.0-M3:verify (default) on project surefire-its: There are test failures.
[2019-11-03T12:08:00.649Z] [ERROR]
[2019-11-03T12:08:00.649Z] [ERROR] Please refer to C:\Users\jenkins\AppData\Local\Temp\3\jenkins-maven-box-maven-surefire-master-89@2\surefire-its\target\failsafe-reports for the individual test results.
[2019-11-03T12:08:00.649Z] [ERROR] Please refer to dump files (if any exist) [date].dump, [date]-jvmRun[N].dump and [date].dumpstream.
[2019-11-03T12:08:00.649Z] [ERROR] -> [Help 1]
[2019-11-03T12:08:00.649Z] org.apache.maven.lifecycle.LifecycleExecutionException: Failed to execute goal org.apache.maven.plugins:maven-failsafe-plugin:3.0.0-M3:verify (default) on project surefire-its: There are test failures.
[2019-11-03T12:08:00.649Z]
[2019-11-03T12:08:00.649Z] Please refer to C:\Users\jenkins\AppData\Local\Temp\3\jenkins-maven-box-maven-surefire-master-89@2\surefire-its\target\failsafe-reports for the individual test results.
[2019-11-03T12:08:00.649Z] Please refer to dump files (if any exist) [date].dump, [date]-jvmRun[N].dump and [date].dumpstream.
[2019-11-03T12:08:00.649Z] at org.apache.maven.lifecycle.internal.MojoExecutor.execute(MojoExecutor.java:212)
[2019-11-03T12:08:00.649Z] at org.apache.maven.lifecycle.internal.MojoExecutor.execute(MojoExecutor.java:153)
[2019-11-03T12:08:00.649Z] at org.apache.maven.lifecycle.internal.MojoExecutor.execute(MojoExecutor.java:145)
[2019-11-03T12:08:00.649Z] at org.apache.maven.lifecycle.internal.LifecycleModuleBuilder.buildProject(LifecycleModuleBuilder.java:116)
[2019-11-03T12:08:00.649Z] at org.apache.maven.lifecycle.internal.LifecycleModuleBuilder.buildProject(LifecycleModuleBuilder.java:80)
[2019-11-03T12:08:00.649Z] at org.apache.maven.lifecycle.internal.builder.singlethreaded.SingleThreadedBuilder.build(SingleThreadedBuilder.java:51)
[2019-11-03T12:08:00.649Z] at org.apache.maven.lifecycle.internal.LifecycleStarter.execute(LifecycleStarter.java:120)
[2019-11-03T12:08:00.649Z] at org.apache.maven.DefaultMaven.doExecute(DefaultMaven.java:355)
[2019-11-03T12:08:00.649Z] at org.apache.maven.DefaultMaven.execute(DefaultMaven.java:155)
[2019-11-03T12:08:00.649Z] at org.apache.maven.cli.MavenCli.execute(MavenCli.java:584)
[2019-11-03T12:08:00.649Z] at org.apache.maven.cli.MavenCli.doMain(MavenCli.java:216)
[2019-11-03T12:08:00.649Z] at org.apache.maven.cli.MavenCli.main(MavenCli.java:160)
[2019-11-03T12:08:00.649Z] at sun.reflect.NativeMethodAccessorImpl.invoke0(Native Method)
[2019-11-03T12:08:00.649Z] at sun.reflect.NativeMethodAccessorImpl.invoke(NativeMethodAccessorImpl.java:62)
[2019-11-03T12:08:00.649Z] at sun.reflect.DelegatingMethodAccessorImpl.invoke(DelegatingMethodAccessorImpl.java:43)
[2019-11-03T12:08:00.649Z] at java.lang.reflect.Method.invoke(Method.java:498)
[2019-11-03T12:08:00.649Z] at org.codehaus.plexus.classworlds.launcher.Launcher.launchEnhanced(Launcher.java:289)
[2019-11-03T12:08:00.649Z] at org.codehaus.plexus.classworlds.launcher.Launcher.launch(Launcher.java:229)
[2019-11-03T12:08:00.649Z] at org.codehaus.plexus.classworlds.launcher.Launcher.mainWithExitCode(Launcher.java:415)
[2019-11-03T12:08:00.649Z] at org.codehaus.plexus.classworlds.launcher.Launcher.main(Launcher.java:356)
[2019-11-03T12:08:00.649Z] Caused by: org.apache.maven.plugin.MojoFailureException: There are test failures.
[2019-11-03T12:08:00.649Z]
[2019-11-03T12:08:00.649Z] Please refer to C:\Users\jenkins\AppData\Local\Temp\3\jenkins-maven-box-maven-surefire-master-89@2\surefire-its\target\failsafe-reports for the individual test results.
[2019-11-03T12:08:00.649Z] Please refer to dump files (if any exist) [date].dump, [date]-jvmRun[N].dump and [date].dumpstream.
[2019-11-03T12:08:00.649Z] at org.apache.maven.plugin.surefire.SurefireHelper.throwException(SurefireHelper.java:271)
[2019-11-03T12:08:00.649Z] at org.apache.maven.plugin.surefire.SurefireHelper.reportExecution(SurefireHelper.java:159)
[2019-11-03T12:08:00.649Z] at org.apache.maven.plugin.failsafe.VerifyMojo.execute(VerifyMojo.java:192)
[2019-11-03T12:08:00.649Z] at org.apache.maven.plugin.DefaultBuildPluginManager.executeMojo(DefaultBuildPluginManager.java:132)
[2019-11-03T12:08:00.649Z] at org.apache.maven.lifecycle.internal.MojoExecutor.execute(MojoExecutor.java:208)
[2019-11-03T12:08:00.649Z] ... 19 more
[2019-11-03T12:08:00.649Z] [ERROR]
[2019-11-03T12:08:00.649Z] [ERROR] Re-run Maven using the -X switch to enable full debug logging.
[2019-11-03T12:08:00.649Z] [ERROR]
[2019-11-03T12:08:00.649Z] [ERROR] For more information about the errors and possible solutions, please read the following articles:
[2019-11-03T12:08:00.649Z] [ERROR] [Help 1] http://cwiki.apache.org/confluence/display/MAVEN/MojoFailureException
[2019-11-03T12:08:00.649Z] [ERROR]
[2019-11-03T12:08:00.649Z] [ERROR] After correcting the problems, you can resume the build with the command
[2019-11-03T12:08:00.649Z] [ERROR]   mvn <goals> -rf :surefire-its
[Pipeline] }
[Pipeline] // withEnv
[Pipeline] }
[Pipeline] // stage
[Pipeline] fileExists
[Pipeline] zip
[2019-11-03T12:08:00.789Z] Writing zip file of C:\Users\jenkins\AppData\Local\Temp\3\jenkins-maven-box-maven-surefire-master-89@2\maven-failsafe-plugin\target\it to C:\Users\jenkins\AppData\Local\Temp\3\jenkins-maven-box-maven-surefire-master-89@2\maven-failsafe-plugin--windows-jdk11-maven3.2.x.zip
[2019-11-03T12:08:00.920Z] Zipped 78 entries.
[2019-11-03T12:08:00.920Z] Archiving C:\Users\jenkins\AppData\Local\Temp\3\jenkins-maven-box-maven-surefire-master-89@2\maven-failsafe-plugin--windows-jdk11-maven3.2.x.zip
[2019-11-03T12:08:00.934Z] [Fast Archiver] No artifacts from Maven TLP » maven-surefire » master #88 to compare, so performing full copy of artifacts
[Pipeline] fileExists
[Pipeline] zip
[2019-11-03T12:08:01.021Z] Writing zip file of C:\Users\jenkins\AppData\Local\Temp\3\jenkins-maven-box-maven-surefire-master-89@2\surefire-its\target to C:\Users\jenkins\AppData\Local\Temp\3\jenkins-maven-box-maven-surefire-master-89@2\surefire-its--windows-jdk11-maven3.2.x.zip
[2019-11-03T12:08:03.958Z] [INFO] Tests run: 5, Failures: 0, Errors: 0, Skipped: 0, Time elapsed: 29.76 s - in org.apache.maven.surefire.its.jiras.Surefire995CategoryInheritanceIT
[2019-11-03T12:08:03.958Z] [INFO]
[2019-11-03T12:08:03.958Z] [INFO] Results:
[2019-11-03T12:08:03.958Z] [INFO]
[2019-11-03T12:08:03.958Z] [WARNING] Tests run: 848, Failures: 0, Errors: 0, Skipped: 143
[2019-11-03T12:08:03.958Z] [INFO]
[2019-11-03T12:08:03.958Z] [INFO]
[2019-11-03T12:08:03.958Z] [INFO] --- maven-checkstyle-plugin:3.0.0:check (checkstyle-check) @ surefire-its ---
[2019-11-03T12:08:03.958Z] [INFO]
[2019-11-03T12:08:03.958Z] [INFO] --- maven-failsafe-plugin:3.0.0-M3:verify (default) @ surefire-its ---
[2019-11-03T12:08:03.958Z] [INFO] Failsafe report directory: C:\Users\jenkins\AppData\Local\Temp\3\jenkins-maven-box-maven-surefire-master-89\surefire-its\target\failsafe-reports
[2019-11-03T12:08:03.958Z] [INFO]
[2019-11-03T12:08:03.958Z] [INFO] --- maven-install-plugin:2.5.2:install (default-install) @ surefire-its ---
[2019-11-03T12:08:03.958Z] [INFO] Skipping artifact installation
[2019-11-03T12:08:03.958Z] [INFO] ------------------------------------------------------------------------
[2019-11-03T12:08:03.958Z] [INFO] Reactor Summary:
[2019-11-03T12:08:03.958Z] [INFO]
[2019-11-03T12:08:03.958Z] [INFO] Apache Maven Surefire .............................. SUCCESS [01:07 min]
[2019-11-03T12:08:03.958Z] [INFO] SureFire Logger API ................................ SUCCESS [ 25.524 s]
[2019-11-03T12:08:03.958Z] [INFO] SureFire API ....................................... SUCCESS [ 20.300 s]
[2019-11-03T12:08:03.958Z] [INFO] Surefire Extensions API ............................ SUCCESS [  3.396 s]
[2019-11-03T12:08:03.958Z] [INFO] SureFire Booter .................................... SUCCESS [ 19.072 s]
[2019-11-03T12:08:03.958Z] [INFO] Maven Surefire Test-Grouping Support ............... SUCCESS [ 11.827 s]
[2019-11-03T12:08:03.958Z] [INFO] SureFire Providers ................................. SUCCESS [  1.100 s]
[2019-11-03T12:08:03.958Z] [INFO] Shared JUnit3 Provider Code ........................ SUCCESS [  5.655 s]
[2019-11-03T12:08:03.958Z] [INFO] Shared Java 5 Provider Base ........................ SUCCESS [  7.369 s]
[2019-11-03T12:08:03.958Z] [INFO] Shared JUnit4 Provider Code ........................ SUCCESS [  7.673 s]
[2019-11-03T12:08:03.958Z] [INFO] Shared JUnit48 Provider Code ....................... SUCCESS [  8.300 s]
[2019-11-03T12:08:03.958Z] [INFO] SureFire JUnit Runner .............................. SUCCESS [  6.018 s]
[2019-11-03T12:08:03.958Z] [INFO] SureFire JUnit4 Runner ............................. SUCCESS [ 35.843 s]
[2019-11-03T12:08:03.958Z] [INFO] Maven Surefire Common .............................. SUCCESS [ 52.463 s]
[2019-11-03T12:08:03.958Z] [INFO] SureFire JUnitCore Runner .......................... SUCCESS [02:29 min]
[2019-11-03T12:08:03.958Z] [INFO] SureFire JUnit Platform Runner ..................... SUCCESS [ 12.938 s]
[2019-11-03T12:08:03.958Z] [INFO] SureFire TestNG Utils .............................. SUCCESS [  6.491 s]
[2019-11-03T12:08:03.958Z] [INFO] SureFire TestNG Runner ............................. SUCCESS [  7.119 s]
[2019-11-03T12:08:03.958Z] [INFO] ShadeFire JUnit3 Provider .......................... SUCCESS [  2.330 s]
[2019-11-03T12:08:03.958Z] [INFO] Surefire Report Parser ............................. SUCCESS [  8.592 s]
[2019-11-03T12:08:03.958Z] [INFO] Maven Surefire Plugin .............................. SUCCESS [ 17.395 s]
[2019-11-03T12:08:03.958Z] [INFO] Maven Failsafe Plugin .............................. SUCCESS [01:53 min]
[2019-11-03T12:08:03.958Z] [INFO] Maven Surefire Report Plugin ....................... SUCCESS [ 21.934 s]
[2019-11-03T12:08:03.958Z] [INFO] Maven Surefire Integration Tests ................... SUCCESS [  01:24 h]
[2019-11-03T12:08:03.958Z] [INFO] ------------------------------------------------------------------------
[2019-11-03T12:08:03.958Z] [INFO] BUILD SUCCESS
[2019-11-03T12:08:03.958Z] [INFO] ------------------------------------------------------------------------
[2019-11-03T12:08:03.958Z] [INFO] Total time: 01:34 h
[2019-11-03T12:08:03.958Z] [INFO] Finished at: 2019-11-03T04:08:02-08:00
[2019-11-03T12:08:03.958Z] [INFO] Final Memory: 51M/172M
[2019-11-03T12:08:03.958Z] [INFO] ------------------------------------------------------------------------
[Pipeline] }
[Pipeline] // withEnv
[Pipeline] }
[Pipeline] // stage
[Pipeline] fileExists
[Pipeline] zip
[2019-11-03T12:08:05.200Z] Writing zip file of C:\Users\jenkins\AppData\Local\Temp\3\jenkins-maven-box-maven-surefire-master-89\maven-failsafe-plugin\target\it to C:\Users\jenkins\AppData\Local\Temp\3\jenkins-maven-box-maven-surefire-master-89\maven-failsafe-plugin--windows-jdk13-maven3.2.x.zip
[2019-11-03T12:08:05.307Z] Zipped 79 entries.
[2019-11-03T12:08:05.307Z] Archiving C:\Users\jenkins\AppData\Local\Temp\3\jenkins-maven-box-maven-surefire-master-89\maven-failsafe-plugin--windows-jdk13-maven3.2.x.zip
[2019-11-03T12:08:05.309Z] [Fast Archiver] No artifacts from Maven TLP » maven-surefire » master #88 to compare, so performing full copy of artifacts
[Pipeline] fileExists
[Pipeline] zip
[2019-11-03T12:08:05.389Z] Writing zip file of C:\Users\jenkins\AppData\Local\Temp\3\jenkins-maven-box-maven-surefire-master-89\surefire-its\target to C:\Users\jenkins\AppData\Local\Temp\3\jenkins-maven-box-maven-surefire-master-89\surefire-its--windows-jdk13-maven3.2.x.zip
[2019-11-03T12:08:19.379Z] Zipped 17092 entries.
[2019-11-03T12:08:19.379Z] Archiving C:\Users\jenkins\AppData\Local\Temp\3\jenkins-maven-box-maven-surefire-master-89@2\surefire-its--windows-jdk11-maven3.2.x.zip
[2019-11-03T12:08:19.380Z] [Fast Archiver] No artifacts from Maven TLP » maven-surefire » master #88 to compare, so performing full copy of artifacts
[Pipeline] archiveArtifacts
[2019-11-03T12:08:20.464Z] Archiving artifacts
[2019-11-03T12:08:20.478Z] [Fast Archiver] No artifacts from Maven TLP » maven-surefire » master #88 to compare, so performing full copy of artifacts
[Pipeline] cleanWs
[2019-11-03T12:08:21.622Z] [WS-CLEANUP] Deleting project workspace...
[2019-11-03T12:08:21.622Z] [WS-CLEANUP] Deferred wipeout is used...
[2019-11-03T12:08:21.761Z] [WS-CLEANUP] done
[Pipeline] }
[Pipeline] // ws
[Pipeline] }
[Pipeline] // timestamps
[Pipeline] }
[Pipeline] // node
[Pipeline] }
[2019-11-03T12:08:22.128Z] Zipped 17074 entries.
[2019-11-03T12:08:22.128Z] Archiving C:\Users\jenkins\AppData\Local\Temp\3\jenkins-maven-box-maven-surefire-master-89\surefire-its--windows-jdk13-maven3.2.x.zip
[2019-11-03T12:08:22.129Z] [Fast Archiver] No artifacts from Maven TLP » maven-surefire » master #88 to compare, so performing full copy of artifacts
[Pipeline] archiveArtifacts
[2019-11-03T12:08:24.237Z] Archiving artifacts
[2019-11-03T12:08:24.433Z] [Fast Archiver] No artifacts from Maven TLP » maven-surefire » master #88 to compare, so performing full copy of artifacts
[Pipeline] cleanWs
[2019-11-03T12:08:26.262Z] [WS-CLEANUP] Deleting project workspace...
[2019-11-03T12:08:26.262Z] [WS-CLEANUP] Deferred wipeout is used...
[2019-11-03T12:08:26.390Z] [WS-CLEANUP] done
[Pipeline] }
[Pipeline] // ws
[Pipeline] }
[Pipeline] // timestamps
[Pipeline] }
[Pipeline] // node
[Pipeline] }
[Pipeline] // parallel
[Pipeline] echo
Build result: FAILURE
[Pipeline] jiraIssueSelector
[Pipeline] echo
The authors of changes [tibordigana].
[Pipeline] echo
Sending email ...
[Pipeline] emailext
Reply | Threaded
Open this post in threaded view
|

Build succeeded in Jenkins: Maven TLP » maven-surefire » master #90

Apache Jenkins Server-2