Build failed in Jenkins: Maven TLP » maven-surefire » master #206

classic Classic list List threaded Threaded
1 message Options
Reply | Threaded
Open this post in threaded view
|

Build failed in Jenkins: Maven TLP » maven-surefire » master #206

Apache Jenkins Server-2
See https://builds.apache.org/job/maven-box/job/maven-surefire/job/master/206/

Changes:

* included H35

1 tests failed.
FAILED:  org.apache.maven.surefire.junitcore.pc.ParallelComputerUtilTest.forcedShutdown

Error Message:
expected:<2500.0> but was:<3050.0>

Stack Trace:
java.lang.AssertionError: expected:<2500.0> but was:<3050.0>
        at org.junit.Assert.fail(Assert.java:89)
        at org.junit.Assert.failNotEquals(Assert.java:835)
        at org.junit.Assert.assertEquals(Assert.java:577)
        at org.junit.Assert.assertEquals(Assert.java:701)
        at org.apache.maven.surefire.junitcore.pc.ParallelComputerUtilTest.forcedShutdown(ParallelComputerUtilTest.java:1003)
        at java.base/jdk.internal.reflect.NativeMethodAccessorImpl.invoke0(Native Method)
        at java.base/jdk.internal.reflect.NativeMethodAccessorImpl.invoke(NativeMethodAccessorImpl.java:62)
        at java.base/jdk.internal.reflect.DelegatingMethodAccessorImpl.invoke(DelegatingMethodAccessorImpl.java:43)
        at java.base/java.lang.reflect.Method.invoke(Method.java:564)
        at org.junit.runners.model.FrameworkMethod$1.runReflectiveCall(FrameworkMethod.java:59)
        at org.junit.internal.runners.model.ReflectiveCallable.run(ReflectiveCallable.java:12)
        at org.junit.runners.model.FrameworkMethod.invokeExplosively(FrameworkMethod.java:56)
        at org.junit.experimental.theories.Theories$TheoryAnchor$2.evaluate(Theories.java:279)
        at org.junit.internal.runners.statements.RunBefores.evaluate(RunBefores.java:26)
        at org.junit.rules.ExpectedException$ExpectedExceptionStatement.evaluate(ExpectedException.java:258)
        at org.junit.runners.ParentRunner$3.evaluate(ParentRunner.java:306)
        at org.junit.experimental.theories.Theories$TheoryAnchor$1$1.evaluate(Theories.java:237)
        at org.junit.experimental.theories.Theories$TheoryAnchor.runWithCompleteAssignment(Theories.java:223)
        at org.junit.experimental.theories.Theories$TheoryAnchor.runWithAssignment(Theories.java:209)
        at org.junit.experimental.theories.Theories$TheoryAnchor.evaluate(Theories.java:192)
        at org.junit.runners.BlockJUnit4ClassRunner$1.evaluate(BlockJUnit4ClassRunner.java:100)
        at org.junit.runners.ParentRunner.runLeaf(ParentRunner.java:366)
        at org.junit.runners.BlockJUnit4ClassRunner.runChild(BlockJUnit4ClassRunner.java:103)
        at org.junit.runners.BlockJUnit4ClassRunner.runChild(BlockJUnit4ClassRunner.java:63)
        at org.junit.runners.ParentRunner$4.run(ParentRunner.java:331)
        at org.junit.runners.ParentRunner$1.schedule(ParentRunner.java:79)
        at org.junit.runners.ParentRunner.runChildren(ParentRunner.java:329)
        at org.junit.runners.ParentRunner.access$100(ParentRunner.java:66)
        at org.junit.runners.ParentRunner$2.evaluate(ParentRunner.java:293)
        at org.junit.internal.runners.statements.RunBefores.evaluate(RunBefores.java:26)
        at org.junit.internal.runners.statements.RunAfters.evaluate(RunAfters.java:27)
        at org.junit.runners.ParentRunner$3.evaluate(ParentRunner.java:306)
        at org.junit.runners.ParentRunner.run(ParentRunner.java:413)
        at junit.framework.JUnit4TestAdapter.run(JUnit4TestAdapter.java:50)
        at junit.framework.TestSuite.runTest(TestSuite.java:241)
        at junit.framework.TestSuite.run(TestSuite.java:236)
        at java.base/jdk.internal.reflect.NativeMethodAccessorImpl.invoke0(Native Method)
        at java.base/jdk.internal.reflect.NativeMethodAccessorImpl.invoke(NativeMethodAccessorImpl.java:62)
        at java.base/jdk.internal.reflect.DelegatingMethodAccessorImpl.invoke(DelegatingMethodAccessorImpl.java:43)
        at java.base/java.lang.reflect.Method.invoke(Method.java:564)
        at org.apache.maven.shadefire.surefire.junit.JUnitTestSet.execute(JUnitTestSet.java:99)
        at org.apache.maven.shadefire.surefire.junit.JUnit3Provider.executeTestSet(JUnit3Provider.java:141)
        at org.apache.maven.shadefire.surefire.junit.JUnit3Provider.invoke(JUnit3Provider.java:114)
        at org.apache.maven.shadefire.surefire.booter.ForkedBooter.runSuitesInProcess(ForkedBooter.java:377)
        at org.apache.maven.shadefire.surefire.booter.ForkedBooter.execute(ForkedBooter.java:138)
        at org.apache.maven.shadefire.surefire.booter.ForkedBooter.run(ForkedBooter.java:465)
        at org.apache.maven.shadefire.surefire.booter.ForkedBooter.main(ForkedBooter.java:451)




Build log:
[...truncated 44482 lines...]
[Pipeline] // stage
[Pipeline] // stage
[Pipeline] fileExists
[Pipeline] fileExists
[Pipeline] fileExists
[Pipeline] fileExists
[Pipeline] }
[Pipeline] }
[Pipeline] fileExists
[Pipeline] fileExists
[Pipeline] fileExists
[Pipeline] fileExists
[Pipeline] fileExists
[Pipeline] fileExists
[Pipeline] // stage
Aborted by tibordigana
[Pipeline] // stage
[Pipeline] // stage
[Pipeline] // stage
[Pipeline] fileExists
[Pipeline] fileExists
[Pipeline] fileExists
[Pipeline] fileExists
[Pipeline] // stage
[Pipeline] // stage
[Pipeline] zip
[Pipeline] fileExists
[2020-05-14T11:40:04.971Z] Writing zip file of C:\Users\jenkins\AppData\Local\Temp\2\jenkins-maven-box-maven-surefire-master-206\maven-failsafe-plugin\target\it to C:\Users\jenkins\AppData\Local\Temp\2\jenkins-maven-box-maven-surefire-master-206\maven-failsafe-plugin--windows-jdk14-maven3.6.x.zip
[Pipeline] fileExists
[Pipeline] zip
[Pipeline] zip
[Pipeline] zip
[2020-05-14T11:40:05.001Z] Writing zip file of C:\Windows\system32\config\systemprofile\AppData\Local\Temp\jenkins-maven-box-maven-surefire-master-206\maven-failsafe-plugin\target\it to C:\Windows\system32\config\systemprofile\AppData\Local\Temp\jenkins-maven-box-maven-surefire-master-206\maven-failsafe-plugin--windows-jdk11-maven3.6.x.zip
[Pipeline] zip
[2020-05-14T11:40:05.010Z] Writing zip file of C:\Users\jenkins\AppData\Local\Temp\2\jenkins-maven-box-maven-surefire-master-206\maven-failsafe-plugin\target\it to C:\Users\jenkins\AppData\Local\Temp\2\jenkins-maven-box-maven-surefire-master-206\maven-failsafe-plugin--windows-jdk7-maven3.6.x.zip
[2020-05-14T11:40:05.018Z] Writing zip file of C:\Users\jenkins\AppData\Local\Temp\2\jenkins-maven-box-maven-surefire-master-206@2\maven-failsafe-plugin\target\it to C:\Users\jenkins\AppData\Local\Temp\2\jenkins-maven-box-maven-surefire-master-206@2\maven-failsafe-plugin--windows-jdk15-maven3.2.x.zip
[Pipeline] zip
[Pipeline] zip
[2020-05-14T11:40:05.030Z] Writing zip file of C:\Users\ADMINI~1\AppData\Local\Temp\jenkins-maven-box-maven-surefire-master-206\maven-failsafe-plugin\target\it to C:\Users\ADMINI~1\AppData\Local\Temp\jenkins-maven-box-maven-surefire-master-206\maven-failsafe-plugin--windows-jdk14-maven3.2.x.zip
[Pipeline] zip
[Pipeline] zip
[Pipeline] zip
[Pipeline] zip
[Pipeline] zip
[2020-05-14T11:40:05.353Z] Writing zip file of C:\Users\jenkins\AppData\Local\Temp\2\jenkins-maven-box-maven-surefire-master-206\maven-failsafe-plugin\target\it to C:\Users\jenkins\AppData\Local\Temp\2\jenkins-maven-box-maven-surefire-master-206\maven-failsafe-plugin--windows-jdk15-maven3.6.x.zip
[2020-05-14T11:40:05.358Z] Writing zip file of C:\Users\ADMINI~1\AppData\Local\Temp\jenkins-maven-box-maven-surefire-master-206@2\maven-failsafe-plugin\target\it to C:\Users\ADMINI~1\AppData\Local\Temp\jenkins-maven-box-maven-surefire-master-206@2\maven-failsafe-plugin--windows-jdk11-maven3.2.x.zip
[Pipeline] cleanWs
[Pipeline] cleanWs
[2020-05-14T11:40:05.485Z] [WS-CLEANUP] Deleting project workspace...
[2020-05-14T11:40:05.485Z] [WS-CLEANUP] Deferred wipeout is used...
[Pipeline] cleanWs
[Pipeline] cleanWs
[Pipeline] cleanWs
[Pipeline] cleanWs
[Pipeline] cleanWs
[2020-05-14T11:40:05.535Z] [WS-CLEANUP] Deleting project workspace...
[2020-05-14T11:40:05.535Z] [WS-CLEANUP] Deferred wipeout is used...
[Pipeline] cleanWs
[2020-05-14T11:40:05.546Z] [WS-CLEANUP] Deleting project workspace...
[2020-05-14T11:40:05.546Z] [WS-CLEANUP] Deferred wipeout is used...
[Pipeline] cleanWs
[Pipeline] cleanWs
[2020-05-14T11:40:05.567Z] [WS-CLEANUP] Deleting project workspace...
[2020-05-14T11:40:05.567Z] [WS-CLEANUP] Deferred wipeout is used...
[Pipeline] cleanWs
[2020-05-14T11:40:05.623Z] [WS-CLEANUP] Deleting project workspace...
[2020-05-14T11:40:05.623Z] [WS-CLEANUP] Deferred wipeout is used...
[2020-05-14T11:40:05.634Z] [WS-CLEANUP] Deleting project workspace...
[2020-05-14T11:40:05.634Z] [WS-CLEANUP] Deferred wipeout is used...
[2020-05-14T11:40:05.635Z] [WS-CLEANUP] Deleting project workspace...
[2020-05-14T11:40:05.635Z] [WS-CLEANUP] Deferred wipeout is used...
[2020-05-14T11:40:05.637Z] [WS-CLEANUP] done
[2020-05-14T11:40:05.648Z] [WS-CLEANUP] done
[2020-05-14T11:40:05.648Z] [WS-CLEANUP] done
[2020-05-14T11:40:05.649Z] [WS-CLEANUP] done
[2020-05-14T11:40:05.711Z] [WS-CLEANUP] done
[2020-05-14T11:40:05.718Z] [WS-CLEANUP] done
[2020-05-14T11:40:05.732Z] [WS-CLEANUP] done
[Pipeline] cleanWs
[Pipeline] }
[2020-05-14T11:40:05.751Z] [WS-CLEANUP] Deleting project workspace...
[2020-05-14T11:40:05.751Z] [WS-CLEANUP] Deferred wipeout is used...
[Pipeline] cleanWs
[Pipeline] cleanWs
[Pipeline] cleanWs
[Pipeline] }
[Pipeline] }
[2020-05-14T11:40:05.801Z] [WS-CLEANUP] Deleting project workspace...
[2020-05-14T11:40:05.801Z] [WS-CLEANUP] Deferred wipeout is used...
[Pipeline] }
[2020-05-14T11:40:05.814Z] [WS-CLEANUP] Deleting project workspace...
[2020-05-14T11:40:05.814Z] [WS-CLEANUP] Deferred wipeout is used...
[2020-05-14T11:40:05.819Z] [WS-CLEANUP] Deleting project workspace...
[2020-05-14T11:40:05.819Z] [WS-CLEANUP] Deferred wipeout is used...
[Pipeline] cleanWs
[2020-05-14T11:40:05.846Z] [WS-CLEANUP] Deleting project workspace...
[2020-05-14T11:40:05.846Z] [WS-CLEANUP] Deferred wipeout is used...
[Pipeline] }
[2020-05-14T11:40:05.855Z] [WS-CLEANUP] done
[Pipeline] }
[Pipeline] // ws
[2020-05-14T11:40:05.923Z] [WS-CLEANUP] Deleting project workspace...
[2020-05-14T11:40:05.923Z] [WS-CLEANUP] Deferred wipeout is used...
[2020-05-14T11:40:05.925Z] [WS-CLEANUP] done
[Pipeline] // ws
[Pipeline] // ws
[Pipeline] // ws
[Pipeline] }
[Pipeline] }
[2020-05-14T11:40:06.070Z] [WS-CLEANUP] Deleting project workspace...
[2020-05-14T11:40:06.070Z] [WS-CLEANUP] Deferred wipeout is used...
[Pipeline] }
[2020-05-14T11:40:06.084Z] [WS-CLEANUP] Deleting project workspace...
[2020-05-14T11:40:06.085Z] [WS-CLEANUP] Deferred wipeout is used...
[Pipeline] }
[Pipeline] }
[2020-05-14T11:40:06.094Z] [WS-CLEANUP] Deleting project workspace...
[2020-05-14T11:40:06.094Z] [WS-CLEANUP] Deferred wipeout is used...
[2020-05-14T11:40:06.118Z] [WS-CLEANUP] done
[Pipeline] // ws
[2020-05-14T11:40:06.135Z] [WS-CLEANUP] done
[2020-05-14T11:40:06.135Z] [WS-CLEANUP] done
[Pipeline] // ws
[Pipeline] }
[Pipeline] }
[Pipeline] }
[Pipeline] }
[2020-05-14T11:40:06.247Z] [WS-CLEANUP] done
[Pipeline] // timestamps
[Pipeline] // timestamps
[Pipeline] // timestamps
[2020-05-14T11:40:06.407Z] [WS-CLEANUP] done
[2020-05-14T11:40:06.408Z] [WS-CLEANUP] done
[Pipeline] // timestamps
[2020-05-14T11:40:06.414Z] [WS-CLEANUP] done
[Pipeline] // ws
[Pipeline] }
[Pipeline] }
[Pipeline] }
[Pipeline] }
[Pipeline] }
[Pipeline] }
[Pipeline] }
[Pipeline] }
[Pipeline] // ws
[Pipeline] // timestamps
[Pipeline] // timestamps
[Pipeline] }
[Pipeline] }
[Pipeline] }
[Pipeline] // ws
[Pipeline] }
[Pipeline] }
[Pipeline] }
[Pipeline] }
[Pipeline] }
[Pipeline] // node
[Pipeline] // node
[Pipeline] // node
[Pipeline] // node
[Pipeline] // timestamps
[Pipeline] }
Failed in branch windows-jdk14-maven3.6.x
[Pipeline] }
Failed in branch windows-jdk11-maven3.6.x
[Pipeline] }
Failed in branch windows-jdk7-maven3.6.x
[Pipeline] }
Failed in branch windows-jdk14-maven3.2.x
[Pipeline] }
[Pipeline] // ws
[Pipeline] // ws
[Pipeline] // ws
[Pipeline] }
[Pipeline] }
[Pipeline] }
[Pipeline] // timestamps
[Pipeline] // node
[Pipeline] // node
[Pipeline] }
Failed in branch windows-jdk15-maven3.2.x
[Pipeline] }
Failed in branch windows-jdk7-maven3.2.x
[Pipeline] }
[Pipeline] // ws
[Pipeline] // timestamps
[Pipeline] }
[Pipeline] }
[Pipeline] // ws
[Pipeline] // ws
[Pipeline] // ws
[Pipeline] }
[Pipeline] }
[Pipeline] }
[Pipeline] // node
[Pipeline] }
Failed in branch windows-jdk8-maven3.2.x
[Pipeline] // timestamps
[Pipeline] // timestamps
[Pipeline] // timestamps
[Pipeline] }
[Pipeline] }
[Pipeline] }
[Pipeline] // node
[Pipeline] }
Failed in branch windows-jdk15-maven3.6.x
[Pipeline] // timestamps
[Pipeline] // node
[Pipeline] }
Failed in branch windows-jdk11-maven3.2.x
[Pipeline] }
[Pipeline] // timestamps
[Pipeline] // timestamps
[Pipeline] // timestamps
[Pipeline] }
[Pipeline] }
[Pipeline] }
[Pipeline] // node
[Pipeline] // node
[Pipeline] // node
[Pipeline] }
Failed in branch linux-jdk7-maven3.6.x
[Pipeline] }
Failed in branch linux-jdk14-maven3.2.x
[Pipeline] }
Failed in branch linux-jdk11-maven3.2.x
[Pipeline] // node
[Pipeline] }
Failed in branch linux-jdk14-maven3.6.x
[Pipeline] // node
[Pipeline] // node
[Pipeline] // node
[Pipeline] }
Failed in branch linux-jdk11-maven3.6.x
[Pipeline] }
Failed in branch linux-jdk8-maven3.6.x
[Pipeline] }
Failed in branch linux-jdk8-maven3.2.x
[Pipeline] // parallel
[Pipeline] echo
hudson.AbortException: hudson.AbortException: script returned exit code 1
[Pipeline] echo
Build result: FAILURE
[Pipeline] jiraIssueSelector
[Pipeline] echo
The authors of changes [tibordigana].
[Pipeline] echo
Sending email ...
[Pipeline] emailext