Build failed in Jenkins: Maven TLP » maven-surefire » master #132

classic Classic list List threaded Threaded
4 messages Options
Reply | Threaded
Open this post in threaded view
|

Build failed in Jenkins: Maven TLP » maven-surefire » master #132

Apache Jenkins Server-2
See https://builds.apache.org/job/maven-box/job/maven-surefire/job/master/132/

Changes:

* Add JUnit Jupiter integration test using DisplayName
* Add JUnit Jupiter integration test using DisplayName
* Add JUnit Jupiter integration test using DisplayName
* Add JUnit Jupiter integration test using DisplayName
* Add JUnit Jupiter integration test using DisplayName
* Add JUnit Jupiter integration test using DisplayName
* Add JUnit Jupiter integration test using DisplayName
* Add JUnit Jupiter integration test using DisplayName
* Add JUnit Jupiter integration test using DisplayName
* Add JUnit Jupiter integration test using DisplayName
* Add JUnit Jupiter integration test using DisplayName
* Add JUnit Jupiter integration test using DisplayName
* Add JUnit Jupiter integration test using DisplayName

2 tests failed.
FAILED:  org.apache.maven.surefire.its.JUnitPlatformEnginesIT.platform[1.4.0-SNAPSHOT]

Error Message:

Expected: <[\[DEBUG\] test\(compact\) classpath:  test-classes  classes  junit-jupiter-engine-5\.4\.0-SNAPSHOT\.jar  apiguardian-api-1\.0\.0\.jar  junit-platform-engine-1\.4\.0-SNAPSHOT\.jar  junit-platform-commons-1\.4\.0-SNAPSHOT\.jar  opentest4j-1\.1\.1\.jar  junit-jupiter-api-5\.4\.0-SNAPSHOT\.jar]>
     but: was <[[DEBUG] test(compact) classpath:  test-classes  classes  junit-jupiter-engine-5.4.0-SNAPSHOT.jar  apiguardian-api-1.0.0.jar  junit-platform-engine-1.4.0-SNAPSHOT.jar  opentest4j-1.1.1.jar  junit-platform-commons-1.4.0-SNAPSHOT.jar  junit-jupiter-api-5.4.0-SNAPSHOT.jar]>

Stack Trace:
java.lang.AssertionError:

Expected: <[\[DEBUG\] test\(compact\) classpath:  test-classes  classes  junit-jupiter-engine-5\.4\.0-SNAPSHOT\.jar  apiguardian-api-1\.0\.0\.jar  junit-platform-engine-1\.4\.0-SNAPSHOT\.jar  junit-platform-commons-1\.4\.0-SNAPSHOT\.jar  opentest4j-1\.1\.1\.jar  junit-jupiter-api-5\.4\.0-SNAPSHOT\.jar]>
     but: was <[[DEBUG] test(compact) classpath:  test-classes  classes  junit-jupiter-engine-5.4.0-SNAPSHOT.jar  apiguardian-api-1.0.0.jar  junit-platform-engine-1.4.0-SNAPSHOT.jar  opentest4j-1.1.1.jar  junit-platform-commons-1.4.0-SNAPSHOT.jar  junit-jupiter-api-5.4.0-SNAPSHOT.jar]>
        at org.apache.maven.surefire.its.JUnitPlatformEnginesIT.platform(JUnitPlatformEnginesIT.java:111)


FAILED:  org.apache.maven.surefire.its.JUnitPlatformIT.testJupiterEngine

Error Message:
Did not find expected message in log

Stack Trace:
junit.framework.AssertionFailedError: Did not find expected message in log
        at org.apache.maven.surefire.its.JUnitPlatformIT.testJupiterEngine(JUnitPlatformIT.java:52)




Build log:
[...truncated 93574 lines...]
[INFO] Tests run: 1, Failures: 0, Errors: 0, Skipped: 0, Time elapsed: 10.577 s - in org.apache.maven.surefire.its.jiras.Surefire972BizarreNoClassDefIT
[INFO] Running org.apache.maven.surefire.its.jiras.Surefire975DefaultVMEncodingIT
[INFO] Tests run: 1, Failures: 0, Errors: 0, Skipped: 0, Time elapsed: 8.891 s - in org.apache.maven.surefire.its.jiras.Surefire975DefaultVMEncodingIT
[INFO] Running org.apache.maven.surefire.its.jiras.Surefire979WrongClassLoaderIT
[INFO] Tests run: 1, Failures: 0, Errors: 0, Skipped: 0, Time elapsed: 7.922 s - in org.apache.maven.surefire.its.jiras.Surefire979WrongClassLoaderIT
[INFO] Running org.apache.maven.surefire.its.jiras.Surefire985ParameterizedRunnerAndCategoriesIT
[INFO] Tests run: 1, Failures: 0, Errors: 0, Skipped: 0, Time elapsed: 5.402 s - in org.apache.maven.surefire.its.jiras.Surefire985ParameterizedRunnerAndCategoriesIT
[INFO] Running org.apache.maven.surefire.its.jiras.Surefire995CategoryInheritanceIT
[INFO] Tests run: 4, Failures: 0, Errors: 0, Skipped: 0, Time elapsed: 43.267 s - in org.apache.maven.surefire.its.jiras.Surefire828EmptyGroupExprIT
[INFO] Running org.apache.maven.surefire.its.jiras.Surefire832ProviderSelectionIT
[INFO] Tests run: 1, Failures: 0, Errors: 0, Skipped: 0, Time elapsed: 11.664 s - in org.apache.maven.surefire.its.jiras.Surefire832ProviderSelectionIT
[INFO] Running org.apache.maven.surefire.its.jiras.Surefire839TestWithoutCategoriesIT
[INFO] Tests run: 5, Failures: 0, Errors: 0, Skipped: 0, Time elapsed: 27.097 s - in org.apache.maven.surefire.its.jiras.Surefire995CategoryInheritanceIT
[INFO]
[INFO] Results:
[INFO]
[WARNING] Tests run: 788, Failures: 0, Errors: 0, Skipped: 169
[INFO]
[INFO]
[INFO] --- maven-checkstyle-plugin:3.0.0:check (checkstyle-check) @ surefire-its ---
[INFO]
[INFO] --- maven-failsafe-plugin:3.0.0-M3:verify (default) @ surefire-its ---
[INFO] Failsafe report directory: C:\Users\jenkins\AppData\Local\Temp\2\jenkins-maven-box-maven-surefire-master-132@2\surefire-its\target\failsafe-reports
[INFO]
[INFO] --- maven-install-plugin:2.5.2:install (default-install) @ surefire-its ---
[INFO] Skipping artifact installation
[INFO] ------------------------------------------------------------------------
[INFO] Reactor Summary:
[INFO]
[INFO] Apache Maven Surefire .............................. SUCCESS [ 27.435 s]
[INFO] SureFire Logger API ................................ SUCCESS [  5.863 s]
[INFO] SureFire API ....................................... SUCCESS [ 13.853 s]
[INFO] SureFire Booter .................................... SUCCESS [ 16.416 s]
[INFO] Maven Surefire Test-Grouping Support ............... SUCCESS [  8.205 s]
[INFO] SureFire Providers ................................. SUCCESS [  1.493 s]
[INFO] Shared JUnit3 Provider Code ........................ SUCCESS [  5.961 s]
[INFO] Shared Java 5 Provider Base ........................ SUCCESS [  6.762 s]
[INFO] Shared JUnit4 Provider Code ........................ SUCCESS [  7.106 s]
[INFO] Shared JUnit48 Provider Code ....................... SUCCESS [  8.210 s]
[INFO] SureFire JUnit Runner .............................. SUCCESS [  6.126 s]
[INFO] SureFire JUnit4 Runner ............................. SUCCESS [  6.319 s]
[INFO] Maven Surefire Common .............................. SUCCESS [ 35.394 s]
[INFO] SureFire JUnitCore Runner .......................... SUCCESS [02:21 min]
[INFO] SureFire JUnit Platform Runner ..................... SUCCESS [ 13.442 s]
[INFO] SureFire TestNG Utils .............................. SUCCESS [  6.586 s]
[INFO] SureFire TestNG Runner ............................. SUCCESS [  7.119 s]
[INFO] ShadeFire JUnit3 Provider .......................... SUCCESS [  2.264 s]
[INFO] Surefire Report Parser ............................. SUCCESS [  8.539 s]
[INFO] Maven Surefire Plugin .............................. SUCCESS [ 15.209 s]
[INFO] Maven Failsafe Plugin .............................. SUCCESS [01:33 min]
[INFO] Maven Surefire Report Plugin ....................... SUCCESS [ 20.098 s]
[INFO] Maven Surefire Integration Tests ................... SUCCESS [  01:24 h]
[INFO] ------------------------------------------------------------------------
[INFO] BUILD SUCCESS
[INFO] ------------------------------------------------------------------------
[INFO] Total time: 01:31 h
[INFO] Finished at: 2019-01-30T22:04:52+00:00
[INFO] Final Memory: 50M/167M
[INFO] ------------------------------------------------------------------------
[Pipeline] }
[Pipeline] // withEnv
[Pipeline] }
[Pipeline] // stage
[Pipeline] fileExists
[Pipeline] zip
Writing zip file of C:\Users\jenkins\AppData\Local\Temp\2\jenkins-maven-box-maven-surefire-master-132@2\maven-failsafe-plugin\target\it to C:\Users\jenkins\AppData\Local\Temp\2\jenkins-maven-box-maven-surefire-master-132@2\maven-failsafe-plugin--windows-jdk7-maven3.2.x.zip
Zipped 78 entries.
Archiving C:\Users\jenkins\AppData\Local\Temp\2\jenkins-maven-box-maven-surefire-master-132@2\maven-failsafe-plugin--windows-jdk7-maven3.2.x.zip
[Fast Archiver] No artifacts from Maven TLP » maven-surefire » master #131 to compare, so performing full copy of artifacts
[Pipeline] fileExists
[Pipeline] zip
Writing zip file of C:\Users\jenkins\AppData\Local\Temp\2\jenkins-maven-box-maven-surefire-master-132@2\surefire-its\target to C:\Users\jenkins\AppData\Local\Temp\2\jenkins-maven-box-maven-surefire-master-132@2\surefire-its--windows-jdk7-maven3.2.x.zip
[INFO] Tests run: 2, Failures: 0, Errors: 0, Skipped: 0, Time elapsed: 21.646 s - in org.apache.maven.surefire.its.jiras.Surefire839TestWithoutCategoriesIT
[INFO] Running org.apache.maven.surefire.its.jiras.Surefire847AdditionalFailureIT
Zipped 15821 entries.
Archiving C:\Users\jenkins\AppData\Local\Temp\2\jenkins-maven-box-maven-surefire-master-132@2\surefire-its--windows-jdk7-maven3.2.x.zip
[Fast Archiver] No artifacts from Maven TLP » maven-surefire » master #131 to compare, so performing full copy of artifacts
[Pipeline] archiveArtifacts
Archiving artifacts
[Fast Archiver] No artifacts from Maven TLP » maven-surefire » master #131 to compare, so performing full copy of artifacts
[Pipeline] cleanWs
[WS-CLEANUP] Deleting project workspace...
[WS-CLEANUP] Deferred wipeout is used...
[WS-CLEANUP] done
[Pipeline] }
[Pipeline] // ws
[Pipeline] }
[Pipeline] // timestamps
[Pipeline] }
[Pipeline] // node
[Pipeline] }
[INFO] Tests run: 1, Failures: 0, Errors: 0, Skipped: 0, Time elapsed: 11.468 s - in org.apache.maven.surefire.its.jiras.Surefire847AdditionalFailureIT
[INFO] Running org.apache.maven.surefire.its.jiras.Surefire855AllowFailsafeUseArtifactFileIT
[INFO] Tests run: 4, Failures: 0, Errors: 0, Skipped: 0, Time elapsed: 76.363 s - in org.apache.maven.surefire.its.jiras.Surefire855AllowFailsafeUseArtifactFileIT
[INFO] Running org.apache.maven.surefire.its.jiras.Surefire901MIssingResultfileWhenNoTestsIT
[INFO] Tests run: 1, Failures: 0, Errors: 0, Skipped: 0, Time elapsed: 7.401 s - in org.apache.maven.surefire.its.jiras.Surefire901MIssingResultfileWhenNoTestsIT
[INFO] Running org.apache.maven.surefire.its.jiras.Surefire907PerThreadWithoutThreadCountIT
[INFO] Tests run: 1, Failures: 0, Errors: 0, Skipped: 0, Time elapsed: 6.884 s - in org.apache.maven.surefire.its.jiras.Surefire907PerThreadWithoutThreadCountIT
[INFO] Running org.apache.maven.surefire.its.jiras.Surefire920TestFailureIgnoreWithTimeoutIT
[INFO] Tests run: 2, Failures: 0, Errors: 0, Skipped: 0, Time elapsed: 21.324 s - in org.apache.maven.surefire.its.jiras.Surefire920TestFailureIgnoreWithTimeoutIT
[INFO] Running org.apache.maven.surefire.its.jiras.Surefire926FailureWith2ProvidersIT
[INFO] Tests run: 1, Failures: 0, Errors: 0, Skipped: 0, Time elapsed: 7.647 s - in org.apache.maven.surefire.its.jiras.Surefire926FailureWith2ProvidersIT
[INFO] Running org.apache.maven.surefire.its.jiras.Surefire930TestNgSuiteXmlIT
[INFO] Tests run: 1, Failures: 0, Errors: 0, Skipped: 0, Time elapsed: 11.315 s - in org.apache.maven.surefire.its.jiras.Surefire930TestNgSuiteXmlIT
[INFO] Running org.apache.maven.surefire.its.jiras.Surefire943ReportContentIT
[INFO] Tests run: 2, Failures: 0, Errors: 0, Skipped: 0, Time elapsed: 37.856 s - in org.apache.maven.surefire.its.jiras.Surefire943ReportContentIT
[INFO] Running org.apache.maven.surefire.its.jiras.Surefire946KillMainProcessInReusableForkIT
[INFO] Tests run: 3, Failures: 0, Errors: 0, Skipped: 0, Time elapsed: 28.618 s - in org.apache.maven.surefire.its.jiras.Surefire946KillMainProcessInReusableForkIT
[INFO] Running org.apache.maven.surefire.its.jiras.Surefire972BizarreNoClassDefIT
[INFO] Tests run: 1, Failures: 0, Errors: 0, Skipped: 0, Time elapsed: 12.475 s - in org.apache.maven.surefire.its.jiras.Surefire972BizarreNoClassDefIT
[INFO] Running org.apache.maven.surefire.its.jiras.Surefire975DefaultVMEncodingIT
[INFO] Tests run: 1, Failures: 0, Errors: 0, Skipped: 0, Time elapsed: 10.593 s - in org.apache.maven.surefire.its.jiras.Surefire975DefaultVMEncodingIT
[INFO] Running org.apache.maven.surefire.its.jiras.Surefire979WrongClassLoaderIT
[INFO] Tests run: 1, Failures: 0, Errors: 0, Skipped: 0, Time elapsed: 9.708 s - in org.apache.maven.surefire.its.jiras.Surefire979WrongClassLoaderIT
[INFO] Running org.apache.maven.surefire.its.jiras.Surefire985ParameterizedRunnerAndCategoriesIT
[INFO] Tests run: 1, Failures: 0, Errors: 0, Skipped: 0, Time elapsed: 8.938 s - in org.apache.maven.surefire.its.jiras.Surefire985ParameterizedRunnerAndCategoriesIT
[INFO] Running org.apache.maven.surefire.its.jiras.Surefire995CategoryInheritanceIT
[INFO] Tests run: 5, Failures: 0, Errors: 0, Skipped: 0, Time elapsed: 39.971 s - in org.apache.maven.surefire.its.jiras.Surefire995CategoryInheritanceIT
[INFO]
[INFO] Results:
[INFO]
[ERROR] Failures:
[ERROR]   JUnitPlatformEnginesIT.platform:111
Expected: <[\[DEBUG\] test\(compact\) classpath:  test-classes  classes  junit-jupiter-engine-5\.4\.0-SNAPSHOT\.jar  apiguardian-api-1\.0\.0\.jar  junit-platform-engine-1\.4\.0-SNAPSHOT\.jar  junit-platform-commons-1\.4\.0-SNAPSHOT\.jar  opentest4j-1\.1\.1\.jar  junit-jupiter-api-5\.4\.0-SNAPSHOT\.jar]>
     but: was <[[DEBUG] test(compact) classpath:  test-classes  classes  junit-jupiter-engine-5.4.0-SNAPSHOT.jar  apiguardian-api-1.0.0.jar  junit-platform-engine-1.4.0-SNAPSHOT.jar  opentest4j-1.1.1.jar  junit-platform-commons-1.4.0-SNAPSHOT.jar  junit-jupiter-api-5.4.0-SNAPSHOT.jar]>
[ERROR]   JUnitPlatformIT.testJupiterEngine:52 Did not find expected message in log
[INFO]
[ERROR] Tests run: 788, Failures: 2, Errors: 0, Skipped: 141
[INFO]
[INFO]
[INFO] --- maven-checkstyle-plugin:3.0.0:check (checkstyle-check) @ surefire-its ---
[INFO]
[INFO] --- maven-failsafe-plugin:3.0.0-M3:verify (default) @ surefire-its ---
[INFO] Failsafe report directory: C:\Users\jenkins\AppData\Local\Temp\2\jenkins-maven-box-maven-surefire-master-132\surefire-its\target\failsafe-reports
[INFO] ------------------------------------------------------------------------
[INFO] Reactor Summary:
[INFO]
[INFO] Apache Maven Surefire .............................. SUCCESS [ 41.958 s]
[INFO] SureFire Logger API ................................ SUCCESS [ 10.551 s]
[INFO] SureFire API ....................................... SUCCESS [ 22.088 s]
[INFO] SureFire Booter .................................... SUCCESS [ 27.047 s]
[INFO] Maven Surefire Test-Grouping Support ............... SUCCESS [ 13.740 s]
[INFO] SureFire Providers ................................. SUCCESS [  2.427 s]
[INFO] Shared JUnit3 Provider Code ........................ SUCCESS [  9.024 s]
[INFO] Shared Java 5 Provider Base ........................ SUCCESS [ 11.222 s]
[INFO] Shared JUnit4 Provider Code ........................ SUCCESS [ 11.160 s]
[INFO] Shared JUnit48 Provider Code ....................... SUCCESS [ 12.049 s]
[INFO] SureFire JUnit Runner .............................. SUCCESS [ 10.006 s]
[INFO] SureFire JUnit4 Runner ............................. SUCCESS [ 11.169 s]
[INFO] Maven Surefire Common .............................. SUCCESS [ 49.250 s]
[INFO] SureFire JUnitCore Runner .......................... SUCCESS [02:22 min]
[INFO] SureFire JUnit Platform Runner ..................... SUCCESS [ 19.775 s]
[INFO] SureFire TestNG Utils .............................. SUCCESS [ 10.155 s]
[INFO] SureFire TestNG Runner ............................. SUCCESS [ 11.363 s]
[INFO] ShadeFire JUnit3 Provider .......................... SUCCESS [  3.040 s]
[INFO] Surefire Report Parser ............................. SUCCESS [ 13.080 s]
[INFO] Maven Surefire Plugin .............................. SUCCESS [ 21.505 s]
[INFO] Maven Failsafe Plugin .............................. SUCCESS [02:27 min]
[INFO] Maven Surefire Report Plugin ....................... SUCCESS [ 31.610 s]
[INFO] Maven Surefire Integration Tests ................... FAILURE [  02:02 h]
[INFO] ------------------------------------------------------------------------
[INFO] BUILD FAILURE
[INFO] ------------------------------------------------------------------------
[INFO] Total time: 02:12 h
[INFO] Finished at: 2019-01-30T22:09:54+00:00
[INFO] Final Memory: 49M/165M
[INFO] ------------------------------------------------------------------------
[ERROR] Failed to execute goal org.apache.maven.plugins:maven-failsafe-plugin:3.0.0-M3:verify (default) on project surefire-its: There are test failures.
[ERROR]
[ERROR] Please refer to C:\Users\jenkins\AppData\Local\Temp\2\jenkins-maven-box-maven-surefire-master-132\surefire-its\target\failsafe-reports for the individual test results.
[ERROR] Please refer to dump files (if any exist) [date].dump, [date]-jvmRun[N].dump and [date].dumpstream.
[ERROR] -> [Help 1]
org.apache.maven.lifecycle.LifecycleExecutionException: Failed to execute goal org.apache.maven.plugins:maven-failsafe-plugin:3.0.0-M3:verify (default) on project surefire-its: There are test failures.

Please refer to C:\Users\jenkins\AppData\Local\Temp\2\jenkins-maven-box-maven-surefire-master-132\surefire-its\target\failsafe-reports for the individual test results.
Please refer to dump files (if any exist) [date].dump, [date]-jvmRun[N].dump and [date].dumpstream.
        at org.apache.maven.lifecycle.internal.MojoExecutor.execute(MojoExecutor.java:212)
        at org.apache.maven.lifecycle.internal.MojoExecutor.execute(MojoExecutor.java:153)
        at org.apache.maven.lifecycle.internal.MojoExecutor.execute(MojoExecutor.java:145)
        at org.apache.maven.lifecycle.internal.LifecycleModuleBuilder.buildProject(LifecycleModuleBuilder.java:116)
        at org.apache.maven.lifecycle.internal.LifecycleModuleBuilder.buildProject(LifecycleModuleBuilder.java:80)
        at org.apache.maven.lifecycle.internal.builder.singlethreaded.SingleThreadedBuilder.build(SingleThreadedBuilder.java:51)
        at org.apache.maven.lifecycle.internal.LifecycleStarter.execute(LifecycleStarter.java:120)
        at org.apache.maven.DefaultMaven.doExecute(DefaultMaven.java:355)
        at org.apache.maven.DefaultMaven.execute(DefaultMaven.java:155)
        at org.apache.maven.cli.MavenCli.execute(MavenCli.java:584)
        at org.apache.maven.cli.MavenCli.doMain(MavenCli.java:216)
        at org.apache.maven.cli.MavenCli.main(MavenCli.java:160)
        at sun.reflect.NativeMethodAccessorImpl.invoke0(Native Method)
        at sun.reflect.NativeMethodAccessorImpl.invoke(NativeMethodAccessorImpl.java:62)
        at sun.reflect.DelegatingMethodAccessorImpl.invoke(DelegatingMethodAccessorImpl.java:43)
        at java.lang.reflect.Method.invoke(Method.java:498)
        at org.codehaus.plexus.classworlds.launcher.Launcher.launchEnhanced(Launcher.java:289)
        at org.codehaus.plexus.classworlds.launcher.Launcher.launch(Launcher.java:229)
        at org.codehaus.plexus.classworlds.launcher.Launcher.mainWithExitCode(Launcher.java:415)
        at org.codehaus.plexus.classworlds.launcher.Launcher.main(Launcher.java:356)
Caused by: org.apache.maven.plugin.MojoFailureException: There are test failures.

Please refer to C:\Users\jenkins\AppData\Local\Temp\2\jenkins-maven-box-maven-surefire-master-132\surefire-its\target\failsafe-reports for the individual test results.
Please refer to dump files (if any exist) [date].dump, [date]-jvmRun[N].dump and [date].dumpstream.
        at org.apache.maven.plugin.surefire.SurefireHelper.throwException(SurefireHelper.java:271)
        at org.apache.maven.plugin.surefire.SurefireHelper.reportExecution(SurefireHelper.java:159)
        at org.apache.maven.plugin.failsafe.VerifyMojo.execute(VerifyMojo.java:192)
        at org.apache.maven.plugin.DefaultBuildPluginManager.executeMojo(DefaultBuildPluginManager.java:132)
        at org.apache.maven.lifecycle.internal.MojoExecutor.execute(MojoExecutor.java:208)
        ... 19 more
[ERROR]
[ERROR] Re-run Maven using the -X switch to enable full debug logging.
[ERROR]
[ERROR] For more information about the errors and possible solutions, please read the following articles:
[ERROR] [Help 1] http://cwiki.apache.org/confluence/display/MAVEN/MojoFailureException
[ERROR]
[ERROR] After correcting the problems, you can resume the build with the command
[ERROR]   mvn <goals> -rf :surefire-its
[Pipeline] }
[Pipeline] // withEnv
[Pipeline] }
[Pipeline] // stage
[Pipeline] fileExists
[Pipeline] zip
Writing zip file of C:\Users\jenkins\AppData\Local\Temp\2\jenkins-maven-box-maven-surefire-master-132\maven-failsafe-plugin\target\it to C:\Users\jenkins\AppData\Local\Temp\2\jenkins-maven-box-maven-surefire-master-132\maven-failsafe-plugin--windows-jdk12-maven3.2.x.zip
Zipped 80 entries.
Archiving C:\Users\jenkins\AppData\Local\Temp\2\jenkins-maven-box-maven-surefire-master-132\maven-failsafe-plugin--windows-jdk12-maven3.2.x.zip
[Fast Archiver] No artifacts from Maven TLP » maven-surefire » master #131 to compare, so performing full copy of artifacts
[Pipeline] fileExists
[Pipeline] zip
Writing zip file of C:\Users\jenkins\AppData\Local\Temp\2\jenkins-maven-box-maven-surefire-master-132\surefire-its\target to C:\Users\jenkins\AppData\Local\Temp\2\jenkins-maven-box-maven-surefire-master-132\surefire-its--windows-jdk12-maven3.2.x.zip
Zipped 16267 entries.
Archiving C:\Users\jenkins\AppData\Local\Temp\2\jenkins-maven-box-maven-surefire-master-132\surefire-its--windows-jdk12-maven3.2.x.zip
[Fast Archiver] No artifacts from Maven TLP » maven-surefire » master #131 to compare, so performing full copy of artifacts
[Pipeline] archiveArtifacts
Archiving artifacts
[Fast Archiver] No artifacts from Maven TLP » maven-surefire » master #131 to compare, so performing full copy of artifacts
[Pipeline] cleanWs
[WS-CLEANUP] Deleting project workspace...
[WS-CLEANUP] Deferred wipeout is used...
[WS-CLEANUP] done
[Pipeline] }
[Pipeline] // ws
[Pipeline] }
[Pipeline] // timestamps
[Pipeline] }
[Pipeline] // node
[Pipeline] }
[Pipeline] // parallel
[Pipeline] echo
Build result: FAILURE
[Pipeline] jiraIssueSelector
[Pipeline] emailext
Reply | Threaded
Open this post in threaded view
|

Build failed in Jenkins: Maven TLP » maven-surefire » master #133

Apache Jenkins Server-2
See https://builds.apache.org/job/maven-box/job/maven-surefire/job/master/133/

Changes:

* build fix
* build fix
* build fix
* build fix
* build fix
* build fix
* build fix
* build fix
* build fix
* build fix
* build fix
* build fix
* build fix
* build fix
* build fix

1 tests failed.
FAILED:  org.apache.maven.surefire.its.JUnitPlatformEnginesIT.platform[1.4.0-SNAPSHOT]

Error Message:

Expected: <[\[DEBUG\] test\(compact\) classpath:  test-classes  classes  junit-jupiter-engine-5\.4\.0-SNAPSHOT\.jar  apiguardian-api-1\.0\.0\.jar  junit-platform-engine-1\.4\.0-SNAPSHOT\.jar  junit-platform-commons-1\.4\.0-SNAPSHOT\.jar  opentest4j-1\.1\.1\.jar  junit-jupiter-api-5\.4\.0-SNAPSHOT\.jar]>
     but: was <[[DEBUG] test(compact) classpath:  test-classes  classes  junit-jupiter-engine-5.4.0-SNAPSHOT.jar  apiguardian-api-1.0.0.jar  junit-platform-engine-1.4.0-SNAPSHOT.jar  opentest4j-1.1.1.jar  junit-platform-commons-1.4.0-SNAPSHOT.jar  junit-jupiter-api-5.4.0-SNAPSHOT.jar]>

Stack Trace:
java.lang.AssertionError:

Expected: <[\[DEBUG\] test\(compact\) classpath:  test-classes  classes  junit-jupiter-engine-5\.4\.0-SNAPSHOT\.jar  apiguardian-api-1\.0\.0\.jar  junit-platform-engine-1\.4\.0-SNAPSHOT\.jar  junit-platform-commons-1\.4\.0-SNAPSHOT\.jar  opentest4j-1\.1\.1\.jar  junit-jupiter-api-5\.4\.0-SNAPSHOT\.jar]>
     but: was <[[DEBUG] test(compact) classpath:  test-classes  classes  junit-jupiter-engine-5.4.0-SNAPSHOT.jar  apiguardian-api-1.0.0.jar  junit-platform-engine-1.4.0-SNAPSHOT.jar  opentest4j-1.1.1.jar  junit-platform-commons-1.4.0-SNAPSHOT.jar  junit-jupiter-api-5.4.0-SNAPSHOT.jar]>
        at org.apache.maven.surefire.its.JUnitPlatformEnginesIT.platform(JUnitPlatformEnginesIT.java:111)




Build log:
[...truncated 93479 lines...]
Please refer to C:\Users\jenkins\AppData\Local\Temp\2\jenkins-maven-box-maven-surefire-master-133\surefire-its\target\failsafe-reports for the individual test results.
Please refer to dump files (if any exist) [date].dump, [date]-jvmRun[N].dump and [date].dumpstream.
        at org.apache.maven.lifecycle.internal.MojoExecutor.execute(MojoExecutor.java:212)
        at org.apache.maven.lifecycle.internal.MojoExecutor.execute(MojoExecutor.java:153)
        at org.apache.maven.lifecycle.internal.MojoExecutor.execute(MojoExecutor.java:145)
        at org.apache.maven.lifecycle.internal.LifecycleModuleBuilder.buildProject(LifecycleModuleBuilder.java:116)
        at org.apache.maven.lifecycle.internal.LifecycleModuleBuilder.buildProject(LifecycleModuleBuilder.java:80)
        at org.apache.maven.lifecycle.internal.builder.singlethreaded.SingleThreadedBuilder.build(SingleThreadedBuilder.java:51)
        at org.apache.maven.lifecycle.internal.LifecycleStarter.execute(LifecycleStarter.java:120)
        at org.apache.maven.DefaultMaven.doExecute(DefaultMaven.java:355)
        at org.apache.maven.DefaultMaven.execute(DefaultMaven.java:155)
        at org.apache.maven.cli.MavenCli.execute(MavenCli.java:584)
        at org.apache.maven.cli.MavenCli.doMain(MavenCli.java:216)
        at org.apache.maven.cli.MavenCli.main(MavenCli.java:160)
        at sun.reflect.NativeMethodAccessorImpl.invoke0(Native Method)
        at sun.reflect.NativeMethodAccessorImpl.invoke(NativeMethodAccessorImpl.java:62)
        at sun.reflect.DelegatingMethodAccessorImpl.invoke(DelegatingMethodAccessorImpl.java:43)
        at java.lang.reflect.Method.invoke(Method.java:498)
        at org.codehaus.plexus.classworlds.launcher.Launcher.launchEnhanced(Launcher.java:289)
        at org.codehaus.plexus.classworlds.launcher.Launcher.launch(Launcher.java:229)
        at org.codehaus.plexus.classworlds.launcher.Launcher.mainWithExitCode(Launcher.java:415)
        at org.codehaus.plexus.classworlds.launcher.Launcher.main(Launcher.java:356)
Caused by: org.apache.maven.plugin.MojoFailureException: There are test failures.

Please refer to C:\Users\jenkins\AppData\Local\Temp\2\jenkins-maven-box-maven-surefire-master-133\surefire-its\target\failsafe-reports for the individual test results.
Please refer to dump files (if any exist) [date].dump, [date]-jvmRun[N].dump and [date].dumpstream.
        at org.apache.maven.plugin.surefire.SurefireHelper.throwException(SurefireHelper.java:271)
        at org.apache.maven.plugin.surefire.SurefireHelper.reportExecution(SurefireHelper.java:159)
        at org.apache.maven.plugin.failsafe.VerifyMojo.execute(VerifyMojo.java:192)
        at org.apache.maven.plugin.DefaultBuildPluginManager.executeMojo(DefaultBuildPluginManager.java:132)
        at org.apache.maven.lifecycle.internal.MojoExecutor.execute(MojoExecutor.java:208)
        ... 19 more
[ERROR]
[ERROR] Re-run Maven using the -X switch to enable full debug logging.
[ERROR]
[ERROR] For more information about the errors and possible solutions, please read the following articles:
[ERROR] [Help 1] http://cwiki.apache.org/confluence/display/MAVEN/MojoFailureException
[ERROR]
[ERROR] After correcting the problems, you can resume the build with the command
[ERROR]   mvn <goals> -rf :surefire-its
[Pipeline] }
[Pipeline] // withEnv
[Pipeline] }
[Pipeline] // stage
[Pipeline] fileExists
[Pipeline] zip
Writing zip file of C:\Users\jenkins\AppData\Local\Temp\2\jenkins-maven-box-maven-surefire-master-133\maven-failsafe-plugin\target\it to C:\Users\jenkins\AppData\Local\Temp\2\jenkins-maven-box-maven-surefire-master-133\maven-failsafe-plugin--windows-jdk11-maven3.2.x.zip
Zipped 78 entries.
Archiving C:\Users\jenkins\AppData\Local\Temp\2\jenkins-maven-box-maven-surefire-master-133\maven-failsafe-plugin--windows-jdk11-maven3.2.x.zip
[Fast Archiver] No artifacts from Maven TLP » maven-surefire » master #131 to compare, so performing full copy of artifacts
[Pipeline] fileExists
[Pipeline] zip
Writing zip file of C:\Users\jenkins\AppData\Local\Temp\2\jenkins-maven-box-maven-surefire-master-133\surefire-its\target to C:\Users\jenkins\AppData\Local\Temp\2\jenkins-maven-box-maven-surefire-master-133\surefire-its--windows-jdk11-maven3.2.x.zip
[INFO] Tests run: 3, Failures: 0, Errors: 0, Skipped: 0, Time elapsed: 20.798 s - in org.apache.maven.surefire.its.jiras.Surefire772SpecifiedReportsIT
[INFO] Running org.apache.maven.surefire.its.jiras.Surefire801ForkModeNoneClassLoaderIT
Zipped 16269 entries.
Archiving C:\Users\jenkins\AppData\Local\Temp\2\jenkins-maven-box-maven-surefire-master-133\surefire-its--windows-jdk11-maven3.2.x.zip
[Fast Archiver] No artifacts from Maven TLP » maven-surefire » master #131 to compare, so performing full copy of artifacts
[Pipeline] archiveArtifacts
Archiving artifacts
[Fast Archiver] No artifacts from Maven TLP » maven-surefire » master #131 to compare, so performing full copy of artifacts
[Pipeline] cleanWs
[WS-CLEANUP] Deleting project workspace...
[WS-CLEANUP] Deferred wipeout is used...
[WS-CLEANUP] done
[Pipeline] }
[Pipeline] // ws
[Pipeline] }
[Pipeline] // timestamps
[Pipeline] }
[Pipeline] // node
[Pipeline] }
[INFO] Tests run: 1, Failures: 0, Errors: 0, Skipped: 0, Time elapsed: 9.676 s - in org.apache.maven.surefire.its.jiras.Surefire801ForkModeNoneClassLoaderIT
[INFO] Running org.apache.maven.surefire.its.jiras.Surefire803MultiFailsafeExecsIT
[INFO] Tests run: 2, Failures: 0, Errors: 0, Skipped: 0, Time elapsed: 46.023 s - in org.apache.maven.surefire.its.jiras.Surefire803MultiFailsafeExecsIT
[INFO] Running org.apache.maven.surefire.its.jiras.Surefire806SpecifiedTestControlsIT
[WARNING] Tests run: 3, Failures: 0, Errors: 0, Skipped: 2, Time elapsed: 10.483 s - in org.apache.maven.surefire.its.jiras.Surefire806SpecifiedTestControlsIT
[INFO] Running org.apache.maven.surefire.its.jiras.Surefire809GroupExpressionsIT
[INFO] Tests run: 6, Failures: 0, Errors: 0, Skipped: 0, Time elapsed: 65.357 s - in org.apache.maven.surefire.its.jiras.Surefire809GroupExpressionsIT
[INFO] Running org.apache.maven.surefire.its.jiras.Surefire812Log4JClassLoaderIT
[INFO] Tests run: 1, Failures: 0, Errors: 0, Skipped: 0, Time elapsed: 14.559 s - in org.apache.maven.surefire.its.jiras.Surefire812Log4JClassLoaderIT
[INFO] Running org.apache.maven.surefire.its.jiras.Surefire817SystemExitIT
[INFO] Tests run: 1, Failures: 0, Errors: 0, Skipped: 0, Time elapsed: 10.607 s - in org.apache.maven.surefire.its.jiras.Surefire817SystemExitIT
[INFO] Running org.apache.maven.surefire.its.jiras.Surefire818NpeIgnoresTestsIT
[INFO] Tests run: 1, Failures: 0, Errors: 0, Skipped: 0, Time elapsed: 16.51 s - in org.apache.maven.surefire.its.jiras.Surefire818NpeIgnoresTestsIT
[INFO] Running org.apache.maven.surefire.its.jiras.Surefire828EmptyGroupExprIT
[INFO] Tests run: 4, Failures: 0, Errors: 0, Skipped: 0, Time elapsed: 55.464 s - in org.apache.maven.surefire.its.jiras.Surefire828EmptyGroupExprIT
[INFO] Running org.apache.maven.surefire.its.jiras.Surefire832ProviderSelectionIT
[INFO] Tests run: 1, Failures: 0, Errors: 0, Skipped: 0, Time elapsed: 14.776 s - in org.apache.maven.surefire.its.jiras.Surefire832ProviderSelectionIT
[INFO] Running org.apache.maven.surefire.its.jiras.Surefire839TestWithoutCategoriesIT
[INFO] Tests run: 2, Failures: 0, Errors: 0, Skipped: 0, Time elapsed: 29.546 s - in org.apache.maven.surefire.its.jiras.Surefire839TestWithoutCategoriesIT
[INFO] Running org.apache.maven.surefire.its.jiras.Surefire847AdditionalFailureIT
[INFO] Tests run: 1, Failures: 0, Errors: 0, Skipped: 0, Time elapsed: 17.903 s - in org.apache.maven.surefire.its.jiras.Surefire847AdditionalFailureIT
[INFO] Running org.apache.maven.surefire.its.jiras.Surefire855AllowFailsafeUseArtifactFileIT
[INFO] Tests run: 4, Failures: 0, Errors: 0, Skipped: 0, Time elapsed: 98.809 s - in org.apache.maven.surefire.its.jiras.Surefire855AllowFailsafeUseArtifactFileIT
[INFO] Running org.apache.maven.surefire.its.jiras.Surefire901MIssingResultfileWhenNoTestsIT
[INFO] Tests run: 1, Failures: 0, Errors: 0, Skipped: 0, Time elapsed: 9.437 s - in org.apache.maven.surefire.its.jiras.Surefire901MIssingResultfileWhenNoTestsIT
[INFO] Running org.apache.maven.surefire.its.jiras.Surefire907PerThreadWithoutThreadCountIT
[INFO] Tests run: 1, Failures: 0, Errors: 0, Skipped: 0, Time elapsed: 9.209 s - in org.apache.maven.surefire.its.jiras.Surefire907PerThreadWithoutThreadCountIT
[INFO] Running org.apache.maven.surefire.its.jiras.Surefire920TestFailureIgnoreWithTimeoutIT
[INFO] Tests run: 2, Failures: 0, Errors: 0, Skipped: 0, Time elapsed: 23.713 s - in org.apache.maven.surefire.its.jiras.Surefire920TestFailureIgnoreWithTimeoutIT
[INFO] Running org.apache.maven.surefire.its.jiras.Surefire926FailureWith2ProvidersIT
[INFO] Tests run: 1, Failures: 0, Errors: 0, Skipped: 0, Time elapsed: 17.038 s - in org.apache.maven.surefire.its.jiras.Surefire926FailureWith2ProvidersIT
[INFO] Running org.apache.maven.surefire.its.jiras.Surefire930TestNgSuiteXmlIT
[INFO] Tests run: 1, Failures: 0, Errors: 0, Skipped: 0, Time elapsed: 15.307 s - in org.apache.maven.surefire.its.jiras.Surefire930TestNgSuiteXmlIT
[INFO] Running org.apache.maven.surefire.its.jiras.Surefire943ReportContentIT
[INFO] Tests run: 2, Failures: 0, Errors: 0, Skipped: 0, Time elapsed: 44.413 s - in org.apache.maven.surefire.its.jiras.Surefire943ReportContentIT
[INFO] Running org.apache.maven.surefire.its.jiras.Surefire946KillMainProcessInReusableForkIT
[INFO] Tests run: 3, Failures: 0, Errors: 0, Skipped: 0, Time elapsed: 31.967 s - in org.apache.maven.surefire.its.jiras.Surefire946KillMainProcessInReusableForkIT
[INFO] Running org.apache.maven.surefire.its.jiras.Surefire972BizarreNoClassDefIT
[INFO] Tests run: 1, Failures: 0, Errors: 0, Skipped: 0, Time elapsed: 17.006 s - in org.apache.maven.surefire.its.jiras.Surefire972BizarreNoClassDefIT
[INFO] Running org.apache.maven.surefire.its.jiras.Surefire975DefaultVMEncodingIT
[INFO] Tests run: 1, Failures: 0, Errors: 0, Skipped: 0, Time elapsed: 16.255 s - in org.apache.maven.surefire.its.jiras.Surefire975DefaultVMEncodingIT
[INFO] Running org.apache.maven.surefire.its.jiras.Surefire979WrongClassLoaderIT
[INFO] Tests run: 1, Failures: 0, Errors: 0, Skipped: 0, Time elapsed: 12.67 s - in org.apache.maven.surefire.its.jiras.Surefire979WrongClassLoaderIT
[INFO] Running org.apache.maven.surefire.its.jiras.Surefire985ParameterizedRunnerAndCategoriesIT
[INFO] Tests run: 1, Failures: 0, Errors: 0, Skipped: 0, Time elapsed: 9.726 s - in org.apache.maven.surefire.its.jiras.Surefire985ParameterizedRunnerAndCategoriesIT
[INFO] Running org.apache.maven.surefire.its.jiras.Surefire995CategoryInheritanceIT
[INFO] Tests run: 5, Failures: 0, Errors: 0, Skipped: 0, Time elapsed: 48.538 s - in org.apache.maven.surefire.its.jiras.Surefire995CategoryInheritanceIT
[INFO]
[INFO] Results:
[INFO]
[ERROR] Failures:
[ERROR]   JUnitPlatformEnginesIT.platform:111
Expected: <[\[DEBUG\] test\(compact\) classpath:  test-classes  classes  junit-jupiter-engine-5\.4\.0-SNAPSHOT\.jar  apiguardian-api-1\.0\.0\.jar  junit-platform-engine-1\.4\.0-SNAPSHOT\.jar  junit-platform-commons-1\.4\.0-SNAPSHOT\.jar  opentest4j-1\.1\.1\.jar  junit-jupiter-api-5\.4\.0-SNAPSHOT\.jar]>
     but: was <[[DEBUG] test(compact) classpath:  test-classes  classes  junit-jupiter-engine-5.4.0-SNAPSHOT.jar  apiguardian-api-1.0.0.jar  junit-platform-engine-1.4.0-SNAPSHOT.jar  opentest4j-1.1.1.jar  junit-platform-commons-1.4.0-SNAPSHOT.jar  junit-jupiter-api-5.4.0-SNAPSHOT.jar]>
[INFO]
[ERROR] Tests run: 789, Failures: 1, Errors: 0, Skipped: 151
[INFO]
[INFO]
[INFO] --- maven-checkstyle-plugin:3.0.0:check (checkstyle-check) @ surefire-its ---
[INFO]
[INFO] --- maven-failsafe-plugin:3.0.0-M3:verify (default) @ surefire-its ---
[INFO] Failsafe report directory: C:\Users\jenkins\AppData\Local\Temp\2\jenkins-maven-box-maven-surefire-master-133@2\surefire-its\target\failsafe-reports
[INFO] ------------------------------------------------------------------------
[INFO] Reactor Summary:
[INFO]
[INFO] Apache Maven Surefire .............................. SUCCESS [ 43.688 s]
[INFO] SureFire Logger API ................................ SUCCESS [  9.303 s]
[INFO] SureFire API ....................................... SUCCESS [ 23.379 s]
[INFO] SureFire Booter .................................... SUCCESS [ 26.005 s]
[INFO] Maven Surefire Test-Grouping Support ............... SUCCESS [ 12.765 s]
[INFO] SureFire Providers ................................. SUCCESS [  2.257 s]
[INFO] Shared JUnit3 Provider Code ........................ SUCCESS [  9.025 s]
[INFO] Shared Java 5 Provider Base ........................ SUCCESS [  9.765 s]
[INFO] Shared JUnit4 Provider Code ........................ SUCCESS [ 11.484 s]
[INFO] Shared JUnit48 Provider Code ....................... SUCCESS [ 12.467 s]
[INFO] SureFire JUnit Runner .............................. SUCCESS [  9.664 s]
[INFO] SureFire JUnit4 Runner ............................. SUCCESS [  9.248 s]
[INFO] Maven Surefire Common .............................. SUCCESS [ 49.020 s]
[INFO] SureFire JUnitCore Runner .......................... SUCCESS [02:32 min]
[INFO] SureFire JUnit Platform Runner ..................... SUCCESS [ 21.526 s]
[INFO] SureFire TestNG Utils .............................. SUCCESS [  9.319 s]
[INFO] SureFire TestNG Runner ............................. SUCCESS [ 10.636 s]
[INFO] ShadeFire JUnit3 Provider .......................... SUCCESS [  3.114 s]
[INFO] Surefire Report Parser ............................. SUCCESS [ 12.434 s]
[INFO] Maven Surefire Plugin .............................. SUCCESS [ 20.401 s]
[INFO] Maven Failsafe Plugin .............................. SUCCESS [02:15 min]
[INFO] Maven Surefire Report Plugin ....................... SUCCESS [ 30.229 s]
[INFO] Maven Surefire Integration Tests ................... FAILURE [  02:06 h]
[INFO] ------------------------------------------------------------------------
[INFO] BUILD FAILURE
[INFO] ------------------------------------------------------------------------
[INFO] Total time: 02:16 h
[INFO] Finished at: 2019-02-01T07:58:05+00:00
[INFO] Final Memory: 49M/165M
[INFO] ------------------------------------------------------------------------
[ERROR] Failed to execute goal org.apache.maven.plugins:maven-failsafe-plugin:3.0.0-M3:verify (default) on project surefire-its: There are test failures.
[ERROR]
[ERROR] Please refer to C:\Users\jenkins\AppData\Local\Temp\2\jenkins-maven-box-maven-surefire-master-133@2\surefire-its\target\failsafe-reports for the individual test results.
[ERROR] Please refer to dump files (if any exist) [date].dump, [date]-jvmRun[N].dump and [date].dumpstream.
[ERROR] -> [Help 1]
org.apache.maven.lifecycle.LifecycleExecutionException: Failed to execute goal org.apache.maven.plugins:maven-failsafe-plugin:3.0.0-M3:verify (default) on project surefire-its: There are test failures.

Please refer to C:\Users\jenkins\AppData\Local\Temp\2\jenkins-maven-box-maven-surefire-master-133@2\surefire-its\target\failsafe-reports for the individual test results.
Please refer to dump files (if any exist) [date].dump, [date]-jvmRun[N].dump and [date].dumpstream.
        at org.apache.maven.lifecycle.internal.MojoExecutor.execute(MojoExecutor.java:212)
        at org.apache.maven.lifecycle.internal.MojoExecutor.execute(MojoExecutor.java:153)
        at org.apache.maven.lifecycle.internal.MojoExecutor.execute(MojoExecutor.java:145)
        at org.apache.maven.lifecycle.internal.LifecycleModuleBuilder.buildProject(LifecycleModuleBuilder.java:116)
        at org.apache.maven.lifecycle.internal.LifecycleModuleBuilder.buildProject(LifecycleModuleBuilder.java:80)
        at org.apache.maven.lifecycle.internal.builder.singlethreaded.SingleThreadedBuilder.build(SingleThreadedBuilder.java:51)
        at org.apache.maven.lifecycle.internal.LifecycleStarter.execute(LifecycleStarter.java:120)
        at org.apache.maven.DefaultMaven.doExecute(DefaultMaven.java:355)
        at org.apache.maven.DefaultMaven.execute(DefaultMaven.java:155)
        at org.apache.maven.cli.MavenCli.execute(MavenCli.java:584)
        at org.apache.maven.cli.MavenCli.doMain(MavenCli.java:216)
        at org.apache.maven.cli.MavenCli.main(MavenCli.java:160)
        at sun.reflect.NativeMethodAccessorImpl.invoke0(Native Method)
        at sun.reflect.NativeMethodAccessorImpl.invoke(NativeMethodAccessorImpl.java:62)
        at sun.reflect.DelegatingMethodAccessorImpl.invoke(DelegatingMethodAccessorImpl.java:43)
        at java.lang.reflect.Method.invoke(Method.java:498)
        at org.codehaus.plexus.classworlds.launcher.Launcher.launchEnhanced(Launcher.java:289)
        at org.codehaus.plexus.classworlds.launcher.Launcher.launch(Launcher.java:229)
        at org.codehaus.plexus.classworlds.launcher.Launcher.mainWithExitCode(Launcher.java:415)
        at org.codehaus.plexus.classworlds.launcher.Launcher.main(Launcher.java:356)
Caused by: org.apache.maven.plugin.MojoFailureException: There are test failures.

Please refer to C:\Users\jenkins\AppData\Local\Temp\2\jenkins-maven-box-maven-surefire-master-133@2\surefire-its\target\failsafe-reports for the individual test results.
Please refer to dump files (if any exist) [date].dump, [date]-jvmRun[N].dump and [date].dumpstream.
        at org.apache.maven.plugin.surefire.SurefireHelper.throwException(SurefireHelper.java:271)
        at org.apache.maven.plugin.surefire.SurefireHelper.reportExecution(SurefireHelper.java:159)
        at org.apache.maven.plugin.failsafe.VerifyMojo.execute(VerifyMojo.java:192)
        at org.apache.maven.plugin.DefaultBuildPluginManager.executeMojo(DefaultBuildPluginManager.java:132)
        at org.apache.maven.lifecycle.internal.MojoExecutor.execute(MojoExecutor.java:208)
        ... 19 more
[ERROR]
[ERROR] Re-run Maven using the -X switch to enable full debug logging.
[ERROR]
[ERROR] For more information about the errors and possible solutions, please read the following articles:
[ERROR] [Help 1] http://cwiki.apache.org/confluence/display/MAVEN/MojoFailureException
[ERROR]
[ERROR] After correcting the problems, you can resume the build with the command
[ERROR]   mvn <goals> -rf :surefire-its
[Pipeline] }
[Pipeline] // withEnv
[Pipeline] }
[Pipeline] // stage
[Pipeline] fileExists
[Pipeline] zip
Writing zip file of C:\Users\jenkins\AppData\Local\Temp\2\jenkins-maven-box-maven-surefire-master-133@2\maven-failsafe-plugin\target\it to C:\Users\jenkins\AppData\Local\Temp\2\jenkins-maven-box-maven-surefire-master-133@2\maven-failsafe-plugin--windows-jdk8-maven3.2.x.zip
Zipped 78 entries.
Archiving C:\Users\jenkins\AppData\Local\Temp\2\jenkins-maven-box-maven-surefire-master-133@2\maven-failsafe-plugin--windows-jdk8-maven3.2.x.zip
[Fast Archiver] No artifacts from Maven TLP » maven-surefire » master #131 to compare, so performing full copy of artifacts
[Pipeline] fileExists
[Pipeline] zip
Writing zip file of C:\Users\jenkins\AppData\Local\Temp\2\jenkins-maven-box-maven-surefire-master-133@2\surefire-its\target to C:\Users\jenkins\AppData\Local\Temp\2\jenkins-maven-box-maven-surefire-master-133@2\surefire-its--windows-jdk8-maven3.2.x.zip
Zipped 15951 entries.
Archiving C:\Users\jenkins\AppData\Local\Temp\2\jenkins-maven-box-maven-surefire-master-133@2\surefire-its--windows-jdk8-maven3.2.x.zip
[Fast Archiver] No artifacts from Maven TLP » maven-surefire » master #131 to compare, so performing full copy of artifacts
[Pipeline] archiveArtifacts
Archiving artifacts
[Fast Archiver] No artifacts from Maven TLP » maven-surefire » master #131 to compare, so performing full copy of artifacts
[Pipeline] cleanWs
[WS-CLEANUP] Deleting project workspace...
[WS-CLEANUP] Deferred wipeout is used...
[WS-CLEANUP] done
[Pipeline] }
[Pipeline] // ws
[Pipeline] }
[Pipeline] // timestamps
[Pipeline] }
[Pipeline] // node
[Pipeline] }
[Pipeline] // parallel
[Pipeline] echo
Build result: FAILURE
[Pipeline] jiraIssueSelector
[Pipeline] emailext
Reply | Threaded
Open this post in threaded view
|

Build failed in Jenkins: Maven TLP » maven-surefire » master #134

Apache Jenkins Server-2
See https://builds.apache.org/job/maven-box/job/maven-surefire/job/master/134/

No changes.

1 tests failed.
FAILED:  org.apache.maven.surefire.its.JUnitPlatformEnginesIT.platform[1.4.0-SNAPSHOT]

Error Message:

Expected: <[\[DEBUG\] test\(compact\) classpath:  test-classes  classes  junit-jupiter-engine-5\.4\.0-SNAPSHOT\.jar  apiguardian-api-1\.0\.0\.jar  junit-platform-engine-1\.4\.0-SNAPSHOT\.jar  junit-platform-commons-1\.4\.0-SNAPSHOT\.jar  opentest4j-1\.1\.1\.jar  junit-jupiter-api-5\.4\.0-SNAPSHOT\.jar]>
     but: was <[[DEBUG] test(compact) classpath:  test-classes  classes  junit-jupiter-engine-5.4.0-SNAPSHOT.jar  apiguardian-api-1.0.0.jar  junit-platform-engine-1.4.0-SNAPSHOT.jar  opentest4j-1.1.1.jar  junit-platform-commons-1.4.0-SNAPSHOT.jar  junit-jupiter-api-5.4.0-SNAPSHOT.jar]>

Stack Trace:
java.lang.AssertionError:

Expected: <[\[DEBUG\] test\(compact\) classpath:  test-classes  classes  junit-jupiter-engine-5\.4\.0-SNAPSHOT\.jar  apiguardian-api-1\.0\.0\.jar  junit-platform-engine-1\.4\.0-SNAPSHOT\.jar  junit-platform-commons-1\.4\.0-SNAPSHOT\.jar  opentest4j-1\.1\.1\.jar  junit-jupiter-api-5\.4\.0-SNAPSHOT\.jar]>
     but: was <[[DEBUG] test(compact) classpath:  test-classes  classes  junit-jupiter-engine-5.4.0-SNAPSHOT.jar  apiguardian-api-1.0.0.jar  junit-platform-engine-1.4.0-SNAPSHOT.jar  opentest4j-1.1.1.jar  junit-platform-commons-1.4.0-SNAPSHOT.jar  junit-jupiter-api-5.4.0-SNAPSHOT.jar]>
        at org.apache.maven.surefire.its.JUnitPlatformEnginesIT.platform(JUnitPlatformEnginesIT.java:111)




Build log:
[...truncated 93494 lines...]
[INFO] Tests run: 2, Failures: 0, Errors: 0, Skipped: 0, Time elapsed: 42.884 s - in org.apache.maven.surefire.its.jiras.Surefire1490ReportTitleDescriptionIT
[INFO] Running org.apache.maven.surefire.its.jiras.Surefire1534ReuseForksFalseWithJavaModuleIT
[INFO] Tests run: 3, Failures: 0, Errors: 0, Skipped: 0, Time elapsed: 31.826 s - in org.apache.maven.surefire.its.jiras.Surefire1534ReuseForksFalseWithJavaModuleIT
[INFO] Running org.apache.maven.surefire.its.jiras.Surefire1535TestNGParallelSuitesIT
[INFO] Tests run: 4, Failures: 0, Errors: 0, Skipped: 0, Time elapsed: 45.263 s - in org.apache.maven.surefire.its.jiras.Surefire1535TestNGParallelSuitesIT
[INFO] Running org.apache.maven.surefire.its.jiras.Surefire162CharsetProviderIT
[INFO] Tests run: 1, Failures: 0, Errors: 0, Skipped: 0, Time elapsed: 9.999 s - in org.apache.maven.surefire.its.jiras.Surefire162CharsetProviderIT
[INFO] Running org.apache.maven.surefire.its.jiras.Surefire224WellFormedXmlFailuresIT
[INFO] Tests run: 1, Failures: 0, Errors: 0, Skipped: 0, Time elapsed: 9.072 s - in org.apache.maven.surefire.its.jiras.Surefire224WellFormedXmlFailuresIT
[INFO] Running org.apache.maven.surefire.its.jiras.Surefire257NotRerunningTestsIT
[INFO] Tests run: 1, Failures: 0, Errors: 0, Skipped: 0, Time elapsed: 13.104 s - in org.apache.maven.surefire.its.jiras.Surefire257NotRerunningTestsIT
[INFO] Running org.apache.maven.surefire.its.jiras.Surefire260TestWithIdenticalNamesIT
[INFO] Tests run: 1, Failures: 0, Errors: 0, Skipped: 0, Time elapsed: 20.719 s - in org.apache.maven.surefire.its.jiras.Surefire260TestWithIdenticalNamesIT
[INFO] Running org.apache.maven.surefire.its.jiras.Surefire34SecurityManagerIT
[INFO] Tests run: 2, Failures: 0, Errors: 0, Skipped: 0, Time elapsed: 18.717 s - in org.apache.maven.surefire.its.jiras.Surefire34SecurityManagerIT
[INFO] Running org.apache.maven.surefire.its.jiras.Surefire376TestNgAfterSuiteFailureIT
[INFO] Tests run: 1, Failures: 0, Errors: 0, Skipped: 0, Time elapsed: 9.774 s - in org.apache.maven.surefire.its.jiras.Surefire376TestNgAfterSuiteFailureIT
[INFO] Running org.apache.maven.surefire.its.jiras.Surefire377TestNgAndJUnitTogetherIT
[INFO] Tests run: 2, Failures: 0, Errors: 0, Skipped: 0, Time elapsed: 18.722 s - in org.apache.maven.surefire.its.jiras.Surefire377TestNgAndJUnitTogetherIT
[INFO] Running org.apache.maven.surefire.its.jiras.Surefire408ManualProviderSelectionIT
[INFO] Tests run: 1, Failures: 0, Errors: 0, Skipped: 0, Time elapsed: 9.205 s - in org.apache.maven.surefire.its.jiras.Surefire408ManualProviderSelectionIT
[INFO] Running org.apache.maven.surefire.its.jiras.Surefire42NotExtendingTestCaseIT
[INFO] Tests run: 1, Failures: 0, Errors: 0, Skipped: 0, Time elapsed: 8.938 s - in org.apache.maven.surefire.its.jiras.Surefire42NotExtendingTestCaseIT
[INFO] Running org.apache.maven.surefire.its.jiras.Surefire44InnerClassTestIT
[INFO] Tests run: 1, Failures: 0, Errors: 0, Skipped: 0, Time elapsed: 8.877 s - in org.apache.maven.surefire.its.jiras.Surefire44InnerClassTestIT
[INFO] Running org.apache.maven.surefire.its.jiras.Surefire500PuzzlingErrorIT
[INFO] Tests run: 1, Failures: 0, Errors: 0, Skipped: 0, Time elapsed: 9.624 s - in org.apache.maven.surefire.its.jiras.Surefire500PuzzlingErrorIT
[INFO] Running org.apache.maven.surefire.its.jiras.Surefire510TestClassPathForkModesIT
[INFO] Tests run: 2, Failures: 0, Errors: 0, Skipped: 0, Time elapsed: 19.02 s - in org.apache.maven.surefire.its.jiras.Surefire510TestClassPathForkModesIT
[INFO] Running org.apache.maven.surefire.its.jiras.Surefire569RunTestFromDependencyJarsIT
[INFO] Tests run: 1, Failures: 0, Errors: 0, Skipped: 0, Time elapsed: 9.491 s - in org.apache.maven.surefire.its.jiras.Surefire569RunTestFromDependencyJarsIT
[INFO] Running org.apache.maven.surefire.its.jiras.Surefire570MultipleReportDirectoriesIT
[INFO] Tests run: 2, Failures: 0, Errors: 0, Skipped: 0, Time elapsed: 48.036 s - in org.apache.maven.surefire.its.jiras.Surefire570MultipleReportDirectoriesIT
[INFO] Running org.apache.maven.surefire.its.jiras.Surefire613TestCountInParallelIT
[INFO] Tests run: 1, Failures: 0, Errors: 0, Skipped: 0, Time elapsed: 11.845 s - in org.apache.maven.surefire.its.jiras.Surefire613TestCountInParallelIT
[INFO] Running org.apache.maven.surefire.its.jiras.Surefire621TestCountingJunit3InParallelIT
[INFO] Tests run: 5, Failures: 0, Errors: 0, Skipped: 0, Time elapsed: 57.385 s - in org.apache.maven.surefire.its.jiras.Surefire621TestCountingJunit3InParallelIT
[INFO] Running org.apache.maven.surefire.its.jiras.Surefire628ConsoleOutputBeforeAndAfterClassIT
[INFO] Tests run: 1, Failures: 0, Errors: 0, Skipped: 0, Time elapsed: 11.278 s - in org.apache.maven.surefire.its.jiras.Surefire628ConsoleOutputBeforeAndAfterClassIT
[INFO] Running org.apache.maven.surefire.its.jiras.Surefire634UnsettableSystemPropertiesWarningIT
[INFO] Tests run: 1, Failures: 0, Errors: 0, Skipped: 0, Time elapsed: 10.526 s - in org.apache.maven.surefire.its.jiras.Surefire634UnsettableSystemPropertiesWarningIT
[INFO] Running org.apache.maven.surefire.its.jiras.Surefire649EmptyStringSystemPropertiesIT
[INFO] Tests run: 2, Failures: 0, Errors: 0, Skipped: 0, Time elapsed: 16.582 s - in org.apache.maven.surefire.its.jiras.Surefire649EmptyStringSystemPropertiesIT
[INFO] Running org.apache.maven.surefire.its.jiras.Surefire673MockitoIT
[INFO] Tests run: 1, Failures: 0, Errors: 0, Skipped: 0, Time elapsed: 11.23 s - in org.apache.maven.surefire.its.jiras.Surefire673MockitoIT
[INFO] Running org.apache.maven.surefire.its.jiras.Surefire674BuildFailingWhenErrorsIT
[INFO] Tests run: 1, Failures: 0, Errors: 0, Skipped: 0, Time elapsed: 9.3 s - in org.apache.maven.surefire.its.jiras.Surefire674BuildFailingWhenErrorsIT
[INFO] Running org.apache.maven.surefire.its.jiras.Surefire674BuildFailingWhenFailsafeErrorsIT
[INFO] Tests run: 1, Failures: 0, Errors: 0, Skipped: 0, Time elapsed: 6.734 s - in org.apache.maven.surefire.its.jiras.Surefire674BuildFailingWhenFailsafeErrorsIT
[INFO] Running org.apache.maven.surefire.its.jiras.Surefire685CommaSeparatedIncludesIT
[INFO] Tests run: 1, Failures: 0, Errors: 0, Skipped: 0, Time elapsed: 9.001 s - in org.apache.maven.surefire.its.jiras.Surefire685CommaSeparatedIncludesIT
[INFO] Running org.apache.maven.surefire.its.jiras.Surefire697NiceSummaryIT
[INFO] Tests run: 1, Failures: 0, Errors: 0, Skipped: 0, Time elapsed: 9.147 s - in org.apache.maven.surefire.its.jiras.Surefire697NiceSummaryIT
[INFO] Running org.apache.maven.surefire.its.jiras.Surefire705ParallelForkTimeoutIT
[INFO] Tests run: 1, Failures: 0, Errors: 0, Skipped: 0, Time elapsed: 11.522 s - in org.apache.maven.surefire.its.jiras.Surefire705ParallelForkTimeoutIT
[INFO] Running org.apache.maven.surefire.its.jiras.Surefire733AllOverrridesCapturedIT
[INFO] Tests run: 1, Failures: 0, Errors: 0, Skipped: 0, Time elapsed: 9.072 s - in org.apache.maven.surefire.its.jiras.Surefire733AllOverrridesCapturedIT
[INFO] Running org.apache.maven.surefire.its.jiras.Surefire735ForkFailWithRedirectConsoleOutputIT
[INFO] Tests run: 2, Failures: 0, Errors: 0, Skipped: 0, Time elapsed: 16.346 s - in org.apache.maven.surefire.its.jiras.Surefire735ForkFailWithRedirectConsoleOutputIT
[INFO] Running org.apache.maven.surefire.its.jiras.Surefire740TruncatedCommaIT
[INFO] Tests run: 1, Failures: 0, Errors: 0, Skipped: 0, Time elapsed: 7.678 s - in org.apache.maven.surefire.its.jiras.Surefire740TruncatedCommaIT
[INFO] Running org.apache.maven.surefire.its.jiras.Surefire747MethodParallelWithSuiteCountIT
[INFO] Tests run: 2, Failures: 0, Errors: 0, Skipped: 0, Time elapsed: 29.834 s - in org.apache.maven.surefire.its.jiras.Surefire747MethodParallelWithSuiteCountIT
[INFO] Running org.apache.maven.surefire.its.jiras.Surefire772BothReportsIT
[INFO] Tests run: 3, Failures: 0, Errors: 0, Skipped: 0, Time elapsed: 17.752 s - in org.apache.maven.surefire.its.jiras.Surefire772BothReportsIT
[INFO] Running org.apache.maven.surefire.its.jiras.Surefire772NoFailsafeReportsIT
[INFO] Tests run: 4, Failures: 0, Errors: 0, Skipped: 0, Time elapsed: 26.113 s - in org.apache.maven.surefire.its.jiras.Surefire772NoFailsafeReportsIT
[INFO] Running org.apache.maven.surefire.its.jiras.Surefire772NoSurefireReportsIT
[INFO] Tests run: 4, Failures: 0, Errors: 0, Skipped: 0, Time elapsed: 23.48 s - in org.apache.maven.surefire.its.jiras.Surefire772NoSurefireReportsIT
[INFO] Running org.apache.maven.surefire.its.jiras.Surefire772SpecifiedReportsIT
[INFO] Tests run: 3, Failures: 0, Errors: 0, Skipped: 0, Time elapsed: 17.788 s - in org.apache.maven.surefire.its.jiras.Surefire772SpecifiedReportsIT
[INFO] Running org.apache.maven.surefire.its.jiras.Surefire801ForkModeNoneClassLoaderIT
[INFO] Tests run: 1, Failures: 0, Errors: 0, Skipped: 0, Time elapsed: 7.597 s - in org.apache.maven.surefire.its.jiras.Surefire801ForkModeNoneClassLoaderIT
[INFO] Running org.apache.maven.surefire.its.jiras.Surefire803MultiFailsafeExecsIT
[INFO] Tests run: 2, Failures: 0, Errors: 0, Skipped: 0, Time elapsed: 33.066 s - in org.apache.maven.surefire.its.jiras.Surefire803MultiFailsafeExecsIT
[INFO] Running org.apache.maven.surefire.its.jiras.Surefire806SpecifiedTestControlsIT
[WARNING] Tests run: 3, Failures: 0, Errors: 0, Skipped: 2, Time elapsed: 9.278 s - in org.apache.maven.surefire.its.jiras.Surefire806SpecifiedTestControlsIT
[INFO] Running org.apache.maven.surefire.its.jiras.Surefire809GroupExpressionsIT
[INFO] Tests run: 6, Failures: 0, Errors: 0, Skipped: 0, Time elapsed: 55.99 s - in org.apache.maven.surefire.its.jiras.Surefire809GroupExpressionsIT
[INFO] Running org.apache.maven.surefire.its.jiras.Surefire812Log4JClassLoaderIT
[INFO] Tests run: 1, Failures: 0, Errors: 0, Skipped: 0, Time elapsed: 12.071 s - in org.apache.maven.surefire.its.jiras.Surefire812Log4JClassLoaderIT
[INFO] Running org.apache.maven.surefire.its.jiras.Surefire817SystemExitIT
[INFO] Tests run: 1, Failures: 0, Errors: 0, Skipped: 0, Time elapsed: 10.154 s - in org.apache.maven.surefire.its.jiras.Surefire817SystemExitIT
[INFO] Running org.apache.maven.surefire.its.jiras.Surefire818NpeIgnoresTestsIT
[INFO] Tests run: 1, Failures: 0, Errors: 0, Skipped: 0, Time elapsed: 11.325 s - in org.apache.maven.surefire.its.jiras.Surefire818NpeIgnoresTestsIT
[INFO] Running org.apache.maven.surefire.its.jiras.Surefire828EmptyGroupExprIT
[INFO] Tests run: 4, Failures: 0, Errors: 0, Skipped: 0, Time elapsed: 41.374 s - in org.apache.maven.surefire.its.jiras.Surefire828EmptyGroupExprIT
[INFO] Running org.apache.maven.surefire.its.jiras.Surefire832ProviderSelectionIT
[INFO] Tests run: 1, Failures: 0, Errors: 0, Skipped: 0, Time elapsed: 10.464 s - in org.apache.maven.surefire.its.jiras.Surefire832ProviderSelectionIT
[INFO] Running org.apache.maven.surefire.its.jiras.Surefire839TestWithoutCategoriesIT
[INFO] Tests run: 2, Failures: 0, Errors: 0, Skipped: 0, Time elapsed: 20.374 s - in org.apache.maven.surefire.its.jiras.Surefire839TestWithoutCategoriesIT
[INFO] Running org.apache.maven.surefire.its.jiras.Surefire847AdditionalFailureIT
[INFO] Tests run: 1, Failures: 0, Errors: 0, Skipped: 0, Time elapsed: 11.574 s - in org.apache.maven.surefire.its.jiras.Surefire847AdditionalFailureIT
[INFO] Running org.apache.maven.surefire.its.jiras.Surefire855AllowFailsafeUseArtifactFileIT
[INFO] Tests run: 4, Failures: 0, Errors: 0, Skipped: 0, Time elapsed: 79.297 s - in org.apache.maven.surefire.its.jiras.Surefire855AllowFailsafeUseArtifactFileIT
[INFO] Running org.apache.maven.surefire.its.jiras.Surefire901MIssingResultfileWhenNoTestsIT
[INFO] Tests run: 1, Failures: 0, Errors: 0, Skipped: 0, Time elapsed: 7.863 s - in org.apache.maven.surefire.its.jiras.Surefire901MIssingResultfileWhenNoTestsIT
[INFO] Running org.apache.maven.surefire.its.jiras.Surefire907PerThreadWithoutThreadCountIT
[INFO] Tests run: 1, Failures: 0, Errors: 0, Skipped: 0, Time elapsed: 6.83 s - in org.apache.maven.surefire.its.jiras.Surefire907PerThreadWithoutThreadCountIT
[INFO] Running org.apache.maven.surefire.its.jiras.Surefire920TestFailureIgnoreWithTimeoutIT
[INFO] Tests run: 2, Failures: 0, Errors: 0, Skipped: 0, Time elapsed: 22.334 s - in org.apache.maven.surefire.its.jiras.Surefire920TestFailureIgnoreWithTimeoutIT
[INFO] Running org.apache.maven.surefire.its.jiras.Surefire926FailureWith2ProvidersIT
[INFO] Tests run: 1, Failures: 0, Errors: 0, Skipped: 0, Time elapsed: 7.58 s - in org.apache.maven.surefire.its.jiras.Surefire926FailureWith2ProvidersIT
[INFO] Running org.apache.maven.surefire.its.jiras.Surefire930TestNgSuiteXmlIT
[INFO] Tests run: 1, Failures: 0, Errors: 0, Skipped: 0, Time elapsed: 11.943 s - in org.apache.maven.surefire.its.jiras.Surefire930TestNgSuiteXmlIT
[INFO] Running org.apache.maven.surefire.its.jiras.Surefire943ReportContentIT
[INFO] Tests run: 2, Failures: 0, Errors: 0, Skipped: 0, Time elapsed: 38.193 s - in org.apache.maven.surefire.its.jiras.Surefire943ReportContentIT
[INFO] Running org.apache.maven.surefire.its.jiras.Surefire946KillMainProcessInReusableForkIT
[INFO] Tests run: 3, Failures: 0, Errors: 0, Skipped: 0, Time elapsed: 28.27 s - in org.apache.maven.surefire.its.jiras.Surefire946KillMainProcessInReusableForkIT
[INFO] Running org.apache.maven.surefire.its.jiras.Surefire972BizarreNoClassDefIT
[INFO] Tests run: 1, Failures: 0, Errors: 0, Skipped: 0, Time elapsed: 13.662 s - in org.apache.maven.surefire.its.jiras.Surefire972BizarreNoClassDefIT
[INFO] Running org.apache.maven.surefire.its.jiras.Surefire975DefaultVMEncodingIT
[INFO] Tests run: 1, Failures: 0, Errors: 0, Skipped: 0, Time elapsed: 10.586 s - in org.apache.maven.surefire.its.jiras.Surefire975DefaultVMEncodingIT
[INFO] Running org.apache.maven.surefire.its.jiras.Surefire979WrongClassLoaderIT
[INFO] Tests run: 1, Failures: 0, Errors: 0, Skipped: 0, Time elapsed: 10.095 s - in org.apache.maven.surefire.its.jiras.Surefire979WrongClassLoaderIT
[INFO] Running org.apache.maven.surefire.its.jiras.Surefire985ParameterizedRunnerAndCategoriesIT
[INFO] Tests run: 1, Failures: 0, Errors: 0, Skipped: 0, Time elapsed: 8.682 s - in org.apache.maven.surefire.its.jiras.Surefire985ParameterizedRunnerAndCategoriesIT
[INFO] Running org.apache.maven.surefire.its.jiras.Surefire995CategoryInheritanceIT
[INFO] Tests run: 5, Failures: 0, Errors: 0, Skipped: 0, Time elapsed: 44.712 s - in org.apache.maven.surefire.its.jiras.Surefire995CategoryInheritanceIT
[INFO]
[INFO] Results:
[INFO]
[ERROR] Failures:
[ERROR]   JUnitPlatformEnginesIT.platform:111
Expected: <[\[DEBUG\] test\(compact\) classpath:  test-classes  classes  junit-jupiter-engine-5\.4\.0-SNAPSHOT\.jar  apiguardian-api-1\.0\.0\.jar  junit-platform-engine-1\.4\.0-SNAPSHOT\.jar  junit-platform-commons-1\.4\.0-SNAPSHOT\.jar  opentest4j-1\.1\.1\.jar  junit-jupiter-api-5\.4\.0-SNAPSHOT\.jar]>
     but: was <[[DEBUG] test(compact) classpath:  test-classes  classes  junit-jupiter-engine-5.4.0-SNAPSHOT.jar  apiguardian-api-1.0.0.jar  junit-platform-engine-1.4.0-SNAPSHOT.jar  opentest4j-1.1.1.jar  junit-platform-commons-1.4.0-SNAPSHOT.jar  junit-jupiter-api-5.4.0-SNAPSHOT.jar]>
[INFO]
[ERROR] Tests run: 789, Failures: 1, Errors: 0, Skipped: 142
[INFO]
[INFO]
[INFO] --- maven-checkstyle-plugin:3.0.0:check (checkstyle-check) @ surefire-its ---
[INFO]
[INFO] --- maven-failsafe-plugin:3.0.0-M3:verify (default) @ surefire-its ---
[INFO] Failsafe report directory: C:\Users\jenkins\AppData\Local\Temp\2\jenkins-maven-box-maven-surefire-master-134\surefire-its\target\failsafe-reports
[INFO] ------------------------------------------------------------------------
[INFO] Reactor Summary:
[INFO]
[INFO] Apache Maven Surefire .............................. SUCCESS [ 44.607 s]
[INFO] SureFire Logger API ................................ SUCCESS [ 12.324 s]
[INFO] SureFire API ....................................... SUCCESS [ 26.002 s]
[INFO] SureFire Booter .................................... SUCCESS [ 30.607 s]
[INFO] Maven Surefire Test-Grouping Support ............... SUCCESS [ 16.801 s]
[INFO] SureFire Providers ................................. SUCCESS [  2.574 s]
[INFO] Shared JUnit3 Provider Code ........................ SUCCESS [ 13.883 s]
[INFO] Shared Java 5 Provider Base ........................ SUCCESS [ 15.181 s]
[INFO] Shared JUnit4 Provider Code ........................ SUCCESS [ 15.359 s]
[INFO] Shared JUnit48 Provider Code ....................... SUCCESS [ 15.253 s]
[INFO] SureFire JUnit Runner .............................. SUCCESS [ 13.824 s]
[INFO] SureFire JUnit4 Runner ............................. SUCCESS [ 44.358 s]
[INFO] Maven Surefire Common .............................. SUCCESS [01:01 min]
[INFO] SureFire JUnitCore Runner .......................... SUCCESS [02:32 min]
[INFO] SureFire JUnit Platform Runner ..................... SUCCESS [ 25.323 s]
[INFO] SureFire TestNG Utils .............................. SUCCESS [ 12.994 s]
[INFO] SureFire TestNG Runner ............................. SUCCESS [ 15.491 s]
[INFO] ShadeFire JUnit3 Provider .......................... SUCCESS [  2.890 s]
[INFO] Surefire Report Parser ............................. SUCCESS [ 14.765 s]
[INFO] Maven Surefire Plugin .............................. SUCCESS [ 22.587 s]
[INFO] Maven Failsafe Plugin .............................. SUCCESS [02:26 min]
[INFO] Maven Surefire Report Plugin ....................... SUCCESS [ 26.795 s]
[INFO] Maven Surefire Integration Tests ................... FAILURE [  01:58 h]
[INFO] ------------------------------------------------------------------------
[INFO] BUILD FAILURE
[INFO] ------------------------------------------------------------------------
[INFO] Total time: 02:11 h
[INFO] Finished at: 2019-02-01T14:42:48+00:00
[INFO] Final Memory: 50M/166M
[INFO] ------------------------------------------------------------------------
[ERROR] Failed to execute goal org.apache.maven.plugins:maven-failsafe-plugin:3.0.0-M3:verify (default) on project surefire-its: There are test failures.
[ERROR]
[ERROR] Please refer to C:\Users\jenkins\AppData\Local\Temp\2\jenkins-maven-box-maven-surefire-master-134\surefire-its\target\failsafe-reports for the individual test results.
[ERROR] Please refer to dump files (if any exist) [date].dump, [date]-jvmRun[N].dump and [date].dumpstream.
[ERROR] -> [Help 1]
org.apache.maven.lifecycle.LifecycleExecutionException: Failed to execute goal org.apache.maven.plugins:maven-failsafe-plugin:3.0.0-M3:verify (default) on project surefire-its: There are test failures.

Please refer to C:\Users\jenkins\AppData\Local\Temp\2\jenkins-maven-box-maven-surefire-master-134\surefire-its\target\failsafe-reports for the individual test results.
Please refer to dump files (if any exist) [date].dump, [date]-jvmRun[N].dump and [date].dumpstream.
        at org.apache.maven.lifecycle.internal.MojoExecutor.execute(MojoExecutor.java:212)
        at org.apache.maven.lifecycle.internal.MojoExecutor.execute(MojoExecutor.java:153)
        at org.apache.maven.lifecycle.internal.MojoExecutor.execute(MojoExecutor.java:145)
        at org.apache.maven.lifecycle.internal.LifecycleModuleBuilder.buildProject(LifecycleModuleBuilder.java:116)
        at org.apache.maven.lifecycle.internal.LifecycleModuleBuilder.buildProject(LifecycleModuleBuilder.java:80)
        at org.apache.maven.lifecycle.internal.builder.singlethreaded.SingleThreadedBuilder.build(SingleThreadedBuilder.java:51)
        at org.apache.maven.lifecycle.internal.LifecycleStarter.execute(LifecycleStarter.java:120)
        at org.apache.maven.DefaultMaven.doExecute(DefaultMaven.java:355)
        at org.apache.maven.DefaultMaven.execute(DefaultMaven.java:155)
        at org.apache.maven.cli.MavenCli.execute(MavenCli.java:584)
        at org.apache.maven.cli.MavenCli.doMain(MavenCli.java:216)
        at org.apache.maven.cli.MavenCli.main(MavenCli.java:160)
        at sun.reflect.NativeMethodAccessorImpl.invoke0(Native Method)
        at sun.reflect.NativeMethodAccessorImpl.invoke(NativeMethodAccessorImpl.java:62)
        at sun.reflect.DelegatingMethodAccessorImpl.invoke(DelegatingMethodAccessorImpl.java:43)
        at java.lang.reflect.Method.invoke(Method.java:498)
        at org.codehaus.plexus.classworlds.launcher.Launcher.launchEnhanced(Launcher.java:289)
        at org.codehaus.plexus.classworlds.launcher.Launcher.launch(Launcher.java:229)
        at org.codehaus.plexus.classworlds.launcher.Launcher.mainWithExitCode(Launcher.java:415)
        at org.codehaus.plexus.classworlds.launcher.Launcher.main(Launcher.java:356)
Caused by: org.apache.maven.plugin.MojoFailureException: There are test failures.

Please refer to C:\Users\jenkins\AppData\Local\Temp\2\jenkins-maven-box-maven-surefire-master-134\surefire-its\target\failsafe-reports for the individual test results.
Please refer to dump files (if any exist) [date].dump, [date]-jvmRun[N].dump and [date].dumpstream.
        at org.apache.maven.plugin.surefire.SurefireHelper.throwException(SurefireHelper.java:271)
        at org.apache.maven.plugin.surefire.SurefireHelper.reportExecution(SurefireHelper.java:159)
        at org.apache.maven.plugin.failsafe.VerifyMojo.execute(VerifyMojo.java:192)
        at org.apache.maven.plugin.DefaultBuildPluginManager.executeMojo(DefaultBuildPluginManager.java:132)
        at org.apache.maven.lifecycle.internal.MojoExecutor.execute(MojoExecutor.java:208)
        ... 19 more
[ERROR]
[ERROR] Re-run Maven using the -X switch to enable full debug logging.
[ERROR]
[ERROR] For more information about the errors and possible solutions, please read the following articles:
[ERROR] [Help 1] http://cwiki.apache.org/confluence/display/MAVEN/MojoFailureException
[ERROR]
[ERROR] After correcting the problems, you can resume the build with the command
[ERROR]   mvn <goals> -rf :surefire-its
[Pipeline] }
[Pipeline] // withEnv
[Pipeline] }
[Pipeline] // stage
[Pipeline] fileExists
[Pipeline] zip
Writing zip file of C:\Users\jenkins\AppData\Local\Temp\2\jenkins-maven-box-maven-surefire-master-134\maven-failsafe-plugin\target\it to C:\Users\jenkins\AppData\Local\Temp\2\jenkins-maven-box-maven-surefire-master-134\maven-failsafe-plugin--windows-jdk11-maven3.2.x.zip
Zipped 78 entries.
Archiving C:\Users\jenkins\AppData\Local\Temp\2\jenkins-maven-box-maven-surefire-master-134\maven-failsafe-plugin--windows-jdk11-maven3.2.x.zip
[Fast Archiver] No artifacts from Maven TLP » maven-surefire » master #131 to compare, so performing full copy of artifacts
[Pipeline] fileExists
[Pipeline] zip
Writing zip file of C:\Users\jenkins\AppData\Local\Temp\2\jenkins-maven-box-maven-surefire-master-134\surefire-its\target to C:\Users\jenkins\AppData\Local\Temp\2\jenkins-maven-box-maven-surefire-master-134\surefire-its--windows-jdk11-maven3.2.x.zip
Zipped 16270 entries.
Archiving C:\Users\jenkins\AppData\Local\Temp\2\jenkins-maven-box-maven-surefire-master-134\surefire-its--windows-jdk11-maven3.2.x.zip
[Fast Archiver] No artifacts from Maven TLP » maven-surefire » master #131 to compare, so performing full copy of artifacts
[Pipeline] archiveArtifacts
Archiving artifacts
[Fast Archiver] No artifacts from Maven TLP » maven-surefire » master #131 to compare, so performing full copy of artifacts
[Pipeline] cleanWs
[WS-CLEANUP] Deleting project workspace...
[WS-CLEANUP] Deferred wipeout is used...
[WS-CLEANUP] done
[Pipeline] }
[Pipeline] // ws
[Pipeline] }
[Pipeline] // timestamps
[Pipeline] }
[Pipeline] // node
[Pipeline] }
[Pipeline] // parallel
[Pipeline] echo
Build result: FAILURE
[Pipeline] jiraIssueSelector
[Pipeline] emailext
Reply | Threaded
Open this post in threaded view
|

Build succeeded in Jenkins: Maven TLP » maven-surefire » master #135

Apache Jenkins Server-2
See https://builds.apache.org/job/maven-box/job/maven-surefire/job/master/135/

Changes:

* build fix JUnitPlatformEnginesIT
* build fix JUnitPlatformEnginesIT
* build fix JUnitPlatformEnginesIT
* build fix JUnitPlatformEnginesIT
* build fix JUnitPlatformEnginesIT
* build fix JUnitPlatformEnginesIT
* build fix JUnitPlatformEnginesIT
* build fix JUnitPlatformEnginesIT
* build fix JUnitPlatformEnginesIT

All tests passed