Build failed in Jenkins: Maven TLP » maven-surefire » junit5-runorder #1

classic Classic list List threaded Threaded
4 messages Options
Reply | Threaded
Open this post in threaded view
|

Build failed in Jenkins: Maven TLP » maven-surefire » junit5-runorder #1

Apache Jenkins Server-2
See https://builds.apache.org/job/maven-box/job/maven-surefire/job/junit5-runorder/1/

No changes.

All tests passed

Build log:
[...truncated 44042 lines...]
[2019-12-01T03:51:23.413Z] [INFO] SureFire API ....................................... SUCCESS [ 15.210 s]
[2019-12-01T03:51:23.413Z] [INFO] Surefire Extensions API ............................ SUCCESS [  2.907 s]
[2019-12-01T03:51:23.413Z] [INFO] SureFire Booter .................................... SUCCESS [ 16.798 s]
[2019-12-01T03:51:23.413Z] [INFO] Maven Surefire Test-Grouping Support ............... SUCCESS [  7.037 s]
[2019-12-01T03:51:23.413Z] [INFO] SureFire Providers ................................. SUCCESS [  1.398 s]
[2019-12-01T03:51:23.413Z] [INFO] Shared JUnit3 Provider Code ........................ SUCCESS [  4.668 s]
[2019-12-01T03:51:23.413Z] [INFO] Shared Java 5 Provider Base ........................ SUCCESS [  5.696 s]
[2019-12-01T03:51:23.413Z] [INFO] Shared JUnit4 Provider Code ........................ SUCCESS [  5.906 s]
[2019-12-01T03:51:23.413Z] [INFO] Shared JUnit48 Provider Code ....................... SUCCESS [  7.281 s]
[2019-12-01T03:51:23.413Z] [INFO] SureFire JUnit Runner .............................. SUCCESS [  5.255 s]
[2019-12-01T03:51:23.413Z] [INFO] SureFire JUnit4 Runner ............................. SUCCESS [  5.129 s]
[2019-12-01T03:51:23.413Z] [INFO] Maven Surefire Common .............................. SUCCESS [ 51.985 s]
[2019-12-01T03:51:23.413Z] [INFO] SureFire JUnitCore Runner .......................... SUCCESS [02:22 min]
[2019-12-01T03:51:23.413Z] [INFO] SureFire JUnit Platform Runner ..................... SUCCESS [ 15.003 s]
[2019-12-01T03:51:23.413Z] [INFO] SureFire TestNG Utils .............................. SUCCESS [  5.523 s]
[2019-12-01T03:51:23.413Z] [INFO] SureFire TestNG Runner ............................. SUCCESS [  6.300 s]
[2019-12-01T03:51:23.413Z] [INFO] ShadeFire JUnit3 Provider .......................... SUCCESS [  2.299 s]
[2019-12-01T03:51:23.413Z] [INFO] Surefire Report Parser ............................. SUCCESS [  7.293 s]
[2019-12-01T03:51:23.413Z] [INFO] Maven Surefire Plugin .............................. SUCCESS [ 13.297 s]
[2019-12-01T03:51:23.413Z] [INFO] Maven Failsafe Plugin .............................. SUCCESS [01:10 min]
[2019-12-01T03:51:23.413Z] [INFO] Maven Surefire Report Plugin ....................... SUCCESS [ 18.948 s]
[2019-12-01T03:51:23.414Z] [INFO] Maven Surefire Integration Tests ................... SUCCESS [  01:17 h]
[2019-12-01T03:51:23.414Z] [INFO] Surefire Shared Utils .............................. SUCCESS [02:39 min]
[2019-12-01T03:51:23.414Z] [INFO] ------------------------------------------------------------------------
[2019-12-01T03:51:23.414Z] [INFO] BUILD SUCCESS
[2019-12-01T03:51:23.414Z] [INFO] ------------------------------------------------------------------------
[2019-12-01T03:51:23.414Z] [INFO] Total time:  01:27 h
[2019-12-01T03:51:23.414Z] [INFO] Finished at: 2019-12-01T03:51:09Z
[2019-12-01T03:51:23.414Z] [INFO] ------------------------------------------------------------------------
[Pipeline] }
[Pipeline] // withEnv
[Pipeline] }
[Pipeline] // stage
[Pipeline] openTasks
[2019-12-01T03:51:24.121Z] [TASKS] Skipping publisher since build result is FAILURE
[Pipeline] jacoco
[Pipeline] junit
[2019-12-01T03:51:24.489Z] Recording test results
[Pipeline] fileExists
[Pipeline] zip
[2019-12-01T03:51:27.913Z] Writing zip file of /home/jenkins/jenkins-slave/workspace/x_maven-surefire_junit5-runorder@2/maven-failsafe-plugin/target/it to /home/jenkins/jenkins-slave/workspace/x_maven-surefire_junit5-runorder@2/maven-failsafe-plugin--linux-jdk14-maven3.6.x.zip
[2019-12-01T03:51:28.095Z] Zipped 78 entries.
[2019-12-01T03:51:28.096Z] Archiving /home/jenkins/jenkins-slave/workspace/x_maven-surefire_junit5-runorder@2/maven-failsafe-plugin--linux-jdk14-maven3.6.x.zip
[2019-12-01T03:51:28.096Z] [Fast Archiver] No prior successful build to compare, so performing full copy of artifacts
[Pipeline] fileExists
[Pipeline] zip
[2019-12-01T03:51:29.034Z] Writing zip file of /home/jenkins/jenkins-slave/workspace/x_maven-surefire_junit5-runorder@2/surefire-its/target to /home/jenkins/jenkins-slave/workspace/x_maven-surefire_junit5-runorder@2/surefire-its--linux-jdk14-maven3.6.x.zip
[2019-12-01T03:51:41.811Z] Zipped 18353 entries.
[2019-12-01T03:51:41.811Z] Archiving /home/jenkins/jenkins-slave/workspace/x_maven-surefire_junit5-runorder@2/surefire-its--linux-jdk14-maven3.6.x.zip
[2019-12-01T03:51:41.811Z] [Fast Archiver] No prior successful build to compare, so performing full copy of artifacts
[Pipeline] archiveArtifacts
[2019-12-01T03:51:47.135Z] Archiving artifacts
[2019-12-01T03:51:47.291Z] [Fast Archiver] No prior successful build to compare, so performing full copy of artifacts
[2019-12-01T03:51:48.472Z] [INFO] Tests run: 5, Failures: 0, Errors: 0, Skipped: 0, Time elapsed: 28.889 s - in org.apache.maven.surefire.its.jiras.Surefire995CategoryInheritanceIT
[2019-12-01T03:51:48.473Z] [INFO]
[2019-12-01T03:51:48.473Z] [INFO] Results:
[2019-12-01T03:51:48.473Z] [INFO]
[2019-12-01T03:51:48.473Z] [WARNING] Tests run: 861, Failures: 0, Errors: 0, Skipped: 135
[2019-12-01T03:51:48.473Z] [INFO]
[2019-12-01T03:51:48.473Z] [INFO]
[2019-12-01T03:51:48.473Z] [INFO] --- maven-checkstyle-plugin:3.0.0:check (checkstyle-check) @ surefire-its ---
[2019-12-01T03:51:50.602Z] [INFO]
[2019-12-01T03:51:50.602Z] [INFO] --- maven-failsafe-plugin:3.0.0-M4:verify (default) @ surefire-its ---
[2019-12-01T03:51:50.602Z] [INFO] Failsafe report directory: /home/jenkins/jenkins-slave/workspace/x_maven-surefire_junit5-runorder@2@2/surefire-its/target/failsafe-reports
[2019-12-01T03:51:50.602Z] [INFO]
[2019-12-01T03:51:50.602Z] [INFO] --- maven-install-plugin:2.5.2:install (default-install) @ surefire-its ---
[2019-12-01T03:51:50.602Z] [INFO] Skipping artifact installation
[2019-12-01T03:51:50.602Z] [INFO]
[2019-12-01T03:51:50.602Z] [INFO] ----------< org.apache.maven.surefire:surefire-shared-utils >-----------
[2019-12-01T03:51:50.602Z] [INFO] Building Surefire Shared Utils 3.0.0-SNAPSHOT                    [25/25]
[2019-12-01T03:51:50.602Z] [INFO] --------------------------------[ jar ]---------------------------------
[2019-12-01T03:51:50.602Z] [INFO]
[2019-12-01T03:51:50.602Z] [INFO] --- maven-clean-plugin:3.1.0:clean (default-clean) @ surefire-shared-utils ---
[2019-12-01T03:51:50.602Z] [INFO]
[2019-12-01T03:51:50.602Z] [INFO] --- maven-enforcer-plugin:3.0.0-M2:enforce (enforce-maven-version) @ surefire-shared-utils ---
[2019-12-01T03:51:50.602Z] [INFO]
[2019-12-01T03:51:50.602Z] [INFO] --- maven-enforcer-plugin:3.0.0-M2:enforce (enforce-bytecode-version) @ surefire-shared-utils ---
[2019-12-01T03:51:50.602Z] [INFO]
[2019-12-01T03:51:50.602Z] [INFO] --- maven-enforcer-plugin:3.0.0-M2:enforce (ban-known-bad-maven-versions) @ surefire-shared-utils ---
[2019-12-01T03:51:50.602Z] [INFO]
[2019-12-01T03:51:50.602Z] [INFO] --- maven-enforcer-plugin:3.0.0-M2:enforce (enforce-java) @ surefire-shared-utils ---
[2019-12-01T03:51:50.602Z] [INFO]
[2019-12-01T03:51:50.602Z] [INFO] --- maven-enforcer-plugin:3.0.0-M2:enforce (enforce-maven) @ surefire-shared-utils ---
[2019-12-01T03:51:50.602Z] [INFO]
[2019-12-01T03:51:50.602Z] [INFO] --- apache-rat-plugin:0.12:check (rat-check) @ surefire-shared-utils ---
[2019-12-01T03:51:50.602Z] [INFO] Enabled default license matchers.
[2019-12-01T03:51:50.602Z] [INFO] Will parse SCM ignores for exclusions...
[2019-12-01T03:51:50.602Z] [INFO] Finished adding exclusions from SCM ignore files.
[2019-12-01T03:51:50.602Z] [INFO] 61 implicit excludes (use -debug for more details).
[2019-12-01T03:51:50.602Z] [INFO] Exclude: .repository/**
[2019-12-01T03:51:50.602Z] [INFO] Exclude: .maven/spy.log
[2019-12-01T03:51:50.602Z] [INFO] Exclude: dependency-reduced-pom.xml
[2019-12-01T03:51:50.602Z] [INFO] Exclude: .java-version
[2019-12-01T03:51:50.602Z] [INFO] Exclude: Jenkinsfile
[2019-12-01T03:51:50.602Z] [INFO] Exclude: README.md
[2019-12-01T03:51:50.602Z] [INFO] Exclude: .editorconfig
[2019-12-01T03:51:50.602Z] [INFO] Exclude: .gitignore
[2019-12-01T03:51:50.602Z] [INFO] Exclude: .git/**/*
[2019-12-01T03:51:50.602Z] [INFO] Exclude: **/.github/**
[2019-12-01T03:51:50.602Z] [INFO] Exclude: **/.idea
[2019-12-01T03:51:50.602Z] [INFO] Exclude: **/.svn/**/*
[2019-12-01T03:51:50.602Z] [INFO] Exclude: **/*.iml
[2019-12-01T03:51:50.602Z] [INFO] Exclude: **/*.ipr
[2019-12-01T03:51:50.602Z] [INFO] Exclude: **/*.iws
[2019-12-01T03:51:50.602Z] [INFO] Exclude: **/*.versionsBackup
[2019-12-01T03:51:50.602Z] [INFO] Exclude: **/dependency-reduced-pom.xml
[2019-12-01T03:51:50.602Z] [INFO] Exclude: .repository/**
[2019-12-01T03:51:50.602Z] [INFO] Exclude: src/test/resources/**/*
[2019-12-01T03:51:50.602Z] [INFO] Exclude: src/test/resources/**/*.css
[2019-12-01T03:51:50.602Z] [INFO] Exclude: **/*.jj
[2019-12-01T03:51:50.602Z] [INFO] Exclude: src/main/resources/META-INF/services/org.apache.maven.surefire.providerapi.SurefireProvider
[2019-12-01T03:51:50.602Z] [INFO] Exclude: DEPENDENCIES
[2019-12-01T03:51:50.602Z] [INFO] Exclude: .m2/**
[2019-12-01T03:51:50.602Z] [INFO] Exclude: .m2
[2019-12-01T03:51:50.602Z] [INFO] Exclude: .travis.yml
[2019-12-01T03:51:50.602Z] [INFO] 1 resources included (use -debug for more details)
[2019-12-01T03:51:50.602Z] [INFO] Rat check: Summary over all files. Unapproved: 0, unknown: 0, generated: 0, approved: 1 licenses.
[2019-12-01T03:51:50.602Z] [INFO]
[2019-12-01T03:51:50.602Z] [INFO] --- maven-compiler-plugin:3.7.0:compile (compile-generated) @ surefire-shared-utils ---
[2019-12-01T03:51:50.602Z] [INFO] No sources to compile
[2019-12-01T03:51:50.602Z] [INFO]
[2019-12-01T03:51:50.602Z] [INFO] --- maven-remote-resources-plugin:1.5:process (process-resource-bundles) @ surefire-shared-utils ---
[2019-12-01T03:51:50.602Z] [INFO]
[2019-12-01T03:51:50.603Z] [INFO] --- maven-resources-plugin:3.1.0:resources (default-resources) @ surefire-shared-utils ---
[2019-12-01T03:51:50.603Z] [INFO] Using 'UTF-8' encoding to copy filtered resources.
[2019-12-01T03:51:50.603Z] [INFO] skip non existing resourceDirectory /home/jenkins/jenkins-slave/workspace/x_maven-surefire_junit5-runorder@2@2/surefire-shared-utils/src/main/resources
[2019-12-01T03:51:50.603Z] [INFO] Copying 3 resources
[2019-12-01T03:51:50.603Z] [INFO]
[2019-12-01T03:51:50.603Z] [INFO] --- maven-compiler-plugin:3.7.0:compile (default-compile) @ surefire-shared-utils ---
[2019-12-01T03:51:50.603Z] [INFO] No sources to compile
[2019-12-01T03:51:50.603Z] [INFO]
[2019-12-01T03:51:50.603Z] [INFO] --- animal-sniffer-maven-plugin:1.17:check (signature-check) @ surefire-shared-utils ---
[2019-12-01T03:51:50.603Z] [INFO] Checking unresolved references to org.codehaus.mojo.signature:java17:1.0
[2019-12-01T03:51:51.376Z] [INFO]
[2019-12-01T03:51:51.376Z] [INFO] --- maven-resources-plugin:3.1.0:testResources (default-testResources) @ surefire-shared-utils ---
[2019-12-01T03:51:51.376Z] [INFO] Using 'UTF-8' encoding to copy filtered resources.
[2019-12-01T03:51:51.376Z] [INFO] skip non existing resourceDirectory /home/jenkins/jenkins-slave/workspace/x_maven-surefire_junit5-runorder@2@2/surefire-shared-utils/src/test/resources
[2019-12-01T03:51:51.376Z] [INFO] Copying 3 resources
[2019-12-01T03:51:51.376Z] [INFO]
[2019-12-01T03:51:51.376Z] [INFO] --- maven-compiler-plugin:3.7.0:testCompile (default-testCompile) @ surefire-shared-utils ---
[2019-12-01T03:51:51.376Z] [INFO] No sources to compile
[2019-12-01T03:51:51.376Z] [INFO]
[2019-12-01T03:51:51.376Z] [INFO] --- maven-surefire-plugin:3.0.0-M4:test (default-test) @ surefire-shared-utils ---
[2019-12-01T03:51:51.376Z] [INFO]
[2019-12-01T03:51:51.376Z] [INFO] --- maven-jar-plugin:3.1.0:jar (default-jar) @ surefire-shared-utils ---
[2019-12-01T03:51:51.376Z] [INFO] Building jar: /home/jenkins/jenkins-slave/workspace/x_maven-surefire_junit5-runorder@2@2/surefire-shared-utils/target/surefire-shared-utils-3.0.0-SNAPSHOT.jar
[2019-12-01T03:51:51.376Z] [INFO]
[2019-12-01T03:51:51.376Z] [INFO] --- maven-site-plugin:3.8.2:attach-descriptor (attach-descriptor) @ surefire-shared-utils ---
[2019-12-01T03:51:51.376Z] [INFO] Skipping because packaging 'jar' is not pom.
[2019-12-01T03:51:51.376Z] [INFO]
[2019-12-01T03:51:51.376Z] [INFO] --- maven-shade-plugin:3.1.1:shade (default) @ surefire-shared-utils ---
[2019-12-01T03:51:51.376Z] [INFO] Including org.apache.maven.shared:maven-shared-utils:jar:3.1.0 in the shaded jar.
[2019-12-01T03:51:51.376Z] [INFO] Including commons-io:commons-io:jar:2.6 in the shaded jar.
[2019-12-01T03:51:51.376Z] [INFO] Including org.apache.commons:commons-lang3:jar:3.8.1 in the shaded jar.
[2019-12-01T03:51:51.376Z] [INFO] Including org.apache.commons:commons-compress:jar:1.19 in the shaded jar.
[2019-12-01T03:51:51.376Z] [INFO] Including commons-codec:commons-codec:jar:1.11 in the shaded jar.
[Pipeline] cleanWs
[2019-12-01T03:51:52.867Z] [INFO] Replacing original artifact with shaded artifact.
[2019-12-01T03:51:52.867Z] [INFO] Replacing /home/jenkins/jenkins-slave/workspace/x_maven-surefire_junit5-runorder@2@2/surefire-shared-utils/target/surefire-shared-utils-3.0.0-SNAPSHOT.jar with /home/jenkins/jenkins-slave/workspace/x_maven-surefire_junit5-runorder@2@2/surefire-shared-utils/target/surefire-shared-utils-3.0.0-SNAPSHOT-shaded.jar
[2019-12-01T03:51:52.867Z] [INFO] Dependency-reduced POM written at: /home/jenkins/jenkins-slave/workspace/x_maven-surefire_junit5-runorder@2@2/surefire-shared-utils/dependency-reduced-pom.xml
[2019-12-01T03:51:52.867Z] [INFO]
[2019-12-01T03:51:52.867Z] [INFO] --- maven-checkstyle-plugin:3.0.0:check (checkstyle-check) @ surefire-shared-utils ---
[2019-12-01T03:51:52.895Z] [WS-CLEANUP] Deleting project workspace...
[2019-12-01T03:51:52.895Z] [WS-CLEANUP] Deferred wipeout is used...
[2019-12-01T03:51:53.219Z] [WS-CLEANUP] done
[Pipeline] }
[Pipeline] // ws
[Pipeline] }
[Pipeline] // timestamps
[Pipeline] }
[Pipeline] // node
[Pipeline] }
[2019-12-01T03:51:53.583Z] [INFO]
[2019-12-01T03:51:53.583Z] [INFO] --- maven-install-plugin:2.5.2:install (default-install) @ surefire-shared-utils ---
[2019-12-01T03:51:53.583Z] [INFO] Installing /home/jenkins/jenkins-slave/workspace/x_maven-surefire_junit5-runorder@2@2/surefire-shared-utils/target/surefire-shared-utils-3.0.0-SNAPSHOT.jar to /home/jenkins/jenkins-slave/workspace/x_maven-surefire_junit5-runorder@2@2/.m2/org/apache/maven/surefire/surefire-shared-utils/3.0.0-SNAPSHOT/surefire-shared-utils-3.0.0-SNAPSHOT.jar
[2019-12-01T03:51:53.583Z] [INFO] Installing /home/jenkins/jenkins-slave/workspace/x_maven-surefire_junit5-runorder@2@2/surefire-shared-utils/dependency-reduced-pom.xml to /home/jenkins/jenkins-slave/workspace/x_maven-surefire_junit5-runorder@2@2/.m2/org/apache/maven/surefire/surefire-shared-utils/3.0.0-SNAPSHOT/surefire-shared-utils-3.0.0-SNAPSHOT.pom
[2019-12-01T03:51:53.583Z] [INFO] ------------------------------------------------------------------------
[2019-12-01T03:51:53.583Z] [INFO] Reactor Summary for Apache Maven Surefire 3.0.0-SNAPSHOT:
[2019-12-01T03:51:53.583Z] [INFO]
[2019-12-01T03:51:53.583Z] [INFO] Apache Maven Surefire .............................. SUCCESS [ 18.212 s]
[2019-12-01T03:51:53.584Z] [INFO] SureFire Logger API ................................ SUCCESS [ 11.895 s]
[2019-12-01T03:51:53.584Z] [INFO] SureFire API ....................................... SUCCESS [ 13.634 s]
[2019-12-01T03:51:53.584Z] [INFO] Surefire Extensions API ............................ SUCCESS [  2.735 s]
[2019-12-01T03:51:53.584Z] [INFO] SureFire Booter .................................... SUCCESS [ 16.579 s]
[2019-12-01T03:51:53.584Z] [INFO] Maven Surefire Test-Grouping Support ............... SUCCESS [  6.877 s]
[2019-12-01T03:51:53.584Z] [INFO] SureFire Providers ................................. SUCCESS [  1.436 s]
[2019-12-01T03:51:53.584Z] [INFO] Shared JUnit3 Provider Code ........................ SUCCESS [  4.907 s]
[2019-12-01T03:51:53.584Z] [INFO] Shared Java 5 Provider Base ........................ SUCCESS [  5.697 s]
[2019-12-01T03:51:53.584Z] [INFO] Shared JUnit4 Provider Code ........................ SUCCESS [  5.906 s]
[2019-12-01T03:51:53.584Z] [INFO] Shared JUnit48 Provider Code ....................... SUCCESS [  6.797 s]
[2019-12-01T03:51:53.584Z] [INFO] SureFire JUnit Runner .............................. SUCCESS [  5.202 s]
[2019-12-01T03:51:53.584Z] [INFO] SureFire JUnit4 Runner ............................. SUCCESS [ 14.553 s]
[2019-12-01T03:51:53.584Z] [INFO] Maven Surefire Common .............................. SUCCESS [ 56.317 s]
[2019-12-01T03:51:53.584Z] [INFO] SureFire JUnitCore Runner .......................... SUCCESS [02:20 min]
[2019-12-01T03:51:53.584Z] [INFO] SureFire JUnit Platform Runner ..................... SUCCESS [ 12.962 s]
[2019-12-01T03:51:53.584Z] [INFO] SureFire TestNG Utils .............................. SUCCESS [  5.406 s]
[2019-12-01T03:51:53.584Z] [INFO] SureFire TestNG Runner ............................. SUCCESS [  5.927 s]
[2019-12-01T03:51:53.584Z] [INFO] ShadeFire JUnit3 Provider .......................... SUCCESS [  2.264 s]
[2019-12-01T03:51:53.584Z] [INFO] Surefire Report Parser ............................. SUCCESS [  7.062 s]
[2019-12-01T03:51:53.584Z] [INFO] Maven Surefire Plugin .............................. SUCCESS [ 13.005 s]
[2019-12-01T03:51:53.584Z] [INFO] Maven Failsafe Plugin .............................. SUCCESS [01:10 min]
[2019-12-01T03:51:53.584Z] [INFO] Maven Surefire Report Plugin ....................... SUCCESS [ 17.812 s]
[2019-12-01T03:51:53.584Z] [INFO] Maven Surefire Integration Tests ................... SUCCESS [  01:20 h]
[2019-12-01T03:51:53.584Z] [INFO] Surefire Shared Utils .............................. SUCCESS [  3.282 s]
[2019-12-01T03:51:53.584Z] [INFO] ------------------------------------------------------------------------
[2019-12-01T03:51:53.584Z] [INFO] BUILD SUCCESS
[2019-12-01T03:51:53.584Z] [INFO] ------------------------------------------------------------------------
[2019-12-01T03:51:53.584Z] [INFO] Total time:  01:28 h
[2019-12-01T03:51:53.584Z] [INFO] Finished at: 2019-12-01T03:51:52Z
[2019-12-01T03:51:53.584Z] [INFO] ------------------------------------------------------------------------
[Pipeline] }
[Pipeline] // withEnv
[Pipeline] }
[Pipeline] // stage
[Pipeline] fileExists
[Pipeline] zip
[2019-12-01T03:51:54.785Z] Writing zip file of /home/jenkins/jenkins-slave/workspace/x_maven-surefire_junit5-runorder@2@2/maven-failsafe-plugin/target/it to /home/jenkins/jenkins-slave/workspace/x_maven-surefire_junit5-runorder@2@2/maven-failsafe-plugin--linux-jdk11-maven3.6.x.zip
[2019-12-01T03:51:54.968Z] Zipped 78 entries.
[2019-12-01T03:51:54.969Z] Archiving /home/jenkins/jenkins-slave/workspace/x_maven-surefire_junit5-runorder@2@2/maven-failsafe-plugin--linux-jdk11-maven3.6.x.zip
[2019-12-01T03:51:54.969Z] [Fast Archiver] No prior successful build to compare, so performing full copy of artifacts
[Pipeline] fileExists
[Pipeline] zip
[2019-12-01T03:51:55.934Z] Writing zip file of /home/jenkins/jenkins-slave/workspace/x_maven-surefire_junit5-runorder@2@2/surefire-its/target to /home/jenkins/jenkins-slave/workspace/x_maven-surefire_junit5-runorder@2@2/surefire-its--linux-jdk11-maven3.6.x.zip
[2019-12-01T03:52:08.708Z] Zipped 18358 entries.
[2019-12-01T03:52:08.708Z] Archiving /home/jenkins/jenkins-slave/workspace/x_maven-surefire_junit5-runorder@2@2/surefire-its--linux-jdk11-maven3.6.x.zip
[2019-12-01T03:52:08.708Z] [Fast Archiver] No prior successful build to compare, so performing full copy of artifacts
[Pipeline] archiveArtifacts
[2019-12-01T03:52:14.273Z] Archiving artifacts
[2019-12-01T03:52:14.585Z] [Fast Archiver] No prior successful build to compare, so performing full copy of artifacts
[Pipeline] cleanWs
[2019-12-01T03:52:20.169Z] [WS-CLEANUP] Deleting project workspace...
[2019-12-01T03:52:20.169Z] [WS-CLEANUP] Deferred wipeout is used...
[2019-12-01T03:52:20.652Z] [WS-CLEANUP] done
[Pipeline] }
[Pipeline] // ws
[Pipeline] }
[Pipeline] // timestamps
[Pipeline] }
[Pipeline] // node
[Pipeline] }
[Pipeline] // parallel
[Pipeline] echo
Build result: FAILURE
[Pipeline] jiraIssueSelector
[Pipeline] echo
The authors of changes [].
[Pipeline] echo
Sending email ...
[Pipeline] emailext
Reply | Threaded
Open this post in threaded view
|

Build failed in Jenkins: Maven TLP » maven-surefire » junit5-runorder #2

Apache Jenkins Server-2
See https://builds.apache.org/job/maven-box/job/maven-surefire/job/junit5-runorder/2/

No changes.

All tests passed

Build log:
[...truncated 34436 lines...]
[2019-12-01T05:51:22.981Z] org.apache.maven.lifecycle.LifecycleExecutionException: Failed to execute goal org.apache.maven.plugins:maven-checkstyle-plugin:3.0.0:check (checkstyle-check) on project surefire-its: You have 4 Checkstyle violations.
[2019-12-01T05:51:22.981Z]     at org.apache.maven.lifecycle.internal.MojoExecutor.execute (MojoExecutor.java:215)
[2019-12-01T05:51:22.982Z]     at org.apache.maven.lifecycle.internal.MojoExecutor.execute (MojoExecutor.java:156)
[2019-12-01T05:51:22.982Z]     at org.apache.maven.lifecycle.internal.MojoExecutor.execute (MojoExecutor.java:148)
[2019-12-01T05:51:22.982Z]     at org.apache.maven.lifecycle.internal.LifecycleModuleBuilder.buildProject (LifecycleModuleBuilder.java:117)
[2019-12-01T05:51:22.982Z]     at org.apache.maven.lifecycle.internal.LifecycleModuleBuilder.buildProject (LifecycleModuleBuilder.java:81)
[2019-12-01T05:51:22.982Z]     at org.apache.maven.lifecycle.internal.builder.singlethreaded.SingleThreadedBuilder.build (SingleThreadedBuilder.java:56)
[2019-12-01T05:51:22.982Z]     at org.apache.maven.lifecycle.internal.LifecycleStarter.execute (LifecycleStarter.java:128)
[2019-12-01T05:51:22.982Z]     at org.apache.maven.DefaultMaven.doExecute (DefaultMaven.java:305)
[2019-12-01T05:51:22.982Z]     at org.apache.maven.DefaultMaven.doExecute (DefaultMaven.java:192)
[2019-12-01T05:51:22.982Z]     at org.apache.maven.DefaultMaven.execute (DefaultMaven.java:105)
[2019-12-01T05:51:22.982Z]     at org.apache.maven.cli.MavenCli.execute (MavenCli.java:956)
[2019-12-01T05:51:22.982Z]     at org.apache.maven.cli.MavenCli.doMain (MavenCli.java:288)
[2019-12-01T05:51:22.982Z]     at org.apache.maven.cli.MavenCli.main (MavenCli.java:192)
[2019-12-01T05:51:22.982Z]     at sun.reflect.NativeMethodAccessorImpl.invoke0 (Native Method)
[2019-12-01T05:51:22.982Z]     at sun.reflect.NativeMethodAccessorImpl.invoke (NativeMethodAccessorImpl.java:62)
[2019-12-01T05:51:22.982Z]     at sun.reflect.DelegatingMethodAccessorImpl.invoke (DelegatingMethodAccessorImpl.java:43)
[2019-12-01T05:51:22.982Z]     at java.lang.reflect.Method.invoke (Method.java:498)
[2019-12-01T05:51:22.982Z]     at org.codehaus.plexus.classworlds.launcher.Launcher.launchEnhanced (Launcher.java:282)
[2019-12-01T05:51:22.982Z]     at org.codehaus.plexus.classworlds.launcher.Launcher.launch (Launcher.java:225)
[2019-12-01T05:51:22.982Z]     at org.codehaus.plexus.classworlds.launcher.Launcher.mainWithExitCode (Launcher.java:406)
[2019-12-01T05:51:22.982Z]     at org.codehaus.plexus.classworlds.launcher.Launcher.main (Launcher.java:347)
[2019-12-01T05:51:22.982Z] Caused by: org.apache.maven.plugin.MojoFailureException: You have 4 Checkstyle violations.
[2019-12-01T05:51:22.982Z]     at org.apache.maven.plugins.checkstyle.CheckstyleViolationCheckMojo.execute (CheckstyleViolationCheckMojo.java:576)
[2019-12-01T05:51:22.982Z]     at org.apache.maven.plugin.DefaultBuildPluginManager.executeMojo (DefaultBuildPluginManager.java:137)
[2019-12-01T05:51:22.982Z]     at org.apache.maven.lifecycle.internal.MojoExecutor.execute (MojoExecutor.java:210)
[2019-12-01T05:51:22.982Z]     at org.apache.maven.lifecycle.internal.MojoExecutor.execute (MojoExecutor.java:156)
[2019-12-01T05:51:22.982Z]     at org.apache.maven.lifecycle.internal.MojoExecutor.execute (MojoExecutor.java:148)
[2019-12-01T05:51:22.982Z]     at org.apache.maven.lifecycle.internal.LifecycleModuleBuilder.buildProject (LifecycleModuleBuilder.java:117)
[2019-12-01T05:51:22.982Z]     at org.apache.maven.lifecycle.internal.LifecycleModuleBuilder.buildProject (LifecycleModuleBuilder.java:81)
[2019-12-01T05:51:22.982Z]     at org.apache.maven.lifecycle.internal.builder.singlethreaded.SingleThreadedBuilder.build (SingleThreadedBuilder.java:56)
[2019-12-01T05:51:22.982Z]     at org.apache.maven.lifecycle.internal.LifecycleStarter.execute (LifecycleStarter.java:128)
[2019-12-01T05:51:22.982Z]     at org.apache.maven.DefaultMaven.doExecute (DefaultMaven.java:305)
[2019-12-01T05:51:22.982Z]     at org.apache.maven.DefaultMaven.doExecute (DefaultMaven.java:192)
[2019-12-01T05:51:22.982Z]     at org.apache.maven.DefaultMaven.execute (DefaultMaven.java:105)
[2019-12-01T05:51:22.982Z]     at org.apache.maven.cli.MavenCli.execute (MavenCli.java:956)
[2019-12-01T05:51:22.982Z]     at org.apache.maven.cli.MavenCli.doMain (MavenCli.java:288)
[2019-12-01T05:51:22.982Z]     at org.apache.maven.cli.MavenCli.main (MavenCli.java:192)
[2019-12-01T05:51:22.982Z]     at sun.reflect.NativeMethodAccessorImpl.invoke0 (Native Method)
[2019-12-01T05:51:22.982Z]     at sun.reflect.NativeMethodAccessorImpl.invoke (NativeMethodAccessorImpl.java:62)
[2019-12-01T05:51:22.982Z]     at sun.reflect.DelegatingMethodAccessorImpl.invoke (DelegatingMethodAccessorImpl.java:43)
[2019-12-01T05:51:22.982Z]     at java.lang.reflect.Method.invoke (Method.java:498)
[2019-12-01T05:51:22.982Z]     at org.codehaus.plexus.classworlds.launcher.Launcher.launchEnhanced (Launcher.java:282)
[2019-12-01T05:51:22.982Z]     at org.codehaus.plexus.classworlds.launcher.Launcher.launch (Launcher.java:225)
[2019-12-01T05:51:22.982Z]     at org.codehaus.plexus.classworlds.launcher.Launcher.mainWithExitCode (Launcher.java:406)
[2019-12-01T05:51:22.982Z]     at org.codehaus.plexus.classworlds.launcher.Launcher.main (Launcher.java:347)
[2019-12-01T05:51:22.982Z] [ERROR]
[2019-12-01T05:51:22.982Z] [ERROR] Re-run Maven using the -X switch to enable full debug logging.
[2019-12-01T05:51:22.982Z] [ERROR]
[2019-12-01T05:51:22.982Z] [ERROR] For more information about the errors and possible solutions, please read the following articles:
[2019-12-01T05:51:22.982Z] [ERROR] [Help 1] http://cwiki.apache.org/confluence/display/MAVEN/MojoFailureException
[2019-12-01T05:51:22.982Z] [ERROR]
[2019-12-01T05:51:22.982Z] [ERROR] After correcting the problems, you can resume the build with the command
[2019-12-01T05:51:22.982Z] [ERROR]   mvn <args> -rf :surefire-its
[Pipeline] }
[Pipeline] // withEnv
[Pipeline] }
[Pipeline] // stage
[Pipeline] fileExists
[Pipeline] zip
[2019-12-01T05:51:23.239Z] Writing zip file of C:\Users\jenkins\AppData\Local\Temp\2\jenkins-maven-box-maven-surefire-junit5-runorder-2\maven-failsafe-plugin\target\it to C:\Users\jenkins\AppData\Local\Temp\2\jenkins-maven-box-maven-surefire-junit5-runorder-2\maven-failsafe-plugin--windows-jdk8-maven3.6.x.zip
[2019-12-01T05:51:23.763Z] Zipped 78 entries.
[2019-12-01T05:51:23.763Z] Archiving C:\Users\jenkins\AppData\Local\Temp\2\jenkins-maven-box-maven-surefire-junit5-runorder-2\maven-failsafe-plugin--windows-jdk8-maven3.6.x.zip
[2019-12-01T05:51:23.764Z] [Fast Archiver] No prior successful build to compare, so performing full copy of artifacts
[Pipeline] fileExists
[Pipeline] zip
[2019-12-01T05:51:23.836Z] Writing zip file of C:\Users\jenkins\AppData\Local\Temp\2\jenkins-maven-box-maven-surefire-junit5-runorder-2\surefire-its\target to C:\Users\jenkins\AppData\Local\Temp\2\jenkins-maven-box-maven-surefire-junit5-runorder-2\surefire-its--windows-jdk8-maven3.6.x.zip
[2019-12-01T05:51:52.827Z] [INFO] Tests run: 4, Failures: 0, Errors: 0, Skipped: 0, Time elapsed: 64.05 s - in org.apache.maven.surefire.its.jiras.Surefire855AllowFailsafeUseArtifactFileIT
[2019-12-01T05:51:52.827Z] [INFO] Running org.apache.maven.surefire.its.jiras.Surefire901MIssingResultfileWhenNoTestsIT
[2019-12-01T05:51:53.440Z] [INFO] Tests run: 1, Failures: 0, Errors: 0, Skipped: 0, Time elapsed: 4.791 s - in org.apache.maven.surefire.its.jiras.Surefire901MIssingResultfileWhenNoTestsIT
[2019-12-01T05:51:53.440Z] [INFO] Running org.apache.maven.surefire.its.jiras.Surefire907PerThreadWithoutThreadCountIT
[2019-12-01T05:51:57.738Z] [INFO] Tests run: 1, Failures: 0, Errors: 0, Skipped: 0, Time elapsed: 4.052 s - in org.apache.maven.surefire.its.jiras.Surefire907PerThreadWithoutThreadCountIT
[2019-12-01T05:51:57.738Z] [INFO] Running org.apache.maven.surefire.its.jiras.Surefire920TestFailureIgnoreWithTimeoutIT
[2019-12-01T05:52:13.102Z] [INFO] Tests run: 2, Failures: 0, Errors: 0, Skipped: 0, Time elapsed: 14.835 s - in org.apache.maven.surefire.its.jiras.Surefire920TestFailureIgnoreWithTimeoutIT
[2019-12-01T05:52:13.102Z] [INFO] Running org.apache.maven.surefire.its.jiras.Surefire926FailureWith2ProvidersIT
[2019-12-01T05:52:16.850Z] Zipped 16927 entries.
[2019-12-01T05:52:16.850Z] Archiving C:\Users\jenkins\AppData\Local\Temp\2\jenkins-maven-box-maven-surefire-junit5-runorder-2\surefire-its--windows-jdk8-maven3.6.x.zip
[2019-12-01T05:52:16.851Z] [Fast Archiver] No prior successful build to compare, so performing full copy of artifacts
[2019-12-01T05:52:17.530Z] [INFO] Tests run: 1, Failures: 0, Errors: 0, Skipped: 0, Time elapsed: 4.757 s - in org.apache.maven.surefire.its.jiras.Surefire926FailureWith2ProvidersIT
[2019-12-01T05:52:17.530Z] [INFO] Running org.apache.maven.surefire.its.jiras.Surefire930TestNgSuiteXmlIT
[Pipeline] archiveArtifacts
[2019-12-01T05:52:17.703Z] Archiving artifacts
[2019-12-01T05:52:17.790Z] [Fast Archiver] No prior successful build to compare, so performing full copy of artifacts
[Pipeline] cleanWs
[2019-12-01T05:52:19.182Z] [WS-CLEANUP] Deleting project workspace...
[2019-12-01T05:52:19.182Z] [WS-CLEANUP] Deferred wipeout is used...
[2019-12-01T05:52:19.322Z] [WS-CLEANUP] done
[Pipeline] }
[Pipeline] // ws
[Pipeline] }
[Pipeline] // timestamps
[Pipeline] }
[Pipeline] // node
[Pipeline] }
[2019-12-01T05:52:25.783Z] [INFO] Tests run: 1, Failures: 0, Errors: 0, Skipped: 0, Time elapsed: 7.881 s - in org.apache.maven.surefire.its.jiras.Surefire930TestNgSuiteXmlIT
[2019-12-01T05:52:25.783Z] [INFO] Running org.apache.maven.surefire.its.jiras.Surefire943ReportContentIT
[2019-12-01T05:52:58.096Z] [INFO] Tests run: 2, Failures: 0, Errors: 0, Skipped: 0, Time elapsed: 29.104 s - in org.apache.maven.surefire.its.jiras.Surefire943ReportContentIT
[2019-12-01T05:52:58.096Z] [INFO] Running org.apache.maven.surefire.its.jiras.Surefire946KillMainProcessInReusableForkIT
[2019-12-01T05:54:06.183Z] [INFO] Tests run: 6, Failures: 0, Errors: 0, Skipped: 0, Time elapsed: 64.02 s - in org.apache.maven.surefire.its.jiras.Surefire946KillMainProcessInReusableForkIT
[2019-12-01T05:54:06.183Z] [INFO] Running org.apache.maven.surefire.its.jiras.Surefire972BizarreNoClassDefIT
[2019-12-01T05:54:10.697Z] [INFO] Tests run: 1, Failures: 0, Errors: 0, Skipped: 0, Time elapsed: 11.802 s - in org.apache.maven.surefire.its.jiras.Surefire972BizarreNoClassDefIT
[2019-12-01T05:54:10.697Z] [INFO] Running org.apache.maven.surefire.its.jiras.Surefire975DefaultVMEncodingIT
[2019-12-01T05:54:17.396Z] [INFO] Tests run: 1, Failures: 0, Errors: 0, Skipped: 0, Time elapsed: 6.2 s - in org.apache.maven.surefire.its.jiras.Surefire975DefaultVMEncodingIT
[2019-12-01T05:54:17.396Z] [INFO] Running org.apache.maven.surefire.its.jiras.Surefire979WrongClassLoaderIT
[2019-12-01T05:54:22.783Z] [INFO] Tests run: 1, Failures: 0, Errors: 0, Skipped: 0, Time elapsed: 5.708 s - in org.apache.maven.surefire.its.jiras.Surefire979WrongClassLoaderIT
[2019-12-01T05:54:22.783Z] [INFO] Running org.apache.maven.surefire.its.jiras.Surefire985ParameterizedRunnerAndCategoriesIT
[2019-12-01T05:54:27.114Z] [INFO] Tests run: 1, Failures: 0, Errors: 0, Skipped: 0, Time elapsed: 4.923 s - in org.apache.maven.surefire.its.jiras.Surefire985ParameterizedRunnerAndCategoriesIT
[2019-12-01T05:54:27.114Z] [INFO] Running org.apache.maven.surefire.its.jiras.Surefire995CategoryInheritanceIT
[2019-12-01T05:54:49.256Z] [INFO] Tests run: 5, Failures: 0, Errors: 0, Skipped: 0, Time elapsed: 20.996 s - in org.apache.maven.surefire.its.jiras.Surefire995CategoryInheritanceIT
[2019-12-01T05:54:49.256Z] [INFO]
[2019-12-01T05:54:49.256Z] [INFO] Results:
[2019-12-01T05:54:49.256Z] [INFO]
[2019-12-01T05:54:49.256Z] [WARNING] Tests run: 861, Failures: 0, Errors: 0, Skipped: 144
[2019-12-01T05:54:49.256Z] [INFO]
[2019-12-01T05:54:49.256Z] [INFO]
[2019-12-01T05:54:49.256Z] [INFO] --- maven-checkstyle-plugin:3.0.0:check (checkstyle-check) @ surefire-its ---
[2019-12-01T05:54:50.226Z] [INFO] There are 4 errors reported by Checkstyle 6.18 with config/maven_checks.xml ruleset.
[2019-12-01T05:54:50.226Z] [ERROR] src\test\java\org\apache\maven\surefire\its\RunOrderIT.java:[57,28] (coding) MagicNumber: '1.8d' is a magic number.
[2019-12-01T05:54:50.226Z] [ERROR] src\test\java\org\apache\maven\surefire\its\RunOrderIT.java:[74,28] (coding) MagicNumber: '1.8d' is a magic number.
[2019-12-01T05:54:50.227Z] [ERROR] src\test\java\org\apache\maven\surefire\its\RunOrderIT.java:[100,28] (coding) MagicNumber: '1.8d' is a magic number.
[2019-12-01T05:54:50.227Z] [ERROR] src\test\java\org\apache\maven\surefire\its\RunOrderIT.java:[130,28] (coding) MagicNumber: '1.8d' is a magic number.
[2019-12-01T05:54:50.227Z] [INFO] ------------------------------------------------------------------------
[2019-12-01T05:54:50.227Z] [INFO] Reactor Summary for Apache Maven Surefire 3.0.0-SNAPSHOT:
[2019-12-01T05:54:50.227Z] [INFO]
[2019-12-01T05:54:50.227Z] [INFO] Apache Maven Surefire .............................. SUCCESS [01:02 min]
[2019-12-01T05:54:50.227Z] [INFO] SureFire Logger API ................................ SUCCESS [ 24.629 s]
[2019-12-01T05:54:50.227Z] [INFO] SureFire API ....................................... SUCCESS [ 19.068 s]
[2019-12-01T05:54:50.227Z] [INFO] Surefire Extensions API ............................ SUCCESS [  3.245 s]
[2019-12-01T05:54:50.227Z] [INFO] SureFire Booter .................................... SUCCESS [ 17.982 s]
[2019-12-01T05:54:50.227Z] [INFO] Maven Surefire Test-Grouping Support ............... SUCCESS [ 11.995 s]
[2019-12-01T05:54:50.227Z] [INFO] SureFire Providers ................................. SUCCESS [  1.140 s]
[2019-12-01T05:54:50.227Z] [INFO] Shared JUnit3 Provider Code ........................ SUCCESS [  5.240 s]
[2019-12-01T05:54:50.227Z] [INFO] Shared Java 5 Provider Base ........................ SUCCESS [  6.560 s]
[2019-12-01T05:54:50.227Z] [INFO] Shared JUnit4 Provider Code ........................ SUCCESS [  6.656 s]
[2019-12-01T05:54:50.227Z] [INFO] Shared JUnit48 Provider Code ....................... SUCCESS [  7.905 s]
[2019-12-01T05:54:50.227Z] [INFO] SureFire JUnit Runner .............................. SUCCESS [  6.138 s]
[2019-12-01T05:54:50.227Z] [INFO] SureFire JUnit4 Runner ............................. SUCCESS [  5.536 s]
[2019-12-01T05:54:50.227Z] [INFO] Maven Surefire Common .............................. SUCCESS [ 49.008 s]
[2019-12-01T05:54:50.227Z] [INFO] SureFire JUnitCore Runner .......................... SUCCESS [02:23 min]
[2019-12-01T05:54:50.227Z] [INFO] SureFire JUnit Platform Runner ..................... SUCCESS [ 12.691 s]
[2019-12-01T05:54:50.227Z] [INFO] SureFire TestNG Utils .............................. SUCCESS [  5.874 s]
[2019-12-01T05:54:50.227Z] [INFO] SureFire TestNG Runner ............................. SUCCESS [  6.818 s]
[2019-12-01T05:54:50.227Z] [INFO] ShadeFire JUnit3 Provider .......................... SUCCESS [  2.473 s]
[2019-12-01T05:54:50.227Z] [INFO] Surefire Report Parser ............................. SUCCESS [  8.393 s]
[2019-12-01T05:54:50.227Z] [INFO] Maven Surefire Plugin .............................. SUCCESS [ 17.110 s]
[2019-12-01T05:54:50.227Z] [INFO] Maven Failsafe Plugin .............................. SUCCESS [01:51 min]
[2019-12-01T05:54:50.227Z] [INFO] Maven Surefire Report Plugin ....................... SUCCESS [ 18.108 s]
[2019-12-01T05:54:50.227Z] [INFO] Maven Surefire Integration Tests ................... FAILURE [  01:14 h]
[2019-12-01T05:54:50.227Z] [INFO] Surefire Shared Utils .............................. SKIPPED
[2019-12-01T05:54:50.227Z] [INFO] ------------------------------------------------------------------------
[2019-12-01T05:54:50.227Z] [INFO] BUILD FAILURE
[2019-12-01T05:54:50.227Z] [INFO] ------------------------------------------------------------------------
[2019-12-01T05:54:50.227Z] [INFO] Total time:  01:23 h
[2019-12-01T05:54:50.227Z] [INFO] Finished at: 2019-11-30T21:54:50-08:00
[2019-12-01T05:54:50.227Z] [INFO] ------------------------------------------------------------------------
[2019-12-01T05:54:50.227Z] [ERROR] Failed to execute goal org.apache.maven.plugins:maven-checkstyle-plugin:3.0.0:check (checkstyle-check) on project surefire-its: You have 4 Checkstyle violations. -> [Help 1]
[2019-12-01T05:54:50.227Z] org.apache.maven.lifecycle.LifecycleExecutionException: Failed to execute goal org.apache.maven.plugins:maven-checkstyle-plugin:3.0.0:check (checkstyle-check) on project surefire-its: You have 4 Checkstyle violations.
[2019-12-01T05:54:50.227Z]     at org.apache.maven.lifecycle.internal.MojoExecutor.execute (MojoExecutor.java:215)
[2019-12-01T05:54:50.227Z]     at org.apache.maven.lifecycle.internal.MojoExecutor.execute (MojoExecutor.java:156)
[2019-12-01T05:54:50.227Z]     at org.apache.maven.lifecycle.internal.MojoExecutor.execute (MojoExecutor.java:148)
[2019-12-01T05:54:50.227Z]     at org.apache.maven.lifecycle.internal.LifecycleModuleBuilder.buildProject (LifecycleModuleBuilder.java:117)
[2019-12-01T05:54:50.227Z]     at org.apache.maven.lifecycle.internal.LifecycleModuleBuilder.buildProject (LifecycleModuleBuilder.java:81)
[2019-12-01T05:54:50.227Z]     at org.apache.maven.lifecycle.internal.builder.singlethreaded.SingleThreadedBuilder.build (SingleThreadedBuilder.java:56)
[2019-12-01T05:54:50.227Z]     at org.apache.maven.lifecycle.internal.LifecycleStarter.execute (LifecycleStarter.java:128)
[2019-12-01T05:54:50.227Z]     at org.apache.maven.DefaultMaven.doExecute (DefaultMaven.java:305)
[2019-12-01T05:54:50.227Z]     at org.apache.maven.DefaultMaven.doExecute (DefaultMaven.java:192)
[2019-12-01T05:54:50.227Z]     at org.apache.maven.DefaultMaven.execute (DefaultMaven.java:105)
[2019-12-01T05:54:50.227Z]     at org.apache.maven.cli.MavenCli.execute (MavenCli.java:956)
[2019-12-01T05:54:50.227Z]     at org.apache.maven.cli.MavenCli.doMain (MavenCli.java:288)
[2019-12-01T05:54:50.227Z]     at org.apache.maven.cli.MavenCli.main (MavenCli.java:192)
[2019-12-01T05:54:50.227Z]     at sun.reflect.NativeMethodAccessorImpl.invoke0 (Native Method)
[2019-12-01T05:54:50.227Z]     at sun.reflect.NativeMethodAccessorImpl.invoke (NativeMethodAccessorImpl.java:62)
[2019-12-01T05:54:50.227Z]     at sun.reflect.DelegatingMethodAccessorImpl.invoke (DelegatingMethodAccessorImpl.java:43)
[2019-12-01T05:54:50.227Z]     at java.lang.reflect.Method.invoke (Method.java:498)
[2019-12-01T05:54:50.227Z]     at org.codehaus.plexus.classworlds.launcher.Launcher.launchEnhanced (Launcher.java:282)
[2019-12-01T05:54:50.227Z]     at org.codehaus.plexus.classworlds.launcher.Launcher.launch (Launcher.java:225)
[2019-12-01T05:54:50.227Z]     at org.codehaus.plexus.classworlds.launcher.Launcher.mainWithExitCode (Launcher.java:406)
[2019-12-01T05:54:50.228Z]     at org.codehaus.plexus.classworlds.launcher.Launcher.main (Launcher.java:347)
[2019-12-01T05:54:50.228Z] Caused by: org.apache.maven.plugin.MojoFailureException: You have 4 Checkstyle violations.
[2019-12-01T05:54:50.228Z]     at org.apache.maven.plugins.checkstyle.CheckstyleViolationCheckMojo.execute (CheckstyleViolationCheckMojo.java:576)
[2019-12-01T05:54:50.228Z]     at org.apache.maven.plugin.DefaultBuildPluginManager.executeMojo (DefaultBuildPluginManager.java:137)
[2019-12-01T05:54:50.228Z]     at org.apache.maven.lifecycle.internal.MojoExecutor.execute (MojoExecutor.java:210)
[2019-12-01T05:54:50.228Z]     at org.apache.maven.lifecycle.internal.MojoExecutor.execute (MojoExecutor.java:156)
[2019-12-01T05:54:50.228Z]     at org.apache.maven.lifecycle.internal.MojoExecutor.execute (MojoExecutor.java:148)
[2019-12-01T05:54:50.228Z]     at org.apache.maven.lifecycle.internal.LifecycleModuleBuilder.buildProject (LifecycleModuleBuilder.java:117)
[2019-12-01T05:54:50.228Z]     at org.apache.maven.lifecycle.internal.LifecycleModuleBuilder.buildProject (LifecycleModuleBuilder.java:81)
[2019-12-01T05:54:50.228Z]     at org.apache.maven.lifecycle.internal.builder.singlethreaded.SingleThreadedBuilder.build (SingleThreadedBuilder.java:56)
[2019-12-01T05:54:50.228Z]     at org.apache.maven.lifecycle.internal.LifecycleStarter.execute (LifecycleStarter.java:128)
[2019-12-01T05:54:50.228Z]     at org.apache.maven.DefaultMaven.doExecute (DefaultMaven.java:305)
[2019-12-01T05:54:50.228Z]     at org.apache.maven.DefaultMaven.doExecute (DefaultMaven.java:192)
[2019-12-01T05:54:50.228Z]     at org.apache.maven.DefaultMaven.execute (DefaultMaven.java:105)
[2019-12-01T05:54:50.228Z]     at org.apache.maven.cli.MavenCli.execute (MavenCli.java:956)
[2019-12-01T05:54:50.228Z]     at org.apache.maven.cli.MavenCli.doMain (MavenCli.java:288)
[2019-12-01T05:54:50.228Z]     at org.apache.maven.cli.MavenCli.main (MavenCli.java:192)
[2019-12-01T05:54:50.228Z]     at sun.reflect.NativeMethodAccessorImpl.invoke0 (Native Method)
[2019-12-01T05:54:50.228Z]     at sun.reflect.NativeMethodAccessorImpl.invoke (NativeMethodAccessorImpl.java:62)
[2019-12-01T05:54:50.228Z]     at sun.reflect.DelegatingMethodAccessorImpl.invoke (DelegatingMethodAccessorImpl.java:43)
[2019-12-01T05:54:50.228Z]     at java.lang.reflect.Method.invoke (Method.java:498)
[2019-12-01T05:54:50.228Z]     at org.codehaus.plexus.classworlds.launcher.Launcher.launchEnhanced (Launcher.java:282)
[2019-12-01T05:54:50.228Z]     at org.codehaus.plexus.classworlds.launcher.Launcher.launch (Launcher.java:225)
[2019-12-01T05:54:50.228Z]     at org.codehaus.plexus.classworlds.launcher.Launcher.mainWithExitCode (Launcher.java:406)
[2019-12-01T05:54:50.228Z]     at org.codehaus.plexus.classworlds.launcher.Launcher.main (Launcher.java:347)
[2019-12-01T05:54:50.228Z] [ERROR]
[2019-12-01T05:54:50.228Z] [ERROR] Re-run Maven using the -X switch to enable full debug logging.
[2019-12-01T05:54:50.228Z] [ERROR]
[2019-12-01T05:54:50.228Z] [ERROR] For more information about the errors and possible solutions, please read the following articles:
[2019-12-01T05:54:50.228Z] [ERROR] [Help 1] http://cwiki.apache.org/confluence/display/MAVEN/MojoFailureException
[2019-12-01T05:54:50.228Z] [ERROR]
[2019-12-01T05:54:50.228Z] [ERROR] After correcting the problems, you can resume the build with the command
[2019-12-01T05:54:50.228Z] [ERROR]   mvn <args> -rf :surefire-its
[Pipeline] }
[Pipeline] // withEnv
[Pipeline] }
[Pipeline] // stage
[Pipeline] fileExists
[Pipeline] zip
[2019-12-01T05:54:50.432Z] Writing zip file of C:\Users\jenkins\AppData\Local\Temp\2\jenkins-maven-box-maven-surefire-junit5-runorder-2\maven-failsafe-plugin\target\it to C:\Users\jenkins\AppData\Local\Temp\2\jenkins-maven-box-maven-surefire-junit5-runorder-2\maven-failsafe-plugin--windows-jdk11-maven3.6.x.zip
[2019-12-01T05:54:50.549Z] Zipped 78 entries.
[2019-12-01T05:54:50.549Z] Archiving C:\Users\jenkins\AppData\Local\Temp\2\jenkins-maven-box-maven-surefire-junit5-runorder-2\maven-failsafe-plugin--windows-jdk11-maven3.6.x.zip
[2019-12-01T05:54:50.550Z] [Fast Archiver] No prior successful build to compare, so performing full copy of artifacts
[Pipeline] fileExists
[Pipeline] zip
[2019-12-01T05:54:50.646Z] Writing zip file of C:\Users\jenkins\AppData\Local\Temp\2\jenkins-maven-box-maven-surefire-junit5-runorder-2\surefire-its\target to C:\Users\jenkins\AppData\Local\Temp\2\jenkins-maven-box-maven-surefire-junit5-runorder-2\surefire-its--windows-jdk11-maven3.6.x.zip
[2019-12-01T05:55:03.444Z] Zipped 17254 entries.
[2019-12-01T05:55:03.444Z] Archiving C:\Users\jenkins\AppData\Local\Temp\2\jenkins-maven-box-maven-surefire-junit5-runorder-2\surefire-its--windows-jdk11-maven3.6.x.zip
[2019-12-01T05:55:03.444Z] [Fast Archiver] No prior successful build to compare, so performing full copy of artifacts
[Pipeline] archiveArtifacts
[2019-12-01T05:55:04.870Z] Archiving artifacts
[2019-12-01T05:55:04.880Z] [Fast Archiver] No prior successful build to compare, so performing full copy of artifacts
[Pipeline] cleanWs
[2019-12-01T05:55:06.664Z] [WS-CLEANUP] Deleting project workspace...
[2019-12-01T05:55:06.664Z] [WS-CLEANUP] Deferred wipeout is used...
[2019-12-01T05:55:06.792Z] [WS-CLEANUP] done
[Pipeline] }
[Pipeline] // ws
[Pipeline] }
[Pipeline] // timestamps
[Pipeline] }
[Pipeline] // node
[Pipeline] }
[Pipeline] // parallel
[Pipeline] echo
Build result: FAILURE
[Pipeline] jiraIssueSelector
[Pipeline] echo
The authors of changes [].
[Pipeline] echo
Sending email ...
[Pipeline] emailext
Reply | Threaded
Open this post in threaded view
|

Build failed in Jenkins: Maven TLP » maven-surefire » junit5-runorder #3

Apache Jenkins Server-2
See https://builds.apache.org/job/maven-box/job/maven-surefire/job/junit5-runorder/3/

No changes.

All tests passed

Build log:
[...truncated 35085 lines...]
[2019-12-01T11:42:33.108Z] [INFO] Maven Failsafe Plugin .............................. SUCCESS [01:47 min]
[2019-12-01T11:42:33.108Z] [INFO] Maven Surefire Report Plugin ....................... SUCCESS [ 19.888 s]
[2019-12-01T11:42:33.108Z] [INFO] Maven Surefire Integration Tests ................... SUCCESS [  01:19 h]
[2019-12-01T11:42:33.108Z] [INFO] Surefire Shared Utils .............................. SUCCESS [  3.757 s]
[2019-12-01T11:42:33.108Z] [INFO] ------------------------------------------------------------------------
[2019-12-01T11:42:33.108Z] [INFO] BUILD SUCCESS
[2019-12-01T11:42:33.108Z] [INFO] ------------------------------------------------------------------------
[2019-12-01T11:42:33.108Z] [INFO] Total time:  01:28 h
[2019-12-01T11:42:33.108Z] [INFO] Finished at: 2019-12-01T03:42:33-08:00
[2019-12-01T11:42:33.109Z] [INFO] ------------------------------------------------------------------------
[Pipeline] }
[Pipeline] // withEnv
[Pipeline] }
[Pipeline] // stage
[Pipeline] fileExists
[Pipeline] zip
[2019-12-01T11:42:33.599Z] Writing zip file of C:\Users\jenkins\AppData\Local\Temp\2\jenkins-maven-box-maven-surefire-junit5-runorder-3\maven-failsafe-plugin\target\it to C:\Users\jenkins\AppData\Local\Temp\2\jenkins-maven-box-maven-surefire-junit5-runorder-3\maven-failsafe-plugin--windows-jdk11-maven3.6.x.zip
[2019-12-01T11:42:34.329Z] Zipped 78 entries.
[2019-12-01T11:42:34.329Z] Archiving C:\Users\jenkins\AppData\Local\Temp\2\jenkins-maven-box-maven-surefire-junit5-runorder-3\maven-failsafe-plugin--windows-jdk11-maven3.6.x.zip
[2019-12-01T11:42:34.329Z] [Fast Archiver] No prior successful build to compare, so performing full copy of artifacts
[Pipeline] fileExists
[Pipeline] zip
[2019-12-01T11:42:34.437Z] Writing zip file of C:\Users\jenkins\AppData\Local\Temp\2\jenkins-maven-box-maven-surefire-junit5-runorder-3\surefire-its\target to C:\Users\jenkins\AppData\Local\Temp\2\jenkins-maven-box-maven-surefire-junit5-runorder-3\surefire-its--windows-jdk11-maven3.6.x.zip
[2019-12-01T11:42:48.477Z] [INFO] Tests run: 4, Failures: 0, Errors: 0, Skipped: 0, Time elapsed: 54.873 s - in org.apache.maven.surefire.its.jiras.Surefire855AllowFailsafeUseArtifactFileIT
[2019-12-01T11:42:48.477Z] [INFO] Running org.apache.maven.surefire.its.jiras.Surefire901MIssingResultfileWhenNoTestsIT
[2019-12-01T11:42:53.765Z] [INFO] Tests run: 1, Failures: 0, Errors: 0, Skipped: 0, Time elapsed: 5.686 s - in org.apache.maven.surefire.its.jiras.Surefire901MIssingResultfileWhenNoTestsIT
[2019-12-01T11:42:53.765Z] [INFO] Running org.apache.maven.surefire.its.jiras.Surefire907PerThreadWithoutThreadCountIT
[2019-12-01T11:42:55.191Z] Zipped 17258 entries.
[2019-12-01T11:42:55.191Z] Archiving C:\Users\jenkins\AppData\Local\Temp\2\jenkins-maven-box-maven-surefire-junit5-runorder-3\surefire-its--windows-jdk11-maven3.6.x.zip
[2019-12-01T11:42:55.191Z] [Fast Archiver] No prior successful build to compare, so performing full copy of artifacts
[Pipeline] archiveArtifacts
[2019-12-01T11:42:56.471Z] Archiving artifacts
[2019-12-01T11:42:56.536Z] [Fast Archiver] No prior successful build to compare, so performing full copy of artifacts
[Pipeline] cleanWs
[2019-12-01T11:42:57.867Z] [WS-CLEANUP] Deleting project workspace...
[2019-12-01T11:42:57.867Z] [WS-CLEANUP] Deferred wipeout is used...
[2019-12-01T11:42:57.988Z] [WS-CLEANUP] done
[Pipeline] }
[Pipeline] // ws
[Pipeline] }
[Pipeline] // timestamps
[Pipeline] }
[Pipeline] // node
[Pipeline] }
[2019-12-01T11:42:59.059Z] [INFO] Tests run: 1, Failures: 0, Errors: 0, Skipped: 0, Time elapsed: 5.754 s - in org.apache.maven.surefire.its.jiras.Surefire907PerThreadWithoutThreadCountIT
[2019-12-01T11:42:59.059Z] [INFO] Running org.apache.maven.surefire.its.jiras.Surefire920TestFailureIgnoreWithTimeoutIT
[2019-12-01T11:43:17.466Z] [INFO] Tests run: 2, Failures: 0, Errors: 0, Skipped: 0, Time elapsed: 16.572 s - in org.apache.maven.surefire.its.jiras.Surefire920TestFailureIgnoreWithTimeoutIT
[2019-12-01T11:43:17.466Z] [INFO] Running org.apache.maven.surefire.its.jiras.Surefire926FailureWith2ProvidersIT
[2019-12-01T11:43:21.886Z] [INFO] Tests run: 1, Failures: 0, Errors: 0, Skipped: 0, Time elapsed: 5.538 s - in org.apache.maven.surefire.its.jiras.Surefire926FailureWith2ProvidersIT
[2019-12-01T11:43:21.886Z] [INFO] Running org.apache.maven.surefire.its.jiras.Surefire930TestNgSuiteXmlIT
[2019-12-01T11:43:29.726Z] [INFO] Tests run: 1, Failures: 0, Errors: 0, Skipped: 0, Time elapsed: 8.249 s - in org.apache.maven.surefire.its.jiras.Surefire930TestNgSuiteXmlIT
[2019-12-01T11:43:29.726Z] [INFO] Running org.apache.maven.surefire.its.jiras.Surefire943ReportContentIT
[2019-12-01T11:44:04.042Z] [INFO] Tests run: 2, Failures: 0, Errors: 0, Skipped: 0, Time elapsed: 30.114 s - in org.apache.maven.surefire.its.jiras.Surefire943ReportContentIT
[2019-12-01T11:44:04.042Z] [INFO] Running org.apache.maven.surefire.its.jiras.Surefire946KillMainProcessInReusableForkIT
[2019-12-01T11:45:11.040Z] [INFO] Tests run: 6, Failures: 0, Errors: 0, Skipped: 0, Time elapsed: 69.409 s - in org.apache.maven.surefire.its.jiras.Surefire946KillMainProcessInReusableForkIT
[2019-12-01T11:45:11.040Z] [INFO] Running org.apache.maven.surefire.its.jiras.Surefire972BizarreNoClassDefIT
[2019-12-01T11:45:18.885Z] [INFO] Tests run: 1, Failures: 0, Errors: 0, Skipped: 0, Time elapsed: 9.968 s - in org.apache.maven.surefire.its.jiras.Surefire972BizarreNoClassDefIT
[2019-12-01T11:45:18.885Z] [INFO] Running org.apache.maven.surefire.its.jiras.Surefire975DefaultVMEncodingIT
[2019-12-01T11:45:26.726Z] [INFO] Tests run: 1, Failures: 0, Errors: 0, Skipped: 0, Time elapsed: 7.61 s - in org.apache.maven.surefire.its.jiras.Surefire975DefaultVMEncodingIT
[2019-12-01T11:45:26.726Z] [INFO] Running org.apache.maven.surefire.its.jiras.Surefire979WrongClassLoaderIT
[2019-12-01T11:45:34.565Z] [INFO] Tests run: 1, Failures: 0, Errors: 0, Skipped: 0, Time elapsed: 6.86 s - in org.apache.maven.surefire.its.jiras.Surefire979WrongClassLoaderIT
[2019-12-01T11:45:34.565Z] [INFO] Running org.apache.maven.surefire.its.jiras.Surefire985ParameterizedRunnerAndCategoriesIT
[2019-12-01T11:45:39.834Z] [INFO] Tests run: 1, Failures: 0, Errors: 0, Skipped: 0, Time elapsed: 6.273 s - in org.apache.maven.surefire.its.jiras.Surefire985ParameterizedRunnerAndCategoriesIT
[2019-12-01T11:45:39.834Z] [INFO] Running org.apache.maven.surefire.its.jiras.Surefire995CategoryInheritanceIT
[2019-12-01T11:46:14.145Z] [INFO] Tests run: 5, Failures: 0, Errors: 0, Skipped: 0, Time elapsed: 29.908 s - in org.apache.maven.surefire.its.jiras.Surefire995CategoryInheritanceIT
[2019-12-01T11:46:14.146Z] [INFO]
[2019-12-01T11:46:14.146Z] [INFO] Results:
[2019-12-01T11:46:14.146Z] [INFO]
[2019-12-01T11:46:14.146Z] [WARNING] Tests run: 861, Failures: 0, Errors: 0, Skipped: 135
[2019-12-01T11:46:14.146Z] [INFO]
[2019-12-01T11:46:14.146Z] [INFO]
[2019-12-01T11:46:14.146Z] [INFO] --- maven-checkstyle-plugin:3.0.0:check (checkstyle-check) @ surefire-its ---
[2019-12-01T11:46:14.146Z] [INFO]
[2019-12-01T11:46:14.146Z] [INFO] --- maven-failsafe-plugin:3.0.0-M4:verify (default) @ surefire-its ---
[2019-12-01T11:46:14.146Z] [INFO] Failsafe report directory: /home/jenkins/jenkins-slave/workspace/x_maven-surefire_junit5-runorder@2/surefire-its/target/failsafe-reports
[2019-12-01T11:46:14.146Z] [INFO]
[2019-12-01T11:46:14.147Z] [INFO] --- maven-install-plugin:2.5.2:install (default-install) @ surefire-its ---
[2019-12-01T11:46:14.147Z] [INFO] Skipping artifact installation
[2019-12-01T11:46:14.147Z] [INFO]
[2019-12-01T11:46:14.147Z] [INFO] ----------< org.apache.maven.surefire:surefire-shared-utils >-----------
[2019-12-01T11:46:14.147Z] [INFO] Building Surefire Shared Utils 3.0.0-SNAPSHOT                    [25/25]
[2019-12-01T11:46:14.147Z] [INFO] --------------------------------[ jar ]---------------------------------
[2019-12-01T11:46:14.147Z] [INFO]
[2019-12-01T11:46:14.147Z] [INFO] --- maven-clean-plugin:3.1.0:clean (default-clean) @ surefire-shared-utils ---
[2019-12-01T11:46:14.147Z] [INFO]
[2019-12-01T11:46:14.147Z] [INFO] --- maven-enforcer-plugin:3.0.0-M2:enforce (enforce-maven-version) @ surefire-shared-utils ---
[2019-12-01T11:46:14.147Z] [INFO]
[2019-12-01T11:46:14.147Z] [INFO] --- maven-enforcer-plugin:3.0.0-M2:enforce (enforce-bytecode-version) @ surefire-shared-utils ---
[2019-12-01T11:46:14.147Z] [INFO]
[2019-12-01T11:46:14.147Z] [INFO] --- maven-enforcer-plugin:3.0.0-M2:enforce (ban-known-bad-maven-versions) @ surefire-shared-utils ---
[2019-12-01T11:46:14.147Z] [INFO]
[2019-12-01T11:46:14.147Z] [INFO] --- maven-enforcer-plugin:3.0.0-M2:enforce (enforce-java) @ surefire-shared-utils ---
[2019-12-01T11:46:14.147Z] [INFO]
[2019-12-01T11:46:14.147Z] [INFO] --- maven-enforcer-plugin:3.0.0-M2:enforce (enforce-maven) @ surefire-shared-utils ---
[2019-12-01T11:46:14.147Z] [INFO]
[2019-12-01T11:46:14.147Z] [INFO] --- apache-rat-plugin:0.12:check (rat-check) @ surefire-shared-utils ---
[2019-12-01T11:46:14.147Z] [INFO] Enabled default license matchers.
[2019-12-01T11:46:14.147Z] [INFO] Will parse SCM ignores for exclusions...
[2019-12-01T11:46:14.147Z] [INFO] Finished adding exclusions from SCM ignore files.
[2019-12-01T11:46:14.147Z] [INFO] 61 implicit excludes (use -debug for more details).
[2019-12-01T11:46:14.147Z] [INFO] Exclude: .repository/**
[2019-12-01T11:46:14.147Z] [INFO] Exclude: .maven/spy.log
[2019-12-01T11:46:14.147Z] [INFO] Exclude: dependency-reduced-pom.xml
[2019-12-01T11:46:14.147Z] [INFO] Exclude: .java-version
[2019-12-01T11:46:14.147Z] [INFO] Exclude: Jenkinsfile
[2019-12-01T11:46:14.147Z] [INFO] Exclude: README.md
[2019-12-01T11:46:14.147Z] [INFO] Exclude: .editorconfig
[2019-12-01T11:46:14.147Z] [INFO] Exclude: .gitignore
[2019-12-01T11:46:14.147Z] [INFO] Exclude: .git/**/*
[2019-12-01T11:46:14.147Z] [INFO] Exclude: **/.github/**
[2019-12-01T11:46:14.147Z] [INFO] Exclude: **/.idea
[2019-12-01T11:46:14.147Z] [INFO] Exclude: **/.svn/**/*
[2019-12-01T11:46:14.147Z] [INFO] Exclude: **/*.iml
[2019-12-01T11:46:14.147Z] [INFO] Exclude: **/*.ipr
[2019-12-01T11:46:14.147Z] [INFO] Exclude: **/*.iws
[2019-12-01T11:46:14.147Z] [INFO] Exclude: **/*.versionsBackup
[2019-12-01T11:46:14.147Z] [INFO] Exclude: **/dependency-reduced-pom.xml
[2019-12-01T11:46:14.147Z] [INFO] Exclude: .repository/**
[2019-12-01T11:46:14.147Z] [INFO] Exclude: src/test/resources/**/*
[2019-12-01T11:46:14.147Z] [INFO] Exclude: src/test/resources/**/*.css
[2019-12-01T11:46:14.147Z] [INFO] Exclude: **/*.jj
[2019-12-01T11:46:14.147Z] [INFO] Exclude: src/main/resources/META-INF/services/org.apache.maven.surefire.providerapi.SurefireProvider
[2019-12-01T11:46:14.147Z] [INFO] Exclude: DEPENDENCIES
[2019-12-01T11:46:14.147Z] [INFO] Exclude: .m2/**
[2019-12-01T11:46:14.147Z] [INFO] Exclude: .m2
[2019-12-01T11:46:14.147Z] [INFO] Exclude: .travis.yml
[2019-12-01T11:46:14.147Z] [INFO] 1 resources included (use -debug for more details)
[2019-12-01T11:46:14.147Z] [INFO] Rat check: Summary over all files. Unapproved: 0, unknown: 0, generated: 0, approved: 1 licenses.
[2019-12-01T11:46:14.147Z] [INFO]
[2019-12-01T11:46:14.147Z] [INFO] --- maven-compiler-plugin:3.7.0:compile (compile-generated) @ surefire-shared-utils ---
[2019-12-01T11:46:14.147Z] [INFO] No sources to compile
[2019-12-01T11:46:14.147Z] [INFO]
[2019-12-01T11:46:14.147Z] [INFO] --- maven-remote-resources-plugin:1.5:process (process-resource-bundles) @ surefire-shared-utils ---
[2019-12-01T11:46:14.147Z] [INFO]
[2019-12-01T11:46:14.147Z] [INFO] --- maven-resources-plugin:3.1.0:resources (default-resources) @ surefire-shared-utils ---
[2019-12-01T11:46:14.147Z] [INFO] Using 'UTF-8' encoding to copy filtered resources.
[2019-12-01T11:46:14.147Z] [INFO] skip non existing resourceDirectory /home/jenkins/jenkins-slave/workspace/x_maven-surefire_junit5-runorder@2/surefire-shared-utils/src/main/resources
[2019-12-01T11:46:14.147Z] [INFO] Copying 3 resources
[2019-12-01T11:46:14.147Z] [INFO]
[2019-12-01T11:46:14.147Z] [INFO] --- maven-compiler-plugin:3.7.0:compile (default-compile) @ surefire-shared-utils ---
[2019-12-01T11:46:14.147Z] [INFO] No sources to compile
[2019-12-01T11:46:14.147Z] [INFO]
[2019-12-01T11:46:14.147Z] [INFO] --- animal-sniffer-maven-plugin:1.17:check (signature-check) @ surefire-shared-utils ---
[2019-12-01T11:46:14.147Z] [INFO] Checking unresolved references to org.codehaus.mojo.signature:java17:1.0
[2019-12-01T11:46:14.147Z] [INFO]
[2019-12-01T11:46:14.147Z] [INFO] --- maven-resources-plugin:3.1.0:testResources (default-testResources) @ surefire-shared-utils ---
[2019-12-01T11:46:14.147Z] [INFO] Using 'UTF-8' encoding to copy filtered resources.
[2019-12-01T11:46:14.147Z] [INFO] skip non existing resourceDirectory /home/jenkins/jenkins-slave/workspace/x_maven-surefire_junit5-runorder@2/surefire-shared-utils/src/test/resources
[2019-12-01T11:46:14.147Z] [INFO] Copying 3 resources
[2019-12-01T11:46:14.147Z] [INFO]
[2019-12-01T11:46:14.147Z] [INFO] --- maven-compiler-plugin:3.7.0:testCompile (default-testCompile) @ surefire-shared-utils ---
[2019-12-01T11:46:14.147Z] [INFO] No sources to compile
[2019-12-01T11:46:14.147Z] [INFO]
[2019-12-01T11:46:14.147Z] [INFO] --- maven-surefire-plugin:3.0.0-M4:test (default-test) @ surefire-shared-utils ---
[2019-12-01T11:46:14.147Z] [INFO]
[2019-12-01T11:46:14.147Z] [INFO] --- maven-jar-plugin:3.1.0:jar (default-jar) @ surefire-shared-utils ---
[2019-12-01T11:46:14.148Z] [INFO] Building jar: /home/jenkins/jenkins-slave/workspace/x_maven-surefire_junit5-runorder@2/surefire-shared-utils/target/surefire-shared-utils-3.0.0-SNAPSHOT.jar
[2019-12-01T11:46:14.148Z] [INFO]
[2019-12-01T11:46:14.148Z] [INFO] --- maven-site-plugin:3.8.2:attach-descriptor (attach-descriptor) @ surefire-shared-utils ---
[2019-12-01T11:46:14.148Z] [INFO] Skipping because packaging 'jar' is not pom.
[2019-12-01T11:46:14.148Z] [INFO]
[2019-12-01T11:46:14.148Z] [INFO] --- maven-shade-plugin:3.1.1:shade (default) @ surefire-shared-utils ---
[2019-12-01T11:46:14.148Z] [INFO] Including org.apache.maven.shared:maven-shared-utils:jar:3.1.0 in the shaded jar.
[2019-12-01T11:46:14.148Z] [INFO] Including commons-io:commons-io:jar:2.6 in the shaded jar.
[2019-12-01T11:46:14.148Z] [INFO] Including org.apache.commons:commons-lang3:jar:3.8.1 in the shaded jar.
[2019-12-01T11:46:14.148Z] [INFO] Including org.apache.commons:commons-compress:jar:1.19 in the shaded jar.
[2019-12-01T11:46:14.148Z] [INFO] Including commons-codec:commons-codec:jar:1.11 in the shaded jar.
[2019-12-01T11:46:14.864Z] [INFO] Replacing original artifact with shaded artifact.
[2019-12-01T11:46:14.864Z] [INFO] Replacing /home/jenkins/jenkins-slave/workspace/x_maven-surefire_junit5-runorder@2/surefire-shared-utils/target/surefire-shared-utils-3.0.0-SNAPSHOT.jar with /home/jenkins/jenkins-slave/workspace/x_maven-surefire_junit5-runorder@2/surefire-shared-utils/target/surefire-shared-utils-3.0.0-SNAPSHOT-shaded.jar
[2019-12-01T11:46:14.864Z] [INFO] Dependency-reduced POM written at: /home/jenkins/jenkins-slave/workspace/x_maven-surefire_junit5-runorder@2/surefire-shared-utils/dependency-reduced-pom.xml
[2019-12-01T11:46:14.864Z] [INFO]
[2019-12-01T11:46:14.864Z] [INFO] --- maven-checkstyle-plugin:3.0.0:check (checkstyle-check) @ surefire-shared-utils ---
[2019-12-01T11:46:15.580Z] [INFO]
[2019-12-01T11:46:15.580Z] [INFO] --- maven-install-plugin:2.5.2:install (default-install) @ surefire-shared-utils ---
[2019-12-01T11:46:15.580Z] [INFO] Installing /home/jenkins/jenkins-slave/workspace/x_maven-surefire_junit5-runorder@2/surefire-shared-utils/target/surefire-shared-utils-3.0.0-SNAPSHOT.jar to /home/jenkins/jenkins-slave/workspace/x_maven-surefire_junit5-runorder@2/.m2/org/apache/maven/surefire/surefire-shared-utils/3.0.0-SNAPSHOT/surefire-shared-utils-3.0.0-SNAPSHOT.jar
[2019-12-01T11:46:15.580Z] [INFO] Installing /home/jenkins/jenkins-slave/workspace/x_maven-surefire_junit5-runorder@2/surefire-shared-utils/dependency-reduced-pom.xml to /home/jenkins/jenkins-slave/workspace/x_maven-surefire_junit5-runorder@2/.m2/org/apache/maven/surefire/surefire-shared-utils/3.0.0-SNAPSHOT/surefire-shared-utils-3.0.0-SNAPSHOT.pom
[2019-12-01T11:46:15.580Z] [INFO] ------------------------------------------------------------------------
[2019-12-01T11:46:15.580Z] [INFO] Reactor Summary for Apache Maven Surefire 3.0.0-SNAPSHOT:
[2019-12-01T11:46:15.580Z] [INFO]
[2019-12-01T11:46:15.580Z] [INFO] Apache Maven Surefire .............................. SUCCESS [ 21.051 s]
[2019-12-01T11:46:15.580Z] [INFO] SureFire Logger API ................................ SUCCESS [ 12.595 s]
[2019-12-01T11:46:15.580Z] [INFO] SureFire API ....................................... SUCCESS [ 13.913 s]
[2019-12-01T11:46:15.580Z] [INFO] Surefire Extensions API ............................ SUCCESS [  3.742 s]
[2019-12-01T11:46:15.580Z] [INFO] SureFire Booter .................................... SUCCESS [ 17.023 s]
[2019-12-01T11:46:15.580Z] [INFO] Maven Surefire Test-Grouping Support ............... SUCCESS [  6.980 s]
[2019-12-01T11:46:15.580Z] [INFO] SureFire Providers ................................. SUCCESS [  1.413 s]
[2019-12-01T11:46:15.580Z] [INFO] Shared JUnit3 Provider Code ........................ SUCCESS [  5.208 s]
[2019-12-01T11:46:15.580Z] [INFO] Shared Java 5 Provider Base ........................ SUCCESS [  5.663 s]
[2019-12-01T11:46:15.580Z] [INFO] Shared JUnit4 Provider Code ........................ SUCCESS [  5.572 s]
[2019-12-01T11:46:15.580Z] [INFO] Shared JUnit48 Provider Code ....................... SUCCESS [  6.814 s]
[2019-12-01T11:46:15.580Z] [INFO] SureFire JUnit Runner .............................. SUCCESS [  5.015 s]
[2019-12-01T11:46:15.580Z] [INFO] SureFire JUnit4 Runner ............................. SUCCESS [  5.147 s]
[2019-12-01T11:46:15.580Z] [INFO] Maven Surefire Common .............................. SUCCESS [ 56.971 s]
[2019-12-01T11:46:15.580Z] [INFO] SureFire JUnitCore Runner .......................... SUCCESS [02:21 min]
[2019-12-01T11:46:15.580Z] [INFO] SureFire JUnit Platform Runner ..................... SUCCESS [ 12.846 s]
[2019-12-01T11:46:15.580Z] [INFO] SureFire TestNG Utils .............................. SUCCESS [  5.183 s]
[2019-12-01T11:46:15.580Z] [INFO] SureFire TestNG Runner ............................. SUCCESS [  5.797 s]
[2019-12-01T11:46:15.580Z] [INFO] ShadeFire JUnit3 Provider .......................... SUCCESS [  2.291 s]
[2019-12-01T11:46:15.580Z] [INFO] Surefire Report Parser ............................. SUCCESS [  7.116 s]
[2019-12-01T11:46:15.580Z] [INFO] Maven Surefire Plugin .............................. SUCCESS [ 12.968 s]
[2019-12-01T11:46:15.580Z] [INFO] Maven Failsafe Plugin .............................. SUCCESS [01:12 min]
[2019-12-01T11:46:15.580Z] [INFO] Maven Surefire Report Plugin ....................... SUCCESS [ 18.271 s]
[2019-12-01T11:46:15.580Z] [INFO] Maven Surefire Integration Tests ................... SUCCESS [  01:24 h]
[2019-12-01T11:46:15.580Z] [INFO] Surefire Shared Utils .............................. SUCCESS [  3.173 s]
[2019-12-01T11:46:15.580Z] [INFO] ------------------------------------------------------------------------
[2019-12-01T11:46:15.580Z] [INFO] BUILD SUCCESS
[2019-12-01T11:46:15.580Z] [INFO] ------------------------------------------------------------------------
[2019-12-01T11:46:15.580Z] [INFO] Total time:  01:32 h
[2019-12-01T11:46:15.580Z] [INFO] Finished at: 2019-12-01T11:46:14Z
[2019-12-01T11:46:15.580Z] [INFO] ------------------------------------------------------------------------
[Pipeline] }
[Pipeline] // withEnv
[Pipeline] }
[Pipeline] // stage
[Pipeline] fileExists
[Pipeline] zip
[2019-12-01T11:46:16.648Z] Writing zip file of /home/jenkins/jenkins-slave/workspace/x_maven-surefire_junit5-runorder@2/maven-failsafe-plugin/target/it to /home/jenkins/jenkins-slave/workspace/x_maven-surefire_junit5-runorder@2/maven-failsafe-plugin--linux-jdk11-maven3.6.x.zip
[2019-12-01T11:46:16.844Z] Zipped 78 entries.
[2019-12-01T11:46:16.844Z] Archiving /home/jenkins/jenkins-slave/workspace/x_maven-surefire_junit5-runorder@2/maven-failsafe-plugin--linux-jdk11-maven3.6.x.zip
[2019-12-01T11:46:16.845Z] [Fast Archiver] No prior successful build to compare, so performing full copy of artifacts
[Pipeline] fileExists
[Pipeline] zip
[2019-12-01T11:46:18.000Z] Writing zip file of /home/jenkins/jenkins-slave/workspace/x_maven-surefire_junit5-runorder@2/surefire-its/target to /home/jenkins/jenkins-slave/workspace/x_maven-surefire_junit5-runorder@2/surefire-its--linux-jdk11-maven3.6.x.zip
[2019-12-01T11:46:30.259Z] Zipped 18356 entries.
[2019-12-01T11:46:30.259Z] Archiving /home/jenkins/jenkins-slave/workspace/x_maven-surefire_junit5-runorder@2/surefire-its--linux-jdk11-maven3.6.x.zip
[2019-12-01T11:46:30.260Z] [Fast Archiver] No prior successful build to compare, so performing full copy of artifacts
[Pipeline] archiveArtifacts
[2019-12-01T11:46:35.419Z] Archiving artifacts
[2019-12-01T11:46:35.577Z] [Fast Archiver] No prior successful build to compare, so performing full copy of artifacts
[Pipeline] cleanWs
[2019-12-01T11:46:40.507Z] [WS-CLEANUP] Deleting project workspace...
[2019-12-01T11:46:40.507Z] [WS-CLEANUP] Deferred wipeout is used...
[2019-12-01T11:46:40.835Z] [WS-CLEANUP] done
[Pipeline] }
[Pipeline] // ws
[Pipeline] }
[Pipeline] // timestamps
[Pipeline] }
[Pipeline] // node
[Pipeline] }
[Pipeline] // parallel
[Pipeline] echo
Build result: FAILURE
[Pipeline] jiraIssueSelector
[Pipeline] echo
The authors of changes [].
[Pipeline] echo
Sending email ...
[Pipeline] emailext
Reply | Threaded
Open this post in threaded view
|

Build succeeded in Jenkins: Maven TLP » maven-surefire » junit5-runorder #4

Apache Jenkins Server-2
See https://builds.apache.org/job/maven-box/job/maven-surefire/job/junit5-runorder/4/

Changes:

* reservedPort1 and reservedPort2 handled the same TCP port with the old

All tests passed