Build failed in Jenkins: Maven TLP » maven-surefire » jenkins #7

classic Classic list List threaded Threaded
6 messages Options
Reply | Threaded
Open this post in threaded view
|

Build failed in Jenkins: Maven TLP » maven-surefire » jenkins #7

Apache Jenkins Server-2
See https://builds.apache.org/job/maven-box/job/maven-surefire/job/jenkins/7/

Changes:

* H24 in unstable

No tests ran.

Build log:
[...truncated 13226 lines...]
[2020-02-08T22:10:38.503Z] [INFO] Exclude: .m2/**
[2020-02-08T22:10:38.503Z] [INFO] Exclude: .m2
[2020-02-08T22:10:38.503Z] [INFO] Exclude: .travis.yml
[2020-02-08T22:10:38.503Z] [INFO] 1 resources included (use -debug for more details)
[2020-02-08T22:10:38.503Z] [INFO] Rat check: Summary over all files. Unapproved: 0, unknown: 0, generated: 0, approved: 1 licenses.
[2020-02-08T22:10:38.503Z] [INFO]
[2020-02-08T22:10:38.503Z] [INFO] --- maven-compiler-plugin:3.7.0:compile (compile-generated) @ surefire-shared-utils ---
[2020-02-08T22:10:38.503Z] [INFO] No sources to compile
[2020-02-08T22:10:38.503Z] [INFO]
[2020-02-08T22:10:38.503Z] [INFO] --- maven-remote-resources-plugin:1.5:process (process-resource-bundles) @ surefire-shared-utils ---
[2020-02-08T22:10:38.503Z] [INFO]
[2020-02-08T22:10:38.503Z] [INFO] --- maven-resources-plugin:3.1.0:resources (default-resources) @ surefire-shared-utils ---
[2020-02-08T22:10:38.503Z] [INFO] Using 'UTF-8' encoding to copy filtered resources.
[2020-02-08T22:10:38.503Z] [INFO] skip non existing resourceDirectory /home/jenkins/jenkins-slave/workspace/maven-box_maven-surefire_jenkins@2/surefire-shared-utils/src/main/resources
[2020-02-08T22:10:38.503Z] [INFO] Copying 3 resources
[2020-02-08T22:10:38.503Z] [INFO]
[2020-02-08T22:10:38.503Z] [INFO] --- maven-compiler-plugin:3.7.0:compile (default-compile) @ surefire-shared-utils ---
[2020-02-08T22:10:38.503Z] [INFO] No sources to compile
[2020-02-08T22:10:38.503Z] [INFO]
[2020-02-08T22:10:38.503Z] [INFO] --- animal-sniffer-maven-plugin:1.17:check (signature-check) @ surefire-shared-utils ---
[2020-02-08T22:10:38.503Z] [INFO] Checking unresolved references to org.codehaus.mojo.signature:java17:1.0
[2020-02-08T22:10:39.215Z] [INFO]
[2020-02-08T22:10:39.215Z] [INFO] --- maven-resources-plugin:3.1.0:testResources (default-testResources) @ surefire-shared-utils ---
[2020-02-08T22:10:39.215Z] [INFO] Using 'UTF-8' encoding to copy filtered resources.
[2020-02-08T22:10:39.215Z] [INFO] skip non existing resourceDirectory /home/jenkins/jenkins-slave/workspace/maven-box_maven-surefire_jenkins@2/surefire-shared-utils/src/test/resources
[2020-02-08T22:10:39.215Z] [INFO] Copying 3 resources
[2020-02-08T22:10:39.215Z] [INFO]
[2020-02-08T22:10:39.215Z] [INFO] --- maven-compiler-plugin:3.7.0:testCompile (default-testCompile) @ surefire-shared-utils ---
[2020-02-08T22:10:39.215Z] [INFO] No sources to compile
[2020-02-08T22:10:39.215Z] [INFO]
[2020-02-08T22:10:39.215Z] [INFO] --- maven-surefire-plugin:3.0.0-M4:test (default-test) @ surefire-shared-utils ---
[2020-02-08T22:10:39.215Z] [INFO] Tests are skipped.
[2020-02-08T22:10:39.215Z] [INFO]
[2020-02-08T22:10:39.215Z] [INFO] --- maven-jar-plugin:3.1.0:jar (default-jar) @ surefire-shared-utils ---
[2020-02-08T22:10:39.215Z] [INFO] Building jar: /home/jenkins/jenkins-slave/workspace/maven-box_maven-surefire_jenkins@2/surefire-shared-utils/target/surefire-shared-utils-3.0.0-SNAPSHOT.jar
[2020-02-08T22:10:39.215Z] [INFO]
[2020-02-08T22:10:39.215Z] [INFO] --- maven-site-plugin:3.8.2:attach-descriptor (attach-descriptor) @ surefire-shared-utils ---
[2020-02-08T22:10:39.215Z] [INFO] Skipping because packaging 'jar' is not pom.
[2020-02-08T22:10:39.215Z] [INFO]
[2020-02-08T22:10:39.215Z] [INFO] --- maven-shade-plugin:3.1.1:shade (default) @ surefire-shared-utils ---
[2020-02-08T22:10:39.216Z] [INFO] Including org.apache.maven.shared:maven-shared-utils:jar:3.1.0 in the shaded jar.
[2020-02-08T22:10:39.216Z] [INFO] Including commons-io:commons-io:jar:2.6 in the shaded jar.
[2020-02-08T22:10:39.216Z] [INFO] Including org.apache.commons:commons-lang3:jar:3.8.1 in the shaded jar.
[2020-02-08T22:10:39.216Z] [INFO] Including org.apache.commons:commons-compress:jar:1.19 in the shaded jar.
[2020-02-08T22:10:39.216Z] [INFO] Including commons-codec:commons-codec:jar:1.11 in the shaded jar.
[2020-02-08T22:10:40.689Z] [INFO] Replacing original artifact with shaded artifact.
[2020-02-08T22:10:40.689Z] [INFO] Replacing /home/jenkins/jenkins-slave/workspace/maven-box_maven-surefire_jenkins@2/surefire-shared-utils/target/surefire-shared-utils-3.0.0-SNAPSHOT.jar with /home/jenkins/jenkins-slave/workspace/maven-box_maven-surefire_jenkins@2/surefire-shared-utils/target/surefire-shared-utils-3.0.0-SNAPSHOT-shaded.jar
[2020-02-08T22:10:40.689Z] [INFO] Dependency-reduced POM written at: /home/jenkins/jenkins-slave/workspace/maven-box_maven-surefire_jenkins@2/surefire-shared-utils/dependency-reduced-pom.xml
[2020-02-08T22:10:40.689Z] [INFO]
[2020-02-08T22:10:40.689Z] [INFO] --- maven-checkstyle-plugin:3.0.0:check (checkstyle-check) @ surefire-shared-utils ---
[2020-02-08T22:10:41.401Z] [INFO]
[2020-02-08T22:10:41.401Z] [INFO] --- maven-install-plugin:2.5.2:install (default-install) @ surefire-shared-utils ---
[2020-02-08T22:10:41.401Z] [INFO] Installing /home/jenkins/jenkins-slave/workspace/maven-box_maven-surefire_jenkins@2/surefire-shared-utils/target/surefire-shared-utils-3.0.0-SNAPSHOT.jar to /home/jenkins/jenkins-slave/workspace/maven-box_maven-surefire_jenkins@2/.m2/org/apache/maven/surefire/surefire-shared-utils/3.0.0-SNAPSHOT/surefire-shared-utils-3.0.0-SNAPSHOT.jar
[2020-02-08T22:10:41.401Z] [INFO] Installing /home/jenkins/jenkins-slave/workspace/maven-box_maven-surefire_jenkins@2/surefire-shared-utils/dependency-reduced-pom.xml to /home/jenkins/jenkins-slave/workspace/maven-box_maven-surefire_jenkins@2/.m2/org/apache/maven/surefire/surefire-shared-utils/3.0.0-SNAPSHOT/surefire-shared-utils-3.0.0-SNAPSHOT.pom
[2020-02-08T22:10:41.401Z] [INFO] ------------------------------------------------------------------------
[2020-02-08T22:10:41.401Z] [INFO] Reactor Summary for Apache Maven Surefire 3.0.0-SNAPSHOT:
[2020-02-08T22:10:41.401Z] [INFO]
[2020-02-08T22:10:41.401Z] [INFO] Apache Maven Surefire .............................. SUCCESS [ 17.984 s]
[2020-02-08T22:10:41.401Z] [INFO] SureFire Logger API ................................ SUCCESS [  8.466 s]
[2020-02-08T22:10:41.401Z] [INFO] SureFire API ....................................... SUCCESS [ 10.672 s]
[2020-02-08T22:10:41.401Z] [INFO] Surefire Extensions API ............................ SUCCESS [  4.521 s]
[2020-02-08T22:10:41.401Z] [INFO] SureFire Booter .................................... SUCCESS [  7.417 s]
[2020-02-08T22:10:41.401Z] [INFO] Maven Surefire Test-Grouping Support ............... SUCCESS [  5.779 s]
[2020-02-08T22:10:41.401Z] [INFO] SureFire Providers ................................. SUCCESS [  1.364 s]
[2020-02-08T22:10:41.401Z] [INFO] Shared JUnit3 Provider Code ........................ SUCCESS [  3.841 s]
[2020-02-08T22:10:41.401Z] [INFO] Shared Java 5 Provider Base ........................ SUCCESS [  4.511 s]
[2020-02-08T22:10:41.401Z] [INFO] Shared JUnit4 Provider Code ........................ SUCCESS [  4.657 s]
[2020-02-08T22:10:41.401Z] [INFO] Shared JUnit48 Provider Code ....................... SUCCESS [  5.499 s]
[2020-02-08T22:10:41.401Z] [INFO] SureFire JUnit Runner .............................. SUCCESS [  4.416 s]
[2020-02-08T22:10:41.401Z] [INFO] SureFire JUnit4 Runner ............................. SUCCESS [  4.086 s]
[2020-02-08T22:10:41.401Z] [INFO] Maven Surefire Common .............................. SUCCESS [ 18.713 s]
[2020-02-08T22:10:41.401Z] [INFO] SureFire JUnitCore Runner .......................... SUCCESS [  9.591 s]
[2020-02-08T22:10:41.401Z] [INFO] SureFire JUnit Platform Runner ..................... SUCCESS [  9.419 s]
[2020-02-08T22:10:41.401Z] [INFO] SureFire TestNG Utils .............................. SUCCESS [  4.468 s]
[2020-02-08T22:10:41.401Z] [INFO] SureFire TestNG Runner ............................. SUCCESS [  4.979 s]
[2020-02-08T22:10:41.401Z] [INFO] ShadeFire JUnit3 Provider .......................... SUCCESS [  2.056 s]
[2020-02-08T22:10:41.401Z] [INFO] Surefire Report Parser ............................. SUCCESS [  5.442 s]
[2020-02-08T22:10:41.402Z] [INFO] Maven Surefire Plugin .............................. SUCCESS [ 11.294 s]
[2020-02-08T22:10:41.402Z] [INFO] Maven Failsafe Plugin .............................. SUCCESS [  9.256 s]
[2020-02-08T22:10:41.402Z] [INFO] Maven Surefire Report Plugin ....................... SUCCESS [ 13.100 s]
[2020-02-08T22:10:41.402Z] [INFO] Maven Surefire Integration Tests ................... SUCCESS [ 12.847 s]
[2020-02-08T22:10:41.402Z] [INFO] Surefire Shared Utils .............................. SUCCESS [  3.418 s]
[2020-02-08T22:10:41.402Z] [INFO] ------------------------------------------------------------------------
[2020-02-08T22:10:41.402Z] [INFO] BUILD SUCCESS
[2020-02-08T22:10:41.402Z] [INFO] ------------------------------------------------------------------------
[2020-02-08T22:10:41.402Z] [INFO] Total time:  03:09 min
[2020-02-08T22:10:41.402Z] [INFO] Finished at: 2020-02-08T22:10:41Z
[2020-02-08T22:10:41.402Z] [INFO] ------------------------------------------------------------------------
[Pipeline] }
[Pipeline] // withEnv
[Pipeline] }
[Pipeline] // stage
[Pipeline] cleanWs
[2020-02-08T22:10:42.137Z] [WS-CLEANUP] Deleting project workspace...
[2020-02-08T22:10:42.137Z] [WS-CLEANUP] Deferred wipeout is used...
[2020-02-08T22:10:42.459Z] [WS-CLEANUP] done
[Pipeline] }
[Pipeline] // ws
[Pipeline] }
[Pipeline] // timestamps
[Pipeline] }
[Pipeline] // node
[Pipeline] }
[2020-02-08T22:11:47.900Z] [INFO]
[2020-02-08T22:11:47.900Z] [INFO] --- jacoco-maven-plugin:0.8.5:report (default-cli) @ surefire-shared-utils ---
[2020-02-08T22:11:47.900Z] [INFO] Skipping JaCoCo execution due to missing execution data file.
[2020-02-08T22:11:47.900Z] [INFO] ------------------------------------------------------------------------
[2020-02-08T22:11:47.900Z] [INFO] Reactor Summary for Apache Maven Surefire 3.0.0-SNAPSHOT:
[2020-02-08T22:11:47.900Z] [INFO]
[2020-02-08T22:11:47.900Z] [INFO] Apache Maven Surefire .............................. SUCCESS [ 15.316 s]
[2020-02-08T22:11:47.900Z] [INFO] SureFire Logger API ................................ SUCCESS [  5.534 s]
[2020-02-08T22:11:47.900Z] [INFO] SureFire API ....................................... SUCCESS [  7.986 s]
[2020-02-08T22:11:47.900Z] [INFO] Surefire Extensions API ............................ SUCCESS [  3.302 s]
[2020-02-08T22:11:47.900Z] [INFO] SureFire Booter .................................... SUCCESS [  5.110 s]
[2020-02-08T22:11:47.900Z] [INFO] Maven Surefire Test-Grouping Support ............... SUCCESS [  4.614 s]
[2020-02-08T22:11:47.900Z] [INFO] SureFire Providers ................................. SUCCESS [  0.964 s]
[2020-02-08T22:11:47.900Z] [INFO] Shared JUnit3 Provider Code ........................ SUCCESS [  2.684 s]
[2020-02-08T22:11:47.900Z] [INFO] Shared Java 5 Provider Base ........................ SUCCESS [  3.070 s]
[2020-02-08T22:11:47.900Z] [INFO] Shared JUnit4 Provider Code ........................ SUCCESS [  3.388 s]
[2020-02-08T22:11:47.900Z] [INFO] Shared JUnit48 Provider Code ....................... SUCCESS [  3.670 s]
[2020-02-08T22:11:47.900Z] [INFO] SureFire JUnit Runner .............................. SUCCESS [  2.857 s]
[2020-02-08T22:11:47.900Z] [INFO] SureFire JUnit4 Runner ............................. SUCCESS [  2.826 s]
[2020-02-08T22:11:47.900Z] [INFO] Maven Surefire Common .............................. SUCCESS [ 12.944 s]
[2020-02-08T22:11:47.900Z] [INFO] SureFire JUnitCore Runner .......................... SUCCESS [  6.691 s]
[2020-02-08T22:11:47.900Z] [INFO] SureFire JUnit Platform Runner ..................... SUCCESS [  6.314 s]
[2020-02-08T22:11:47.900Z] [INFO] SureFire TestNG Utils .............................. SUCCESS [  3.495 s]
[2020-02-08T22:11:47.900Z] [INFO] SureFire TestNG Runner ............................. SUCCESS [  3.756 s]
[2020-02-08T22:11:47.900Z] [INFO] ShadeFire JUnit3 Provider .......................... SUCCESS [  1.344 s]
[2020-02-08T22:11:47.900Z] [INFO] Surefire Report Parser ............................. SUCCESS [  4.173 s]
[2020-02-08T22:11:47.900Z] [INFO] Maven Surefire Plugin .............................. SUCCESS [  7.906 s]
[2020-02-08T22:11:47.900Z] [INFO] Maven Failsafe Plugin .............................. SUCCESS [  6.506 s]
[2020-02-08T22:11:47.900Z] [INFO] Maven Surefire Report Plugin ....................... SUCCESS [  9.874 s]
[2020-02-08T22:11:47.900Z] [INFO] Maven Surefire Integration Tests ................... SUCCESS [  9.140 s]
[2020-02-08T22:11:47.900Z] [INFO] Surefire Shared Utils .............................. SUCCESS [02:33 min]
[2020-02-08T22:11:47.900Z] [INFO] ------------------------------------------------------------------------
[2020-02-08T22:11:47.900Z] [INFO] BUILD SUCCESS
[2020-02-08T22:11:47.900Z] [INFO] ------------------------------------------------------------------------
[2020-02-08T22:11:47.900Z] [INFO] Total time:  04:48 min
[2020-02-08T22:11:47.900Z] [INFO] Finished at: 2020-02-08T22:09:47Z
[2020-02-08T22:11:47.900Z] [INFO] ------------------------------------------------------------------------
[Pipeline] }
[Pipeline] // withEnv
[Pipeline] }
[Pipeline] // stage
[Pipeline] openTasks
[2020-02-08T22:11:49.000Z] [TASKS] Scanning folder '/home/jenkins/jenkins-slave/workspace/maven-box_maven-surefire_jenkins@2' for files matching the pattern '**/maven-failsafe-plugin/src/main/java,**/maven-surefire-common/src/main/java,**/maven-surefire-plugin/src/main/java,**/maven-surefire-report-plugin/src/main/java,**/surefire-api/src/main/java,**/surefire-booter/src/main/java,**/surefire-extensions-api/src/main/java,**/surefire-grouper/src/main/java,**/surefire-its/src/main/java,**/surefire-logger-api/src/main/java,**/surefire-providers/**/src/main/java,**/surefire-report-parser/src/main/java' - excludes: null
[2020-02-08T22:11:49.000Z] [TASKS] Found 0 files to scan for tasks
[2020-02-08T22:11:49.000Z] [TASKS] Found 0 open tasks.
[2020-02-08T22:11:49.000Z] Skipping warnings blame since pipelines do not have an SCM link.%n
[2020-02-08T22:11:49.011Z] [TASKS] Computing warning deltas based on reference build #6
[Pipeline] jacoco
[2020-02-08T22:11:49.191Z] [JaCoCo plugin] Collecting JaCoCo coverage data...
[2020-02-08T22:11:49.191Z] [JaCoCo plugin] **/*.exec;**/maven-failsafe-plugin/target/classes,**/maven-surefire-common/target/classes,**/maven-surefire-plugin/target/classes,**/maven-surefire-report-plugin/target/classes,**/surefire-api/target/classes,**/surefire-booter/target/classes,**/surefire-extensions-api/target/classes,**/surefire-grouper/target/classes,**/surefire-its/target/classes,**/surefire-logger-api/target/classes,**/surefire-providers/**/target/classes,**/surefire-report-parser/target/classes;**/maven-failsafe-plugin/src/main/java,**/maven-surefire-common/src/main/java,**/maven-surefire-plugin/src/main/java,**/maven-surefire-report-plugin/src/main/java,**/surefire-api/src/main/java,**/surefire-booter/src/main/java,**/surefire-extensions-api/src/main/java,**/surefire-grouper/src/main/java,**/surefire-its/src/main/java,**/surefire-logger-api/src/main/java,**/surefire-providers/**/src/main/java,**/surefire-report-parser/src/main/java; locations are configured
[2020-02-08T22:11:49.636Z] [JaCoCo plugin] Number of found exec files for pattern **/*.exec: 0
[2020-02-08T22:11:50.098Z] [JaCoCo plugin] Saving matched execfiles:  
[2020-02-08T22:11:50.266Z] [JaCoCo plugin] Saving matched class directories for class-pattern: **/maven-failsafe-plugin/target/classes,**/maven-surefire-common/target/classes,**/maven-surefire-plugin/target/classes,**/maven-surefire-report-plugin/target/classes,**/surefire-api/target/classes,**/surefire-booter/target/classes,**/surefire-extensions-api/target/classes,**/surefire-grouper/target/classes,**/surefire-its/target/classes,**/surefire-logger-api/target/classes,**/surefire-providers/**/target/classes,**/surefire-report-parser/target/classes:
[2020-02-08T22:11:50.615Z] [JaCoCo plugin]  - /home/jenkins/jenkins-slave/workspace/maven-box_maven-surefire_jenkins@2/maven-failsafe-plugin/target/classes 4 files
[2020-02-08T22:11:50.776Z] [JaCoCo plugin]  - /home/jenkins/jenkins-slave/workspace/maven-box_maven-surefire_jenkins@2/maven-surefire-common/target/classes 144 files
[2020-02-08T22:11:50.943Z] [JaCoCo plugin]  - /home/jenkins/jenkins-slave/workspace/maven-box_maven-surefire_jenkins@2/maven-surefire-plugin/target/classes 2 files
[2020-02-08T22:11:51.147Z] [JaCoCo plugin]  - /home/jenkins/jenkins-slave/workspace/maven-box_maven-surefire_jenkins@2/maven-surefire-report-plugin/target/classes 10 files
[2020-02-08T22:11:51.334Z] [JaCoCo plugin]  - /home/jenkins/jenkins-slave/workspace/maven-box_maven-surefire_jenkins@2/surefire-api/target/classes 108 files
[2020-02-08T22:11:51.501Z] [JaCoCo plugin]  - /home/jenkins/jenkins-slave/workspace/maven-box_maven-surefire_jenkins@2/surefire-booter/target/classes 39 files
[2020-02-08T22:11:51.679Z] [JaCoCo plugin]  - /home/jenkins/jenkins-slave/workspace/maven-box_maven-surefire_jenkins@2/surefire-extensions-api/target/classes 16 files
[2020-02-08T22:11:51.889Z] [JaCoCo plugin]  - /home/jenkins/jenkins-slave/workspace/maven-box_maven-surefire_jenkins@2/surefire-grouper/target/classes 17 files
[2020-02-08T22:11:52.051Z] [JaCoCo plugin]  - /home/jenkins/jenkins-slave/workspace/maven-box_maven-surefire_jenkins@2/surefire-its/target/classes 0 files
[2020-02-08T22:11:52.213Z] [JaCoCo plugin]  - /home/jenkins/jenkins-slave/workspace/maven-box_maven-surefire_jenkins@2/surefire-logger-api/target/classes 6 files
[2020-02-08T22:11:52.374Z] [JaCoCo plugin]  - /home/jenkins/jenkins-slave/workspace/maven-box_maven-surefire_jenkins@2/surefire-providers/common-java5/target/classes 5 files
[2020-02-08T22:11:52.545Z] [JaCoCo plugin]  - /home/jenkins/jenkins-slave/workspace/maven-box_maven-surefire_jenkins@2/surefire-providers/common-junit3/target/classes 2 files
[2020-02-08T22:11:52.711Z] [JaCoCo plugin]  - /home/jenkins/jenkins-slave/workspace/maven-box_maven-surefire_jenkins@2/surefire-providers/common-junit4/target/classes 13 files
[2020-02-08T22:11:52.877Z] [JaCoCo plugin]  - /home/jenkins/jenkins-slave/workspace/maven-box_maven-surefire_jenkins@2/surefire-providers/common-junit48/target/classes 10 files
[2020-02-08T22:11:53.041Z] [JaCoCo plugin]  - /home/jenkins/jenkins-slave/workspace/maven-box_maven-surefire_jenkins@2/surefire-providers/surefire-junit-platform/target/classes 5 files
[2020-02-08T22:11:53.202Z] [JaCoCo plugin]  - /home/jenkins/jenkins-slave/workspace/maven-box_maven-surefire_jenkins@2/surefire-providers/surefire-junit3/target/classes 7 files
[2020-02-08T22:11:53.389Z] [JaCoCo plugin]  - /home/jenkins/jenkins-slave/workspace/maven-box_maven-surefire_jenkins@2/surefire-providers/surefire-junit4/target/classes 4 files
[2020-02-08T22:11:53.549Z] [JaCoCo plugin]  - /home/jenkins/jenkins-slave/workspace/maven-box_maven-surefire_jenkins@2/surefire-providers/surefire-junit47/target/classes 53 files
[2020-02-08T22:11:53.722Z] [JaCoCo plugin]  - /home/jenkins/jenkins-slave/workspace/maven-box_maven-surefire_jenkins@2/surefire-providers/surefire-testng-utils/target/classes 6 files
[2020-02-08T22:11:53.883Z] [JaCoCo plugin]  - /home/jenkins/jenkins-slave/workspace/maven-box_maven-surefire_jenkins@2/surefire-providers/surefire-testng/target/classes 23 files
[2020-02-08T22:11:54.345Z] [JaCoCo plugin]  - /home/jenkins/jenkins-slave/workspace/maven-box_maven-surefire_jenkins@2/surefire-report-parser/target/classes 4 files
[2020-02-08T22:11:54.345Z] [JaCoCo plugin] Saving matched source directories for source-pattern: **/maven-failsafe-plugin/src/main/java,**/maven-surefire-common/src/main/java,**/maven-surefire-plugin/src/main/java,**/maven-surefire-report-plugin/src/main/java,**/surefire-api/src/main/java,**/surefire-booter/src/main/java,**/surefire-extensions-api/src/main/java,**/surefire-grouper/src/main/java,**/surefire-its/src/main/java,**/surefire-logger-api/src/main/java,**/surefire-providers/**/src/main/java,**/surefire-report-parser/src/main/java:
[2020-02-08T22:11:54.345Z] [JaCoCo plugin] Source Inclusions: **/*.java
[2020-02-08T22:11:54.508Z] [JaCoCo plugin] Source Exclusions:
[2020-02-08T22:11:54.725Z] [JaCoCo plugin] - /home/jenkins/jenkins-slave/workspace/maven-box_maven-surefire_jenkins@2/maven-failsafe-plugin/src/main/java 3 files
[2020-02-08T22:11:54.884Z] [JaCoCo plugin] - /home/jenkins/jenkins-slave/workspace/maven-box_maven-surefire_jenkins@2/maven-surefire-common/src/main/java 87 files
[2020-02-08T22:11:55.048Z] [JaCoCo plugin] - /home/jenkins/jenkins-slave/workspace/maven-box_maven-surefire_jenkins@2/maven-surefire-plugin/src/main/java 1 files
[2020-02-08T22:11:55.241Z] [JaCoCo plugin] - /home/jenkins/jenkins-slave/workspace/maven-box_maven-surefire_jenkins@2/maven-surefire-report-plugin/src/main/java 7 files
[2020-02-08T22:11:55.415Z] [JaCoCo plugin] - /home/jenkins/jenkins-slave/workspace/maven-box_maven-surefire_jenkins@2/surefire-api/src/main/java 83 files
[2020-02-08T22:11:55.579Z] [JaCoCo plugin] - /home/jenkins/jenkins-slave/workspace/maven-box_maven-surefire_jenkins@2/surefire-booter/src/main/java 24 files
[2020-02-08T22:11:55.742Z] [JaCoCo plugin] - /home/jenkins/jenkins-slave/workspace/maven-box_maven-surefire_jenkins@2/surefire-extensions-api/src/main/java 14 files
[2020-02-08T22:11:55.905Z] [JaCoCo plugin] - /home/jenkins/jenkins-slave/workspace/maven-box_maven-surefire_jenkins@2/surefire-grouper/src/main/java 6 files
[2020-02-08T22:11:56.066Z] [JaCoCo plugin] - /home/jenkins/jenkins-slave/workspace/maven-box_maven-surefire_jenkins@2/surefire-logger-api/src/main/java 6 files
[2020-02-08T22:11:56.226Z] [JaCoCo plugin] - /home/jenkins/jenkins-slave/workspace/maven-box_maven-surefire_jenkins@2/surefire-providers/common-java5/src/main/java 5 files
[2020-02-08T22:11:56.697Z] [JaCoCo plugin] - /home/jenkins/jenkins-slave/workspace/maven-box_maven-surefire_jenkins@2/surefire-providers/common-junit3/src/main/java 2 files
[2020-02-08T22:11:56.857Z] [JaCoCo plugin] - /home/jenkins/jenkins-slave/workspace/maven-box_maven-surefire_jenkins@2/surefire-providers/common-junit4/src/main/java 10 files
[2020-02-08T22:11:57.019Z] [JaCoCo plugin] - /home/jenkins/jenkins-slave/workspace/maven-box_maven-surefire_jenkins@2/surefire-providers/common-junit48/src/main/java 10 files
[2020-02-08T22:11:57.211Z] [JaCoCo plugin] - /home/jenkins/jenkins-slave/workspace/maven-box_maven-surefire_jenkins@2/surefire-providers/surefire-junit-platform/src/main/java 4 files
[2020-02-08T22:11:57.372Z] [JaCoCo plugin] - /home/jenkins/jenkins-slave/workspace/maven-box_maven-surefire_jenkins@2/surefire-providers/surefire-junit3/src/main/java 6 files
[2020-02-08T22:11:57.558Z] [JaCoCo plugin] - /home/jenkins/jenkins-slave/workspace/maven-box_maven-surefire_jenkins@2/surefire-providers/surefire-junit4/src/main/java 2 files
[2020-02-08T22:11:57.718Z] [JaCoCo plugin] - /home/jenkins/jenkins-slave/workspace/maven-box_maven-surefire_jenkins@2/surefire-providers/surefire-junit47/src/main/java 39 files
[2020-02-08T22:11:57.889Z] [JaCoCo plugin] - /home/jenkins/jenkins-slave/workspace/maven-box_maven-surefire_jenkins@2/surefire-providers/surefire-testng-utils/src/main/java 6 files
[2020-02-08T22:11:58.052Z] [JaCoCo plugin] - /home/jenkins/jenkins-slave/workspace/maven-box_maven-surefire_jenkins@2/surefire-providers/surefire-testng/src/main/java 17 files
[2020-02-08T22:11:58.052Z] [JaCoCo plugin] - /home/jenkins/jenkins-slave/workspace/maven-box_maven-surefire_jenkins@2/surefire-report-parser/src/main/java 4 files
[2020-02-08T22:11:58.052Z] [JaCoCo plugin] Loading inclusions files..
[2020-02-08T22:11:58.052Z] [JaCoCo plugin] inclusions: []
[2020-02-08T22:11:58.052Z] [JaCoCo plugin] exclusions: []
[2020-02-08T22:11:58.136Z] [JaCoCo plugin] Thresholds: JacocoHealthReportThresholds [minClass=0, maxClass=0, minMethod=0, maxMethod=0, minLine=0, maxLine=0, minBranch=0, maxBranch=0, minInstruction=0, maxInstruction=0, minComplexity=0, maxComplexity=0]
[2020-02-08T22:11:58.136Z] [JaCoCo plugin] Publishing the results..
[2020-02-08T22:11:58.207Z] [JaCoCo plugin] Loading packages..
[2020-02-08T22:11:58.213Z] [JaCoCo plugin] Done.
[2020-02-08T22:11:58.213Z] [JaCoCo plugin] Overall coverage: class: 0, method: 0, line: 0, branch: 0, instruction: 0
[Pipeline] junit
[2020-02-08T22:11:58.387Z] Recording test results
[2020-02-08T22:11:58.916Z] None of the test reports contained any result
[Pipeline] cleanWs
[2020-02-08T22:11:59.248Z] [WS-CLEANUP] Deleting project workspace...
[2020-02-08T22:11:59.248Z] [WS-CLEANUP] Deferred wipeout is used...
[2020-02-08T22:11:59.576Z] [WS-CLEANUP] done
[Pipeline] }
[Pipeline] // ws
[Pipeline] }
[Pipeline] // timestamps
[Pipeline] }
[Pipeline] // node
[Pipeline] }
Aborted by tibordigana
[Pipeline] // node
[Pipeline] // node
[Pipeline] // node
[Pipeline] // node
[Pipeline] // node
[Pipeline] }
Failed in branch windows-jdk14-maven3.6.x
[Pipeline] }
Failed in branch windows-jdk13-maven3.6.x
[Pipeline] }
Failed in branch windows-jdk11-maven3.6.x
[Pipeline] }
Failed in branch windows-jdk8-maven3.6.x
[Pipeline] }
Failed in branch windows-jdk7-maven3.6.x
[Pipeline] // parallel
[Pipeline] echo
org.jenkinsci.plugins.workflow.steps.FlowInterruptedException: org.jenkinsci.plugins.workflow.steps.FlowInterruptedException
[Pipeline] echo
Build result: FAILURE
[Pipeline] jiraIssueSelector
[Pipeline] echo
The authors of changes [rfscholte].
[Pipeline] echo
Sending email ...
[Pipeline] emailext
Reply | Threaded
Open this post in threaded view
|

Build failed in Jenkins: Maven TLP » maven-surefire » jenkins #8

Apache Jenkins Server-2
See https://builds.apache.org/job/maven-box/job/maven-surefire/job/jenkins/8/

Changes:

* add Maven 3.1.1
* working with Maven 3.1.1

No tests ran.

Build log:
[...truncated 533 lines...]
[Pipeline] sh
[2020-02-13T21:58:00.716Z] Commit message: "working with Maven 3.1.1"
[2020-02-13T21:58:00.718Z] Cleaning workspace
[2020-02-13T21:58:00.754Z] Checking out Revision 1aebf22c7a634a4059d75e161365b9299638d665 (jenkins)
[2020-02-13T21:58:00.828Z] [WS-CLEANUP] Deleting project workspace...
[2020-02-13T21:58:00.828Z] [WS-CLEANUP] Deferred wipeout is used...
[2020-02-13T21:58:00.834Z] [TASKS] Scanning folder '/home/jenkins/jenkins-slave/workspace/maven-box_maven-surefire_jenkins@2' for files matching the pattern '**/maven-failsafe-plugin/src/main/java,**/maven-surefire-common/src/main/java,**/maven-surefire-plugin/src/main/java,**/maven-surefire-report-plugin/src/main/java,**/surefire-api/src/main/java,**/surefire-booter/src/main/java,**/surefire-extensions-api/src/main/java,**/surefire-grouper/src/main/java,**/surefire-its/src/main/java,**/surefire-logger-api/src/main/java,**/surefire-providers/**/src/main/java,**/surefire-report-parser/src/main/java' - excludes: null
[2020-02-13T21:58:00.834Z] [TASKS] Found 0 files to scan for tasks
[2020-02-13T21:58:00.834Z] [TASKS] Found 0 open tasks.
[2020-02-13T21:58:00.834Z] Skipping warnings blame since pipelines do not have an SCM link.%n
[2020-02-13T21:58:00.850Z] [TASKS] Computing warning deltas based on reference build #6
[2020-02-13T21:58:01.144Z] [WS-CLEANUP] done
[2020-02-13T21:58:01.400Z] Commit message: "working with Maven 3.1.1"
[2020-02-13T21:58:01.400Z] Cleaning workspace
[2020-02-13T21:58:00.756Z]  > git config core.sparsecheckout # timeout=10
[2020-02-13T21:58:00.849Z]  > git checkout -f 1aebf22c7a634a4059d75e161365b9299638d665
[Pipeline] // stage
[Pipeline] echo
[2020-02-13T21:58:01.642Z] Setting JDK for testing JDK 11 (latest)
[Pipeline] stage
[Pipeline] { (build windows-jdk11-maven3.1.x)
[Pipeline] jacoco
[Pipeline] }
[Pipeline] isUnix
[Pipeline] tool
[Pipeline] // ws
[Pipeline] }
[Pipeline] tool
[Pipeline] // timestamps
[Pipeline] }
[2020-02-13T21:58:00.719Z]  > git rev-parse --verify HEAD # timeout=10
[2020-02-13T21:58:01.843Z] [JaCoCo plugin] Collecting JaCoCo coverage data...
[2020-02-13T21:58:01.844Z] [JaCoCo plugin] **/*.exec;**/maven-failsafe-plugin/target/classes,**/maven-surefire-common/target/classes,**/maven-surefire-plugin/target/classes,**/maven-surefire-report-plugin/target/classes,**/surefire-api/target/classes,**/surefire-booter/target/classes,**/surefire-extensions-api/target/classes,**/surefire-grouper/target/classes,**/surefire-its/target/classes,**/surefire-logger-api/target/classes,**/surefire-providers/**/target/classes,**/surefire-report-parser/target/classes;**/maven-failsafe-plugin/src/main/java,**/maven-surefire-common/src/main/java,**/maven-surefire-plugin/src/main/java,**/maven-surefire-report-plugin/src/main/java,**/surefire-api/src/main/java,**/surefire-booter/src/main/java,**/surefire-extensions-api/src/main/java,**/surefire-grouper/src/main/java,**/surefire-its/src/main/java,**/surefire-logger-api/src/main/java,**/surefire-providers/**/src/main/java,**/surefire-report-parser/src/main/java; locations are configured
[Pipeline] tool
[Pipeline] // node
[Pipeline] }
Failed in branch linux-jdk11-maven3.1.x
[Pipeline] }
[Pipeline] // stage
[Pipeline] cleanWs
[2020-02-13T21:58:02.025Z] [WS-CLEANUP] Deleting project workspace...
[2020-02-13T21:58:02.025Z] [WS-CLEANUP] Deferred wipeout is used...
[2020-02-13T21:58:02.117Z] [JaCoCo plugin] Number of found exec files for pattern **/*.exec: 0
[2020-02-13T21:58:02.313Z] + mkdir -p .m2
[2020-02-13T21:58:02.391Z] [JaCoCo plugin] Saving matched execfiles:  
[Pipeline] pwd
[Pipeline] echo
[2020-02-13T21:58:02.647Z] Maven Local Repository = /home/jenkins/jenkins-slave/workspace/maven-box_maven-surefire_jenkins@2/.m2.
[Pipeline] stage
[Pipeline] { (checkout linux-jdk7-maven3.1.x)
[2020-02-13T21:58:02.681Z] [JaCoCo plugin] Saving matched class directories for class-pattern: **/maven-failsafe-plugin/target/classes,**/maven-surefire-common/target/classes,**/maven-surefire-plugin/target/classes,**/maven-surefire-report-plugin/target/classes,**/surefire-api/target/classes,**/surefire-booter/target/classes,**/surefire-extensions-api/target/classes,**/surefire-grouper/target/classes,**/surefire-its/target/classes,**/surefire-logger-api/target/classes,**/surefire-providers/**/target/classes,**/surefire-report-parser/target/classes:
[2020-02-13T21:58:02.681Z] [JaCoCo plugin] Saving matched source directories for source-pattern: **/maven-failsafe-plugin/src/main/java,**/maven-surefire-common/src/main/java,**/maven-surefire-plugin/src/main/java,**/maven-surefire-report-plugin/src/main/java,**/surefire-api/src/main/java,**/surefire-booter/src/main/java,**/surefire-extensions-api/src/main/java,**/surefire-grouper/src/main/java,**/surefire-its/src/main/java,**/surefire-logger-api/src/main/java,**/surefire-providers/**/src/main/java,**/surefire-report-parser/src/main/java:
[2020-02-13T21:58:02.681Z] [JaCoCo plugin] Source Inclusions: **/*.java
[Pipeline] checkout
[2020-02-13T21:58:01.404Z]  > git rev-parse --verify HEAD # timeout=10
[2020-02-13T21:58:01.981Z] Resetting working tree
[2020-02-13T21:58:01.981Z]  > git reset --hard # timeout=10
[2020-02-13T21:58:02.616Z]  > git clean -fdx # timeout=10
[Pipeline] }
[Pipeline] // stage
[2020-02-13T21:58:02.975Z] [WS-CLEANUP] done
[Pipeline] echo
[2020-02-13T21:58:02.983Z] Setting JDK for testing JDK 1.7 (latest)
[Pipeline] stage
[Pipeline] { (build windows-jdk7-maven3.1.x)
[2020-02-13T21:58:03.002Z] [JaCoCo plugin] Source Exclusions:
[Pipeline] }
[Pipeline] isUnix
[Pipeline] tool
[Pipeline] // ws
[Pipeline] }
[Pipeline] tool
[Pipeline] // timestamps
[Pipeline] }
[Pipeline] tool
[Pipeline] // node
[Pipeline] }
Failed in branch windows-jdk11-maven3.1.x
[Pipeline] }
[Pipeline] // stage
[Pipeline] cleanWs
[2020-02-13T21:58:03.360Z] [WS-CLEANUP] Deleting project workspace...
[2020-02-13T21:58:03.360Z] [WS-CLEANUP] Deferred wipeout is used...
[2020-02-13T21:58:03.388Z] [WS-CLEANUP] done
[Pipeline] }
[Pipeline] // ws
[Pipeline] }
[2020-02-13T21:58:03.487Z] No credentials specified
[2020-02-13T21:58:03.492Z] [JaCoCo plugin] - /home/jenkins/jenkins-slave/workspace/maven-box_maven-surefire_jenkins@2/maven-failsafe-plugin/src/main/java 3 files
[Pipeline] // timestamps
[2020-02-13T21:58:03.329Z] Resetting working tree
[2020-02-13T21:58:03.329Z]  > git reset --hard # timeout=10
[Pipeline] }
[Pipeline] // node
[2020-02-13T21:58:03.643Z] Cloning the remote Git repository
[2020-02-13T21:58:03.643Z] Cloning with configured refspecs honoured and without tags
[2020-02-13T21:58:03.653Z] [JaCoCo plugin] - /home/jenkins/jenkins-slave/workspace/maven-box_maven-surefire_jenkins@2/maven-surefire-common/src/main/java 87 files
[Pipeline] }
Failed in branch windows-jdk7-maven3.1.x
[2020-02-13T21:58:03.821Z] [JaCoCo plugin] - /home/jenkins/jenkins-slave/workspace/maven-box_maven-surefire_jenkins@2/maven-surefire-plugin/src/main/java 1 files
[2020-02-13T21:58:03.762Z] Cloning repository https://gitbox.apache.org/repos/asf/maven-surefire.git
[2020-02-13T21:58:03.762Z]  > git init /home/jenkins/jenkins-slave/workspace/maven-box_maven-surefire_jenkins@2 # timeout=10
[2020-02-13T21:58:03.776Z] Fetching upstream changes from https://gitbox.apache.org/repos/asf/maven-surefire.git
[2020-02-13T21:58:03.776Z]  > git --version # timeout=10
[2020-02-13T21:58:03.781Z]  > git fetch --no-tags --progress -- https://gitbox.apache.org/repos/asf/maven-surefire.git +refs/heads/*:refs/remotes/origin/*
[2020-02-13T21:58:04.024Z] [JaCoCo plugin] - /home/jenkins/jenkins-slave/workspace/maven-box_maven-surefire_jenkins@2/maven-surefire-report-plugin/src/main/java 7 files
[2020-02-13T21:58:04.205Z] [JaCoCo plugin] - /home/jenkins/jenkins-slave/workspace/maven-box_maven-surefire_jenkins@2/surefire-api/src/main/java 83 files
[2020-02-13T21:58:04.370Z] [JaCoCo plugin] - /home/jenkins/jenkins-slave/workspace/maven-box_maven-surefire_jenkins@2/surefire-booter/src/main/java 24 files
[2020-02-13T21:58:04.532Z] [JaCoCo plugin] - /home/jenkins/jenkins-slave/workspace/maven-box_maven-surefire_jenkins@2/surefire-extensions-api/src/main/java 14 files
[2020-02-13T21:58:04.694Z] [JaCoCo plugin] - /home/jenkins/jenkins-slave/workspace/maven-box_maven-surefire_jenkins@2/surefire-grouper/src/main/java 6 files
[2020-02-13T21:58:04.856Z] [JaCoCo plugin] - /home/jenkins/jenkins-slave/workspace/maven-box_maven-surefire_jenkins@2/surefire-logger-api/src/main/java 6 files
[2020-02-13T21:58:05.017Z] [JaCoCo plugin] - /home/jenkins/jenkins-slave/workspace/maven-box_maven-surefire_jenkins@2/surefire-providers/common-java5/src/main/java 5 files
[2020-02-13T21:58:05.181Z] [JaCoCo plugin] - /home/jenkins/jenkins-slave/workspace/maven-box_maven-surefire_jenkins@2/surefire-providers/common-junit3/src/main/java 2 files
[2020-02-13T21:58:05.348Z] [JaCoCo plugin] - /home/jenkins/jenkins-slave/workspace/maven-box_maven-surefire_jenkins@2/surefire-providers/common-junit4/src/main/java 10 files
[2020-02-13T21:58:05.362Z] Commit message: "working with Maven 3.1.1"
[2020-02-13T21:58:05.362Z] Cleaning workspace
[2020-02-13T21:58:05.511Z] [JaCoCo plugin] - /home/jenkins/jenkins-slave/workspace/maven-box_maven-surefire_jenkins@2/surefire-providers/common-junit48/src/main/java 10 files
[2020-02-13T21:58:05.674Z] [JaCoCo plugin] - /home/jenkins/jenkins-slave/workspace/maven-box_maven-surefire_jenkins@2/surefire-providers/surefire-junit-platform/src/main/java 4 files
[2020-02-13T21:58:05.836Z] [JaCoCo plugin] - /home/jenkins/jenkins-slave/workspace/maven-box_maven-surefire_jenkins@2/surefire-providers/surefire-junit3/src/main/java 6 files
[2020-02-13T21:58:06.029Z] [JaCoCo plugin] - /home/jenkins/jenkins-slave/workspace/maven-box_maven-surefire_jenkins@2/surefire-providers/surefire-junit4/src/main/java 2 files
[2020-02-13T21:58:05.364Z]  > git rev-parse --verify HEAD # timeout=10
[2020-02-13T21:58:06.190Z] [JaCoCo plugin] - /home/jenkins/jenkins-slave/workspace/maven-box_maven-surefire_jenkins@2/surefire-providers/surefire-junit47/src/main/java 39 files
[2020-02-13T21:58:06.356Z] Fetching without tags
[2020-02-13T21:58:06.361Z] [JaCoCo plugin] - /home/jenkins/jenkins-slave/workspace/maven-box_maven-surefire_jenkins@2/surefire-providers/surefire-testng-utils/src/main/java 6 files
[2020-02-13T21:58:06.524Z] [JaCoCo plugin] - /home/jenkins/jenkins-slave/workspace/maven-box_maven-surefire_jenkins@2/surefire-providers/surefire-testng/src/main/java 17 files
[2020-02-13T21:58:06.524Z] [JaCoCo plugin] - /home/jenkins/jenkins-slave/workspace/maven-box_maven-surefire_jenkins@2/surefire-report-parser/src/main/java 4 files
[2020-02-13T21:58:06.524Z] [JaCoCo plugin] Loading inclusions files..
[2020-02-13T21:58:06.524Z] [JaCoCo plugin] inclusions: []
[2020-02-13T21:58:06.524Z] [JaCoCo plugin] exclusions: []
[2020-02-13T21:58:06.524Z] [JaCoCo plugin] Thresholds: JacocoHealthReportThresholds [minClass=0, maxClass=0, minMethod=0, maxMethod=0, minLine=0, maxLine=0, minBranch=0, maxBranch=0, minInstruction=0, maxInstruction=0, minComplexity=0, maxComplexity=0]
[2020-02-13T21:58:06.525Z] [JaCoCo plugin] Publishing the results..
[2020-02-13T21:58:06.525Z] [JaCoCo plugin] Loading packages..
[2020-02-13T21:58:06.525Z] [JaCoCo plugin] Done.
[2020-02-13T21:58:06.525Z] [JaCoCo plugin] Overall coverage: class: 100, method: 100, line: 100, branch: 100, instruction: 100
[Pipeline] junit
[2020-02-13T21:58:06.705Z] Recording test results
[2020-02-13T21:58:06.994Z] None of the test reports contained any result
[Pipeline] cleanWs
[2020-02-13T21:58:07.061Z] Checking out Revision 1aebf22c7a634a4059d75e161365b9299638d665 (jenkins)
[2020-02-13T21:58:07.325Z] [WS-CLEANUP] Deleting project workspace...
[2020-02-13T21:58:07.327Z] [WS-CLEANUP] Deferred wipeout is used...
[2020-02-13T21:58:06.142Z]  > git config remote.origin.url https://gitbox.apache.org/repos/asf/maven-surefire.git # timeout=10
[2020-02-13T21:58:06.147Z]  > git config --add remote.origin.fetch +refs/heads/*:refs/remotes/origin/* # timeout=10
[2020-02-13T21:58:06.313Z]  > git config remote.origin.url https://gitbox.apache.org/repos/asf/maven-surefire.git # timeout=10
[2020-02-13T21:58:06.474Z] Fetching upstream changes from https://gitbox.apache.org/repos/asf/maven-surefire.git
[2020-02-13T21:58:06.474Z]  > git fetch --no-tags --progress -- https://gitbox.apache.org/repos/asf/maven-surefire.git +refs/heads/*:refs/remotes/origin/*
[2020-02-13T21:58:07.179Z]  > git config core.sparsecheckout # timeout=10
[2020-02-13T21:58:07.183Z]  > git checkout -f 1aebf22c7a634a4059d75e161365b9299638d665
[Pipeline] }
[Pipeline] // stage
[Pipeline] echo
[2020-02-13T21:58:07.580Z] Setting JDK for testing JDK 1.8 (latest)
[Pipeline] stage
[Pipeline] { (build windows-jdk8-maven3.1.x)
[Pipeline] isUnix
[Pipeline] tool
[2020-02-13T21:58:07.643Z] Commit message: "working with Maven 3.1.1"
[2020-02-13T21:58:07.643Z] Cleaning workspace
[2020-02-13T21:58:07.654Z] [WS-CLEANUP] done
[Pipeline] }
[Pipeline] tool
[Pipeline] // ws
[Pipeline] }
[Pipeline] tool
[2020-02-13T21:58:06.218Z] Resetting working tree
[2020-02-13T21:58:06.218Z]  > git reset --hard # timeout=10
[2020-02-13T21:58:07.257Z]  > git clean -fdx # timeout=10
[Pipeline] // timestamps
[Pipeline] }
[Pipeline] }
[Pipeline] }
[Pipeline] // node
[Pipeline] // stage
[Pipeline] // stage
[Pipeline] }
Failed in branch linux-jdk14-maven3.1.x
[Pipeline] cleanWs
[2020-02-13T21:58:07.761Z]  > git rev-parse --verify HEAD # timeout=10
[2020-02-13T21:58:07.766Z] Resetting working tree
[2020-02-13T21:58:07.766Z]  > git reset --hard # timeout=10
[2020-02-13T21:58:07.992Z]  > git clean -fdx # timeout=10
[2020-02-13T21:58:08.549Z] [WS-CLEANUP] Deleting project workspace...
[2020-02-13T21:58:08.549Z] [WS-CLEANUP] Deferred wipeout is used...
[Pipeline] echo
[2020-02-13T21:58:08.565Z] Setting JDK for testing JDK 1.7 (latest)
[Pipeline] stage
[2020-02-13T21:58:08.590Z] [WS-CLEANUP] done
[Pipeline] { (build linux-jdk7-maven3.1.x)
[Pipeline] isUnix
[Pipeline] tool
[Pipeline] }
[Pipeline] tool
[Pipeline] // ws
[Pipeline] }
[Pipeline] tool
[Pipeline] // timestamps
[Pipeline] }
[Pipeline] }
[Pipeline] // node
[Pipeline] }
Failed in branch windows-jdk8-maven3.1.x
[Pipeline] // stage
[Pipeline] cleanWs
[2020-02-13T21:58:09.299Z] [WS-CLEANUP] Deleting project workspace...
[2020-02-13T21:58:09.300Z] [WS-CLEANUP] Deferred wipeout is used...
[2020-02-13T21:58:09.618Z] [WS-CLEANUP] done
[Pipeline] }
[Pipeline] // ws
[Pipeline] }
[Pipeline] // timestamps
[Pipeline] }
[Pipeline] }
[Pipeline] // stage
[Pipeline] // node
[Pipeline] }
Failed in branch linux-jdk7-maven3.1.x
[Pipeline] echo
[2020-02-13T21:58:09.840Z] Setting JDK for testing JDK 13 (latest)
[Pipeline] stage
[Pipeline] { (build windows-jdk13-maven3.1.x)
[Pipeline] isUnix
[Pipeline] tool
[Pipeline] tool
[Pipeline] tool
[Pipeline] }
[Pipeline] // stage
[Pipeline] cleanWs
[2020-02-13T21:58:10.153Z] [WS-CLEANUP] Deleting project workspace...
[2020-02-13T21:58:10.153Z] [WS-CLEANUP] Deferred wipeout is used...
[2020-02-13T21:58:10.182Z] [WS-CLEANUP] done
[Pipeline] }
[Pipeline] // ws
[Pipeline] }
[Pipeline] // timestamps
[Pipeline] }
[Pipeline] // node
[Pipeline] }
Failed in branch windows-jdk13-maven3.1.x
[Pipeline] // parallel
[Pipeline] echo
hudson.AbortException: hudson.AbortException: No tool named Maven 3.1.1 found
[Pipeline] echo
Build result: FAILURE
[Pipeline] jiraIssueSelector
[Pipeline] echo
The authors of changes [tibordigana].
[Pipeline] echo
Sending email ...
[Pipeline] emailext
Reply | Threaded
Open this post in threaded view
|

Build failed in Jenkins: Maven TLP » maven-surefire » jenkins #9

Apache Jenkins Server-2
See https://builds.apache.org/job/maven-box/job/maven-surefire/job/jenkins/9/

Changes:

* only install, run-its for Maven 3.0 and 3.1

No tests ran.

Build log:
[...truncated 533 lines...]
[2020-02-13T22:03:08.346Z] [JaCoCo plugin] Saving matched source directories for source-pattern: **/maven-failsafe-plugin/src/main/java,**/maven-surefire-common/src/main/java,**/maven-surefire-plugin/src/main/java,**/maven-surefire-report-plugin/src/main/java,**/surefire-api/src/main/java,**/surefire-booter/src/main/java,**/surefire-extensions-api/src/main/java,**/surefire-grouper/src/main/java,**/surefire-its/src/main/java,**/surefire-logger-api/src/main/java,**/surefire-providers/**/src/main/java,**/surefire-report-parser/src/main/java:
[2020-02-13T22:03:08.346Z] [JaCoCo plugin] Source Inclusions: **/*.java
[2020-02-13T22:03:08.526Z] [JaCoCo plugin] Source Exclusions:
[Pipeline] }
[Pipeline] }
[Pipeline] // ws
[Pipeline] // ws
[2020-02-13T22:03:08.819Z] [JaCoCo plugin] - /home/jenkins/jenkins-slave/workspace/maven-box_maven-surefire_jenkins@2/maven-failsafe-plugin/src/main/java 3 files
[Pipeline] }
[Pipeline] }
[Pipeline] // timestamps
[Pipeline] // timestamps
[Pipeline] }
[Pipeline] }
[Pipeline] // node
[2020-02-13T22:03:08.991Z] [JaCoCo plugin] - /home/jenkins/jenkins-slave/workspace/maven-box_maven-surefire_jenkins@2/maven-surefire-common/src/main/java 87 files
[Pipeline] // node
[Pipeline] }
Failed in branch linux-jdk11-maven3.1.x
[Pipeline] }
Failed in branch linux-jdk8-maven3.1.x
[2020-02-13T22:03:09.168Z] [JaCoCo plugin] - /home/jenkins/jenkins-slave/workspace/maven-box_maven-surefire_jenkins@2/maven-surefire-plugin/src/main/java 1 files
[2020-02-13T22:03:09.409Z] [JaCoCo plugin] - /home/jenkins/jenkins-slave/workspace/maven-box_maven-surefire_jenkins@2/maven-surefire-report-plugin/src/main/java 7 files
[2020-02-13T22:03:09.441Z] + mkdir -p .m2
[2020-02-13T22:03:10.167Z] Checking out Revision 249eda0e614f9344dd88071954296a3be615811c (jenkins)
[2020-02-13T22:03:10.218Z] [JaCoCo plugin] - /home/jenkins/jenkins-slave/workspace/maven-box_maven-surefire_jenkins@2/surefire-api/src/main/java 83 files
[2020-02-13T22:03:10.277Z] Commit message: "only install, run-its for Maven 3.0 and 3.1"
[2020-02-13T22:03:10.277Z] Cleaning workspace
[Pipeline] pwd
[Pipeline] echo
[2020-02-13T22:03:10.328Z] Maven Local Repository = /home/jenkins/jenkins-slave/workspace/maven-box_maven-surefire_jenkins@2/.m2.
[Pipeline] stage
[Pipeline] { (checkout linux-jdk7-maven3.1.x)
[Pipeline] checkout
[2020-02-13T22:03:10.394Z] [JaCoCo plugin] - /home/jenkins/jenkins-slave/workspace/maven-box_maven-surefire_jenkins@2/surefire-booter/src/main/java 24 files
[2020-02-13T22:03:10.554Z] Commit message: "only install, run-its for Maven 3.0 and 3.1"
[2020-02-13T22:03:10.554Z] Cleaning workspace
[2020-02-13T22:03:10.558Z] [JaCoCo plugin] - /home/jenkins/jenkins-slave/workspace/maven-box_maven-surefire_jenkins@2/surefire-extensions-api/src/main/java 14 files
[2020-02-13T22:03:10.725Z] [JaCoCo plugin] - /home/jenkins/jenkins-slave/workspace/maven-box_maven-surefire_jenkins@2/surefire-grouper/src/main/java 6 files
[2020-02-13T22:03:10.799Z] Commit message: "only install, run-its for Maven 3.0 and 3.1"
[2020-02-13T22:03:10.799Z] Cleaning workspace
[2020-02-13T22:03:10.215Z]  > git config core.sparsecheckout # timeout=10
[2020-02-13T22:03:10.337Z]  > git checkout -f 249eda0e614f9344dd88071954296a3be615811c
[2020-02-13T22:03:10.897Z] [JaCoCo plugin] - /home/jenkins/jenkins-slave/workspace/maven-box_maven-surefire_jenkins@2/surefire-logger-api/src/main/java 6 files
[2020-02-13T22:03:10.803Z]  > git rev-parse --verify HEAD # timeout=10
[2020-02-13T22:03:10.557Z]  > git rev-parse --verify HEAD # timeout=10
[2020-02-13T22:03:10.279Z]  > git rev-parse --verify HEAD # timeout=10
[2020-02-13T22:03:10.405Z] Resetting working tree
[2020-02-13T22:03:10.405Z]  > git reset --hard # timeout=10
[2020-02-13T22:03:10.732Z]  > git clean -fdx # timeout=10
[2020-02-13T22:03:11.065Z] [JaCoCo plugin] - /home/jenkins/jenkins-slave/workspace/maven-box_maven-surefire_jenkins@2/surefire-providers/common-java5/src/main/java 5 files
[Pipeline] }
[Pipeline] // stage
[Pipeline] echo
[2020-02-13T22:03:11.229Z] Setting JDK for testing JDK 11 (latest)
[2020-02-13T22:03:11.231Z] No credentials specified
[Pipeline] stage
[2020-02-13T22:03:11.238Z] [JaCoCo plugin] - /home/jenkins/jenkins-slave/workspace/maven-box_maven-surefire_jenkins@2/surefire-providers/common-junit3/src/main/java 2 files
[Pipeline] { (build windows-jdk11-maven3.1.x)
[Pipeline] isUnix
[Pipeline] tool
[Pipeline] tool
[Pipeline] tool
[Pipeline] }
[2020-02-13T22:03:11.386Z] Cloning the remote Git repository
[2020-02-13T22:03:11.386Z] Cloning with configured refspecs honoured and without tags
[2020-02-13T22:03:11.409Z] [JaCoCo plugin] - /home/jenkins/jenkins-slave/workspace/maven-box_maven-surefire_jenkins@2/surefire-providers/common-junit4/src/main/java 10 files
[Pipeline] // stage
[Pipeline] cleanWs
[2020-02-13T22:03:11.463Z] [WS-CLEANUP] Deleting project workspace...
[2020-02-13T22:03:11.464Z] [WS-CLEANUP] Deferred wipeout is used...
[2020-02-13T22:03:11.645Z] [JaCoCo plugin] - /home/jenkins/jenkins-slave/workspace/maven-box_maven-surefire_jenkins@2/surefire-providers/common-junit48/src/main/java 10 files
[2020-02-13T22:03:11.503Z] Cloning repository https://gitbox.apache.org/repos/asf/maven-surefire.git
[2020-02-13T22:03:11.504Z]  > git init /home/jenkins/jenkins-slave/workspace/maven-box_maven-surefire_jenkins@2 # timeout=10
[2020-02-13T22:03:11.528Z] Fetching upstream changes from https://gitbox.apache.org/repos/asf/maven-surefire.git
[2020-02-13T22:03:11.528Z]  > git --version # timeout=10
[2020-02-13T22:03:11.533Z]  > git fetch --no-tags --progress -- https://gitbox.apache.org/repos/asf/maven-surefire.git +refs/heads/*:refs/remotes/origin/*
[2020-02-13T22:03:11.818Z] [JaCoCo plugin] - /home/jenkins/jenkins-slave/workspace/maven-box_maven-surefire_jenkins@2/surefire-providers/surefire-junit-platform/src/main/java 4 files
[Pipeline] }
[Pipeline] // stage
[2020-02-13T22:03:11.985Z] [JaCoCo plugin] - /home/jenkins/jenkins-slave/workspace/maven-box_maven-surefire_jenkins@2/surefire-providers/surefire-junit3/src/main/java 6 files
[Pipeline] echo
[2020-02-13T22:03:12.001Z] Setting JDK for testing JDK 1.7 (latest)
[Pipeline] stage
[Pipeline] { (build windows-jdk7-maven3.1.x)
[Pipeline] isUnix
[Pipeline] tool
[Pipeline] tool
[Pipeline] tool
[Pipeline] }
[Pipeline] // stage
[2020-02-13T22:03:12.220Z] [JaCoCo plugin] - /home/jenkins/jenkins-slave/workspace/maven-box_maven-surefire_jenkins@2/surefire-providers/surefire-junit4/src/main/java 2 files
[Pipeline] cleanWs
[2020-02-13T22:03:12.241Z] [WS-CLEANUP] Deleting project workspace...
[2020-02-13T22:03:12.241Z] [WS-CLEANUP] Deferred wipeout is used...
[2020-02-13T22:03:12.270Z] [WS-CLEANUP] done
[Pipeline] }
[Pipeline] // ws
[Pipeline] }
[Pipeline] // timestamps
[Pipeline] }
[2020-02-13T22:03:12.393Z] [JaCoCo plugin] - /home/jenkins/jenkins-slave/workspace/maven-box_maven-surefire_jenkins@2/surefire-providers/surefire-junit47/src/main/java 39 files
[Pipeline] // node
[Pipeline] }
Failed in branch windows-jdk7-maven3.1.x
[2020-02-13T22:03:11.296Z] Resetting working tree
[2020-02-13T22:03:11.297Z]  > git reset --hard # timeout=10
[2020-02-13T22:03:11.620Z]  > git clean -fdx # timeout=10
[2020-02-13T22:03:12.573Z] [JaCoCo plugin] - /home/jenkins/jenkins-slave/workspace/maven-box_maven-surefire_jenkins@2/surefire-providers/surefire-testng-utils/src/main/java 6 files
[2020-02-13T22:03:12.746Z] [JaCoCo plugin] - /home/jenkins/jenkins-slave/workspace/maven-box_maven-surefire_jenkins@2/surefire-providers/surefire-testng/src/main/java 17 files
[2020-02-13T22:03:12.746Z] [JaCoCo plugin] - /home/jenkins/jenkins-slave/workspace/maven-box_maven-surefire_jenkins@2/surefire-report-parser/src/main/java 4 files
[2020-02-13T22:03:12.746Z] [JaCoCo plugin] Loading inclusions files..
[2020-02-13T22:03:12.746Z] [JaCoCo plugin] inclusions: []
[2020-02-13T22:03:12.746Z] [JaCoCo plugin] exclusions: []
[2020-02-13T22:03:12.746Z] [JaCoCo plugin] Thresholds: JacocoHealthReportThresholds [minClass=0, maxClass=0, minMethod=0, maxMethod=0, minLine=0, maxLine=0, minBranch=0, maxBranch=0, minInstruction=0, maxInstruction=0, minComplexity=0, maxComplexity=0]
[2020-02-13T22:03:12.746Z] [JaCoCo plugin] Publishing the results..
[2020-02-13T22:03:12.746Z] [JaCoCo plugin] Loading packages..
[2020-02-13T22:03:12.746Z] [JaCoCo plugin] Done.
[2020-02-13T22:03:12.746Z] [JaCoCo plugin] Overall coverage: class: 100, method: 100, line: 100, branch: 100, instruction: 100
[Pipeline] junit
[2020-02-13T22:03:12.935Z] Recording test results
[2020-02-13T22:03:13.112Z] [WS-CLEANUP] done
[Pipeline] }
[Pipeline] // ws
[Pipeline] }
[Pipeline] // timestamps
[Pipeline] }
[2020-02-13T22:03:13.246Z] None of the test reports contained any result
[Pipeline] // node
[Pipeline] }
Failed in branch windows-jdk11-maven3.1.x
[Pipeline] cleanWs
[2020-02-13T22:03:13.623Z] [WS-CLEANUP] Deleting project workspace...
[2020-02-13T22:03:13.623Z] [WS-CLEANUP] Deferred wipeout is used...
[2020-02-13T22:03:13.956Z] [WS-CLEANUP] done
[Pipeline] }
[Pipeline] // ws
[Pipeline] }
[Pipeline] // timestamps
[Pipeline] }
[Pipeline] // node
[Pipeline] }
[2020-02-13T22:03:14.116Z] Fetching without tags
Failed in branch linux-jdk14-maven3.1.x
[2020-02-13T22:03:13.905Z]  > git config remote.origin.url https://gitbox.apache.org/repos/asf/maven-surefire.git # timeout=10
[2020-02-13T22:03:13.910Z]  > git config --add remote.origin.fetch +refs/heads/*:refs/remotes/origin/* # timeout=10
[2020-02-13T22:03:14.073Z]  > git config remote.origin.url https://gitbox.apache.org/repos/asf/maven-surefire.git # timeout=10
[2020-02-13T22:03:14.234Z] Fetching upstream changes from https://gitbox.apache.org/repos/asf/maven-surefire.git
[2020-02-13T22:03:14.234Z]  > git fetch --no-tags --progress -- https://gitbox.apache.org/repos/asf/maven-surefire.git +refs/heads/*:refs/remotes/origin/*
[2020-02-13T22:03:13.285Z] Resetting working tree
[2020-02-13T22:03:13.286Z]  > git reset --hard # timeout=10
[2020-02-13T22:03:14.823Z] Checking out Revision 249eda0e614f9344dd88071954296a3be615811c (jenkins)
[2020-02-13T22:03:14.941Z]  > git config core.sparsecheckout # timeout=10
[2020-02-13T22:03:14.946Z]  > git checkout -f 249eda0e614f9344dd88071954296a3be615811c
[2020-02-13T22:03:15.392Z] Commit message: "only install, run-its for Maven 3.0 and 3.1"
[2020-02-13T22:03:15.392Z] Cleaning workspace
[2020-02-13T22:03:15.605Z] Commit message: "only install, run-its for Maven 3.0 and 3.1"
[2020-02-13T22:03:15.605Z] Cleaning workspace
[2020-02-13T22:03:15.607Z]  > git rev-parse --verify HEAD # timeout=10
[Pipeline] }
[Pipeline] // stage
[Pipeline] echo
[2020-02-13T22:03:15.848Z] Setting JDK for testing JDK 1.7 (latest)
[Pipeline] stage
[Pipeline] { (build linux-jdk7-maven3.1.x)
[Pipeline] isUnix
[Pipeline] tool
[Pipeline] tool
[Pipeline] tool
[Pipeline] }
[Pipeline] // stage
[Pipeline] cleanWs
[2020-02-13T22:03:15.510Z]  > git rev-parse --verify HEAD # timeout=10
[2020-02-13T22:03:15.515Z] Resetting working tree
[2020-02-13T22:03:15.515Z]  > git reset --hard # timeout=10
[2020-02-13T22:03:15.695Z]  > git clean -fdx # timeout=10
[2020-02-13T22:03:16.380Z] [WS-CLEANUP] Deleting project workspace...
[2020-02-13T22:03:16.380Z] [WS-CLEANUP] Deferred wipeout is used...
[2020-02-13T22:03:16.705Z] [WS-CLEANUP] done
[Pipeline] }
[Pipeline] // ws
[Pipeline] }
[Pipeline] // timestamps
[Pipeline] }
[Pipeline] // node
[Pipeline] }
Failed in branch linux-jdk7-maven3.1.x
[Pipeline] }
[Pipeline] // stage
[Pipeline] echo
[2020-02-13T22:03:17.356Z] Setting JDK for testing JDK 1.8 (latest)
[Pipeline] stage
[Pipeline] { (build windows-jdk8-maven3.1.x)
[Pipeline] isUnix
[Pipeline] tool
[Pipeline] tool
[Pipeline] tool
[Pipeline] }
[2020-02-13T22:03:16.110Z] Resetting working tree
[2020-02-13T22:03:16.110Z]  > git reset --hard # timeout=10
[2020-02-13T22:03:16.875Z]  > git clean -fdx # timeout=10
[Pipeline] // stage
[Pipeline] cleanWs
[2020-02-13T22:03:17.591Z] [WS-CLEANUP] Deleting project workspace...
[2020-02-13T22:03:17.591Z] [WS-CLEANUP] Deferred wipeout is used...
[2020-02-13T22:03:17.620Z] [WS-CLEANUP] done
[Pipeline] }
[Pipeline] // ws
[Pipeline] }
[Pipeline] // timestamps
[Pipeline] }
[Pipeline] // node
[Pipeline] }
Failed in branch windows-jdk8-maven3.1.x
[Pipeline] }
[Pipeline] // stage
[Pipeline] echo
[2020-02-13T22:03:18.997Z] Setting JDK for testing JDK 13 (latest)
[Pipeline] stage
[Pipeline] { (build windows-jdk13-maven3.1.x)
[Pipeline] isUnix
[Pipeline] tool
[Pipeline] tool
[Pipeline] tool
[Pipeline] }
[Pipeline] // stage
[Pipeline] cleanWs
[2020-02-13T22:03:19.233Z] [WS-CLEANUP] Deleting project workspace...
[2020-02-13T22:03:19.233Z] [WS-CLEANUP] Deferred wipeout is used...
[2020-02-13T22:03:19.260Z] [WS-CLEANUP] done
[Pipeline] }
[Pipeline] // ws
[Pipeline] }
[Pipeline] // timestamps
[Pipeline] }
[Pipeline] // node
[Pipeline] }
Failed in branch windows-jdk13-maven3.1.x
[Pipeline] // parallel
[Pipeline] echo
hudson.AbortException: hudson.AbortException: No tool named Maven 3.1.1 (Windows) found
[Pipeline] echo
Build result: FAILURE
[Pipeline] jiraIssueSelector
[Pipeline] echo
The authors of changes [tibordigana].
[Pipeline] echo
Sending email ...
[Pipeline] emailext
Reply | Threaded
Open this post in threaded view
|

Build failed in Jenkins: Maven TLP » maven-surefire » jenkins #10

Apache Jenkins Server-2
See https://builds.apache.org/job/maven-box/job/maven-surefire/job/jenkins/10/

Changes:

* add Maven 3.0.x

No tests ran.

Build log:
[...truncated 1530 lines...]
[2020-02-13T22:07:41.175Z]  > git reset --hard # timeout=10
[2020-02-13T22:07:42.135Z] + /home/jenkins/tools/java/latest1.7/bin/java -version
[2020-02-13T22:07:42.135Z] java version "1.7.0_80"
[2020-02-13T22:07:42.135Z] Java(TM) SE Runtime Environment (build 1.7.0_80-b15)
[2020-02-13T22:07:42.135Z] Java HotSpot(TM) 64-Bit Server VM (build 24.80-b11, mixed mode)
[2020-02-13T22:07:41.471Z]  > git clean -fdx # timeout=10
[Pipeline] sh
[2020-02-13T22:07:44.115Z] + echo JAVA_HOME=/home/jenkins/tools/java/latest1.8, JAVA_HOME_IT=/home/jenkins/tools/java/latest1.7, PATH=/home/jenkins/tools/maven/apache-maven-3.0.5/bin:/home/jenkins/tools/java/latest1.8/bin:/usr/local/sbin:/usr/local/bin:/usr/sbin:/usr/bin:/sbin:/bin:/snap/bin
[2020-02-13T22:07:44.115Z] JAVA_HOME=/home/jenkins/tools/java/latest1.8, JAVA_HOME_IT=/home/jenkins/tools/java/latest1.7, PATH=/home/jenkins/tools/maven/apache-maven-3.0.5/bin:/home/jenkins/tools/java/latest1.8/bin:/usr/local/sbin:/usr/local/bin:/usr/sbin:/usr/bin:/sbin:/bin:/snap/bin
[Pipeline] sh
[2020-02-13T22:07:46.094Z] + mvn clean install -e -V -B -nsu -P run-its -Djava.awt.headless=true -Dfailsafe-integration-test-port=8040 -Dfailsafe-integration-test-stop-port=8041 -Dhttps.protocols=TLSv1.2 -Djacoco.skip=true -Dmaven.repo.local=/home/jenkins/jenkins-slave/workspace/maven-box_maven-surefire_jenkins@2/.m2 -Djdk.home=/home/jenkins/tools/java/latest1.7
[2020-02-13T22:07:46.094Z] Apache Maven 3.0.5 (r01de14724cdef164cd33c7c8c2fe155faf9602da; 2013-02-19 13:51:28+0000)
[2020-02-13T22:07:46.094Z] Maven home: /home/jenkins/tools/maven/apache-maven-3.0.5
[2020-02-13T22:07:46.094Z] Java version: 1.8.0_191, vendor: Oracle Corporation
[2020-02-13T22:07:46.094Z] Java home: /usr/local/asfpackages/java/jdk1.8.0_191/jre
[2020-02-13T22:07:46.094Z] Default locale: en_US, platform encoding: ISO-8859-1
[2020-02-13T22:07:46.094Z] OS name: "linux", version: "4.15.0-58-generic", arch: "amd64", family: "unix"
[2020-02-13T22:07:46.807Z] [INFO] Error stacktraces are turned on.
[2020-02-13T22:07:46.807Z] [INFO] Scanning for projects...
[2020-02-13T22:07:47.522Z] Downloading: http://repo.maven.apache.org/maven2/org/apache/maven/maven-parent/33/maven-parent-33.pom
[2020-02-13T22:07:47.522Z] [ERROR] The build could not read 1 project -> [Help 1]
[2020-02-13T22:07:47.522Z] org.apache.maven.project.ProjectBuildingException: Some problems were encountered while processing the POMs:
[2020-02-13T22:07:47.522Z] [FATAL] Non-resolvable parent POM: Could not transfer artifact org.apache.maven:maven-parent:pom:33 from/to central (http://repo.maven.apache.org/maven2): Failed to transfer file: http://repo.maven.apache.org/maven2/org/apache/maven/maven-parent/33/maven-parent-33.pom. Return code is: 501 , ReasonPhrase:HTTPS Required. and 'parent.relativePath' points at wrong local POM @ line 23, column 11
[2020-02-13T22:07:47.522Z]
[2020-02-13T22:07:47.522Z] at org.apache.maven.project.DefaultProjectBuilder.build(DefaultProjectBuilder.java:363)
[2020-02-13T22:07:47.522Z] at org.apache.maven.DefaultMaven.collectProjects(DefaultMaven.java:636)
[2020-02-13T22:07:47.522Z] at org.apache.maven.DefaultMaven.getProjectsForMavenReactor(DefaultMaven.java:585)
[2020-02-13T22:07:47.522Z] at org.apache.maven.DefaultMaven.doExecute(DefaultMaven.java:234)
[2020-02-13T22:07:47.522Z] at org.apache.maven.DefaultMaven.execute(DefaultMaven.java:156)
[2020-02-13T22:07:47.522Z] at org.apache.maven.cli.MavenCli.execute(MavenCli.java:537)
[2020-02-13T22:07:47.522Z] at org.apache.maven.cli.MavenCli.doMain(MavenCli.java:196)
[2020-02-13T22:07:47.522Z] at org.apache.maven.cli.MavenCli.main(MavenCli.java:141)
[2020-02-13T22:07:47.522Z] at sun.reflect.NativeMethodAccessorImpl.invoke0(Native Method)
[2020-02-13T22:07:47.522Z] at sun.reflect.NativeMethodAccessorImpl.invoke(NativeMethodAccessorImpl.java:62)
[2020-02-13T22:07:47.522Z] at sun.reflect.DelegatingMethodAccessorImpl.invoke(DelegatingMethodAccessorImpl.java:43)
[2020-02-13T22:07:47.522Z] at java.lang.reflect.Method.invoke(Method.java:498)
[2020-02-13T22:07:47.522Z] at org.codehaus.plexus.classworlds.launcher.Launcher.launchEnhanced(Launcher.java:290)
[2020-02-13T22:07:47.522Z] at org.codehaus.plexus.classworlds.launcher.Launcher.launch(Launcher.java:230)
[2020-02-13T22:07:47.522Z] at org.codehaus.plexus.classworlds.launcher.Launcher.mainWithExitCode(Launcher.java:409)
[2020-02-13T22:07:47.522Z] at org.codehaus.plexus.classworlds.launcher.Launcher.main(Launcher.java:352)
[2020-02-13T22:07:47.522Z] [ERROR]  
[2020-02-13T22:07:47.522Z] [ERROR]   The project org.apache.maven.surefire:surefire:3.0.0-SNAPSHOT (/home/jenkins/jenkins-slave/workspace/maven-box_maven-surefire_jenkins@2/pom.xml) has 1 error
[2020-02-13T22:07:47.522Z] [ERROR]     Non-resolvable parent POM: Could not transfer artifact org.apache.maven:maven-parent:pom:33 from/to central (http://repo.maven.apache.org/maven2): Failed to transfer file: http://repo.maven.apache.org/maven2/org/apache/maven/maven-parent/33/maven-parent-33.pom. Return code is: 501 , ReasonPhrase:HTTPS Required. and 'parent.relativePath' points at wrong local POM @ line 23, column 11 -> [Help 2]
[2020-02-13T22:07:47.522Z] org.apache.maven.model.resolution.UnresolvableModelException: Could not transfer artifact org.apache.maven:maven-parent:pom:33 from/to central (http://repo.maven.apache.org/maven2): Failed to transfer file: http://repo.maven.apache.org/maven2/org/apache/maven/maven-parent/33/maven-parent-33.pom. Return code is: 501 , ReasonPhrase:HTTPS Required.
[2020-02-13T22:07:47.522Z] at org.apache.maven.project.ProjectModelResolver.resolveModel(ProjectModelResolver.java:159)
[2020-02-13T22:07:47.522Z] at org.apache.maven.model.building.DefaultModelBuilder.readParentExternally(DefaultModelBuilder.java:813)
[2020-02-13T22:07:47.522Z] at org.apache.maven.model.building.DefaultModelBuilder.readParent(DefaultModelBuilder.java:664)
[2020-02-13T22:07:47.522Z] at org.apache.maven.model.building.DefaultModelBuilder.build(DefaultModelBuilder.java:310)
[2020-02-13T22:07:47.522Z] at org.apache.maven.model.building.DefaultModelBuilder.build(DefaultModelBuilder.java:232)
[2020-02-13T22:07:47.522Z] at org.apache.maven.project.DefaultProjectBuilder.build(DefaultProjectBuilder.java:410)
[2020-02-13T22:07:47.522Z] at org.apache.maven.project.DefaultProjectBuilder.build(DefaultProjectBuilder.java:379)
[2020-02-13T22:07:47.522Z] at org.apache.maven.project.DefaultProjectBuilder.build(DefaultProjectBuilder.java:343)
[2020-02-13T22:07:47.522Z] at org.apache.maven.DefaultMaven.collectProjects(DefaultMaven.java:636)
[2020-02-13T22:07:47.522Z] at org.apache.maven.DefaultMaven.getProjectsForMavenReactor(DefaultMaven.java:585)
[2020-02-13T22:07:47.522Z] at org.apache.maven.DefaultMaven.doExecute(DefaultMaven.java:234)
[2020-02-13T22:07:47.522Z] at org.apache.maven.DefaultMaven.execute(DefaultMaven.java:156)
[2020-02-13T22:07:47.522Z] at org.apache.maven.cli.MavenCli.execute(MavenCli.java:537)
[2020-02-13T22:07:47.522Z] at org.apache.maven.cli.MavenCli.doMain(MavenCli.java:196)
[2020-02-13T22:07:47.522Z] at org.apache.maven.cli.MavenCli.main(MavenCli.java:141)
[2020-02-13T22:07:47.522Z] at sun.reflect.NativeMethodAccessorImpl.invoke0(Native Method)
[2020-02-13T22:07:47.522Z] at sun.reflect.NativeMethodAccessorImpl.invoke(NativeMethodAccessorImpl.java:62)
[2020-02-13T22:07:47.522Z] at sun.reflect.DelegatingMethodAccessorImpl.invoke(DelegatingMethodAccessorImpl.java:43)
[2020-02-13T22:07:47.522Z] at java.lang.reflect.Method.invoke(Method.java:498)
[2020-02-13T22:07:47.522Z] at org.codehaus.plexus.classworlds.launcher.Launcher.launchEnhanced(Launcher.java:290)
[2020-02-13T22:07:47.522Z] at org.codehaus.plexus.classworlds.launcher.Launcher.launch(Launcher.java:230)
[2020-02-13T22:07:47.522Z] at org.codehaus.plexus.classworlds.launcher.Launcher.mainWithExitCode(Launcher.java:409)
[2020-02-13T22:07:47.522Z] at org.codehaus.plexus.classworlds.launcher.Launcher.main(Launcher.java:352)
[2020-02-13T22:07:47.523Z] Caused by: org.sonatype.aether.resolution.ArtifactResolutionException: Could not transfer artifact org.apache.maven:maven-parent:pom:33 from/to central (http://repo.maven.apache.org/maven2): Failed to transfer file: http://repo.maven.apache.org/maven2/org/apache/maven/maven-parent/33/maven-parent-33.pom. Return code is: 501 , ReasonPhrase:HTTPS Required.
[2020-02-13T22:07:47.523Z] at org.sonatype.aether.impl.internal.DefaultArtifactResolver.resolve(DefaultArtifactResolver.java:538)
[2020-02-13T22:07:47.523Z] at org.sonatype.aether.impl.internal.DefaultArtifactResolver.resolveArtifacts(DefaultArtifactResolver.java:216)
[2020-02-13T22:07:47.523Z] at org.sonatype.aether.impl.internal.DefaultArtifactResolver.resolveArtifact(DefaultArtifactResolver.java:193)
[2020-02-13T22:07:47.523Z] at org.sonatype.aether.impl.internal.DefaultRepositorySystem.resolveArtifact(DefaultRepositorySystem.java:286)
[2020-02-13T22:07:47.523Z] at org.apache.maven.project.ProjectModelResolver.resolveModel(ProjectModelResolver.java:155)
[2020-02-13T22:07:47.523Z] ... 22 more
[2020-02-13T22:07:47.523Z] Caused by: org.sonatype.aether.transfer.ArtifactTransferException: Could not transfer artifact org.apache.maven:maven-parent:pom:33 from/to central (http://repo.maven.apache.org/maven2): Failed to transfer file: http://repo.maven.apache.org/maven2/org/apache/maven/maven-parent/33/maven-parent-33.pom. Return code is: 501 , ReasonPhrase:HTTPS Required.
[2020-02-13T22:07:47.523Z] at org.sonatype.aether.connector.wagon.WagonRepositoryConnector$4.wrap(WagonRepositoryConnector.java:951)
[2020-02-13T22:07:47.523Z] at org.sonatype.aether.connector.wagon.WagonRepositoryConnector$4.wrap(WagonRepositoryConnector.java:941)
[2020-02-13T22:07:47.523Z] at org.sonatype.aether.connector.wagon.WagonRepositoryConnector$GetTask.run(WagonRepositoryConnector.java:669)
[2020-02-13T22:07:47.523Z] at org.sonatype.aether.util.concurrency.RunnableErrorForwarder$1.run(RunnableErrorForwarder.java:60)
[2020-02-13T22:07:47.523Z] at java.util.concurrent.ThreadPoolExecutor.runWorker(ThreadPoolExecutor.java:1149)
[2020-02-13T22:07:47.523Z] at java.util.concurrent.ThreadPoolExecutor$Worker.run(ThreadPoolExecutor.java:624)
[2020-02-13T22:07:47.523Z] at java.lang.Thread.run(Thread.java:748)
[2020-02-13T22:07:47.523Z] Caused by: org.apache.maven.wagon.TransferFailedException: Failed to transfer file: http://repo.maven.apache.org/maven2/org/apache/maven/maven-parent/33/maven-parent-33.pom. Return code is: 501 , ReasonPhrase:HTTPS Required.
[2020-02-13T22:07:47.523Z] at org.apache.maven.wagon.shared.http4.AbstractHttpClientWagon.fillInputData(AbstractHttpClientWagon.java:945)
[2020-02-13T22:07:47.523Z] at org.apache.maven.wagon.StreamWagon.getInputStream(StreamWagon.java:116)
[2020-02-13T22:07:47.523Z] at org.apache.maven.wagon.StreamWagon.getIfNewer(StreamWagon.java:88)
[2020-02-13T22:07:47.523Z] at org.apache.maven.wagon.StreamWagon.get(StreamWagon.java:61)
[2020-02-13T22:07:47.523Z] at org.sonatype.aether.connector.wagon.WagonRepositoryConnector$GetTask.run(WagonRepositoryConnector.java:601)
[2020-02-13T22:07:47.523Z] ... 4 more
[2020-02-13T22:07:47.523Z] [ERROR]
[2020-02-13T22:07:47.523Z] [ERROR] Re-run Maven using the -X switch to enable full debug logging.
[2020-02-13T22:07:47.523Z] [ERROR]
[2020-02-13T22:07:47.523Z] [ERROR] For more information about the errors and possible solutions, please read the following articles:
[2020-02-13T22:07:47.523Z] [ERROR] [Help 1] http://cwiki.apache.org/confluence/display/MAVEN/ProjectBuildingException
[2020-02-13T22:07:47.523Z] [ERROR] [Help 2] http://cwiki.apache.org/confluence/display/MAVEN/UnresolvableModelException
[Pipeline] }
[Pipeline] // withEnv
[Pipeline] }
[Pipeline] // stage
[Pipeline] fileExists
[Pipeline] fileExists
[Pipeline] archiveArtifacts
[2020-02-13T22:07:48.433Z] Archiving artifacts
[Pipeline] cleanWs
[2020-02-13T22:07:48.922Z] [WS-CLEANUP] Deleting project workspace...
[2020-02-13T22:07:48.922Z] [WS-CLEANUP] Deferred wipeout is used...
[Pipeline] }
[Pipeline] // stage
[Pipeline] echo
[2020-02-13T22:07:49.156Z] Setting JDK for testing JDK 1.8 (latest)
[Pipeline] stage
[Pipeline] { (build linux-jdk8-maven3.0.x)
[Pipeline] isUnix
[Pipeline] tool
[2020-02-13T22:07:49.238Z] [WS-CLEANUP] done
[Pipeline] }
[Pipeline] tool
[Pipeline] // ws
[Pipeline] }
[Pipeline] tool
[Pipeline] // timestamps
[Pipeline] }
[Pipeline] tool
[Pipeline] // node
[Pipeline] }
[Pipeline] withEnv
[Pipeline] {
[Pipeline] sh
[2020-02-13T22:07:51.104Z] + /home/jenkins/tools/java/latest1.8/bin/java -version
[2020-02-13T22:07:51.104Z] java version "1.8.0_191"
[2020-02-13T22:07:51.104Z] Java(TM) SE Runtime Environment (build 1.8.0_191-b12)
[2020-02-13T22:07:51.104Z] Java HotSpot(TM) 64-Bit Server VM (build 25.191-b12, mixed mode)
[Pipeline] sh
[2020-02-13T22:07:53.077Z] + echo JAVA_HOME=/home/jenkins/tools/java/latest1.8, JAVA_HOME_IT=/home/jenkins/tools/java/latest1.8, PATH=/home/jenkins/tools/maven/apache-maven-3.0.5/bin:/home/jenkins/tools/java/latest1.8/bin:/usr/local/sbin:/usr/local/bin:/usr/sbin:/usr/bin:/sbin:/bin:/snap/bin
[2020-02-13T22:07:53.077Z] JAVA_HOME=/home/jenkins/tools/java/latest1.8, JAVA_HOME_IT=/home/jenkins/tools/java/latest1.8, PATH=/home/jenkins/tools/maven/apache-maven-3.0.5/bin:/home/jenkins/tools/java/latest1.8/bin:/usr/local/sbin:/usr/local/bin:/usr/sbin:/usr/bin:/sbin:/bin:/snap/bin
[Pipeline] sh
[2020-02-13T22:07:55.141Z] + mvn clean install -e -V -B -nsu -P run-its -Djava.awt.headless=true -Dfailsafe-integration-test-port=8030 -Dfailsafe-integration-test-stop-port=8031 -Djacoco.skip=true -Dmaven.repo.local=/home/jenkins/jenkins-slave/workspace/maven-box_maven-surefire_jenkins@2/.m2 -Djdk.home=/home/jenkins/tools/java/latest1.8
[2020-02-13T22:07:55.142Z] Apache Maven 3.0.5 (r01de14724cdef164cd33c7c8c2fe155faf9602da; 2013-02-19 13:51:28+0000)
[2020-02-13T22:07:55.142Z] Maven home: /home/jenkins/tools/maven/apache-maven-3.0.5
[2020-02-13T22:07:55.142Z] Java version: 1.8.0_191, vendor: Oracle Corporation
[2020-02-13T22:07:55.142Z] Java home: /usr/local/asfpackages/java/jdk1.8.0_191/jre
[2020-02-13T22:07:55.142Z] Default locale: en_US, platform encoding: ISO-8859-1
[2020-02-13T22:07:55.142Z] OS name: "linux", version: "4.15.0-76-generic", arch: "amd64", family: "unix"
[2020-02-13T22:07:55.873Z] [INFO] Error stacktraces are turned on.
[2020-02-13T22:07:55.873Z] [INFO] Scanning for projects...
[2020-02-13T22:07:55.873Z] Downloading: http://repo.maven.apache.org/maven2/org/apache/maven/maven-parent/33/maven-parent-33.pom
[2020-02-13T22:07:56.184Z] [ERROR] The build could not read 1 project -> [Help 1]
[2020-02-13T22:07:56.184Z] org.apache.maven.project.ProjectBuildingException: Some problems were encountered while processing the POMs:
[2020-02-13T22:07:56.184Z] [FATAL] Non-resolvable parent POM: Could not transfer artifact org.apache.maven:maven-parent:pom:33 from/to central (http://repo.maven.apache.org/maven2): Failed to transfer file: http://repo.maven.apache.org/maven2/org/apache/maven/maven-parent/33/maven-parent-33.pom. Return code is: 501 , ReasonPhrase:HTTPS Required. and 'parent.relativePath' points at wrong local POM @ line 23, column 11
[2020-02-13T22:07:56.184Z]
[2020-02-13T22:07:56.184Z] at org.apache.maven.project.DefaultProjectBuilder.build(DefaultProjectBuilder.java:363)
[2020-02-13T22:07:56.184Z] at org.apache.maven.DefaultMaven.collectProjects(DefaultMaven.java:636)
[2020-02-13T22:07:56.184Z] at org.apache.maven.DefaultMaven.getProjectsForMavenReactor(DefaultMaven.java:585)
[2020-02-13T22:07:56.184Z] at org.apache.maven.DefaultMaven.doExecute(DefaultMaven.java:234)
[2020-02-13T22:07:56.184Z] at org.apache.maven.DefaultMaven.execute(DefaultMaven.java:156)
[2020-02-13T22:07:56.184Z] at org.apache.maven.cli.MavenCli.execute(MavenCli.java:537)
[2020-02-13T22:07:56.184Z] at org.apache.maven.cli.MavenCli.doMain(MavenCli.java:196)
[2020-02-13T22:07:56.184Z] at org.apache.maven.cli.MavenCli.main(MavenCli.java:141)
[2020-02-13T22:07:56.184Z] at sun.reflect.NativeMethodAccessorImpl.invoke0(Native Method)
[2020-02-13T22:07:56.184Z] at sun.reflect.NativeMethodAccessorImpl.invoke(NativeMethodAccessorImpl.java:62)
[2020-02-13T22:07:56.184Z] at sun.reflect.DelegatingMethodAccessorImpl.invoke(DelegatingMethodAccessorImpl.java:43)
[2020-02-13T22:07:56.184Z] at java.lang.reflect.Method.invoke(Method.java:498)
[2020-02-13T22:07:56.184Z] at org.codehaus.plexus.classworlds.launcher.Launcher.launchEnhanced(Launcher.java:290)
[2020-02-13T22:07:56.184Z] at org.codehaus.plexus.classworlds.launcher.Launcher.launch(Launcher.java:230)
[2020-02-13T22:07:56.184Z] at org.codehaus.plexus.classworlds.launcher.Launcher.mainWithExitCode(Launcher.java:409)
[2020-02-13T22:07:56.184Z] at org.codehaus.plexus.classworlds.launcher.Launcher.main(Launcher.java:352)
[2020-02-13T22:07:56.184Z] [ERROR]  
[2020-02-13T22:07:56.184Z] [ERROR]   The project org.apache.maven.surefire:surefire:3.0.0-SNAPSHOT (/home/jenkins/jenkins-slave/workspace/maven-box_maven-surefire_jenkins@2/pom.xml) has 1 error
[2020-02-13T22:07:56.184Z] [ERROR]     Non-resolvable parent POM: Could not transfer artifact org.apache.maven:maven-parent:pom:33 from/to central (http://repo.maven.apache.org/maven2): Failed to transfer file: http://repo.maven.apache.org/maven2/org/apache/maven/maven-parent/33/maven-parent-33.pom. Return code is: 501 , ReasonPhrase:HTTPS Required. and 'parent.relativePath' points at wrong local POM @ line 23, column 11 -> [Help 2]
[2020-02-13T22:07:56.184Z] org.apache.maven.model.resolution.UnresolvableModelException: Could not transfer artifact org.apache.maven:maven-parent:pom:33 from/to central (http://repo.maven.apache.org/maven2): Failed to transfer file: http://repo.maven.apache.org/maven2/org/apache/maven/maven-parent/33/maven-parent-33.pom. Return code is: 501 , ReasonPhrase:HTTPS Required.
[2020-02-13T22:07:56.184Z] at org.apache.maven.project.ProjectModelResolver.resolveModel(ProjectModelResolver.java:159)
[2020-02-13T22:07:56.184Z] at org.apache.maven.model.building.DefaultModelBuilder.readParentExternally(DefaultModelBuilder.java:813)
[2020-02-13T22:07:56.184Z] at org.apache.maven.model.building.DefaultModelBuilder.readParent(DefaultModelBuilder.java:664)
[2020-02-13T22:07:56.184Z] at org.apache.maven.model.building.DefaultModelBuilder.build(DefaultModelBuilder.java:310)
[2020-02-13T22:07:56.184Z] at org.apache.maven.model.building.DefaultModelBuilder.build(DefaultModelBuilder.java:232)
[2020-02-13T22:07:56.184Z] at org.apache.maven.project.DefaultProjectBuilder.build(DefaultProjectBuilder.java:410)
[2020-02-13T22:07:56.184Z] at org.apache.maven.project.DefaultProjectBuilder.build(DefaultProjectBuilder.java:379)
[2020-02-13T22:07:56.184Z] at org.apache.maven.project.DefaultProjectBuilder.build(DefaultProjectBuilder.java:343)
[2020-02-13T22:07:56.184Z] at org.apache.maven.DefaultMaven.collectProjects(DefaultMaven.java:636)
[2020-02-13T22:07:56.184Z] at org.apache.maven.DefaultMaven.getProjectsForMavenReactor(DefaultMaven.java:585)
[2020-02-13T22:07:56.184Z] at org.apache.maven.DefaultMaven.doExecute(DefaultMaven.java:234)
[2020-02-13T22:07:56.184Z] at org.apache.maven.DefaultMaven.execute(DefaultMaven.java:156)
[2020-02-13T22:07:56.184Z] at org.apache.maven.cli.MavenCli.execute(MavenCli.java:537)
[2020-02-13T22:07:56.184Z] at org.apache.maven.cli.MavenCli.doMain(MavenCli.java:196)
[2020-02-13T22:07:56.184Z] at org.apache.maven.cli.MavenCli.main(MavenCli.java:141)
[2020-02-13T22:07:56.184Z] at sun.reflect.NativeMethodAccessorImpl.invoke0(Native Method)
[2020-02-13T22:07:56.184Z] at sun.reflect.NativeMethodAccessorImpl.invoke(NativeMethodAccessorImpl.java:62)
[2020-02-13T22:07:56.184Z] at sun.reflect.DelegatingMethodAccessorImpl.invoke(DelegatingMethodAccessorImpl.java:43)
[2020-02-13T22:07:56.184Z] at java.lang.reflect.Method.invoke(Method.java:498)
[2020-02-13T22:07:56.184Z] at org.codehaus.plexus.classworlds.launcher.Launcher.launchEnhanced(Launcher.java:290)
[2020-02-13T22:07:56.184Z] at org.codehaus.plexus.classworlds.launcher.Launcher.launch(Launcher.java:230)
[2020-02-13T22:07:56.184Z] at org.codehaus.plexus.classworlds.launcher.Launcher.mainWithExitCode(Launcher.java:409)
[2020-02-13T22:07:56.185Z] at org.codehaus.plexus.classworlds.launcher.Launcher.main(Launcher.java:352)
[2020-02-13T22:07:56.185Z] Caused by: org.sonatype.aether.resolution.ArtifactResolutionException: Could not transfer artifact org.apache.maven:maven-parent:pom:33 from/to central (http://repo.maven.apache.org/maven2): Failed to transfer file: http://repo.maven.apache.org/maven2/org/apache/maven/maven-parent/33/maven-parent-33.pom. Return code is: 501 , ReasonPhrase:HTTPS Required.
[2020-02-13T22:07:56.185Z] at org.sonatype.aether.impl.internal.DefaultArtifactResolver.resolve(DefaultArtifactResolver.java:538)
[2020-02-13T22:07:56.185Z] at org.sonatype.aether.impl.internal.DefaultArtifactResolver.resolveArtifacts(DefaultArtifactResolver.java:216)
[2020-02-13T22:07:56.185Z] at org.sonatype.aether.impl.internal.DefaultArtifactResolver.resolveArtifact(DefaultArtifactResolver.java:193)
[2020-02-13T22:07:56.185Z] at org.sonatype.aether.impl.internal.DefaultRepositorySystem.resolveArtifact(DefaultRepositorySystem.java:286)
[2020-02-13T22:07:56.185Z] at org.apache.maven.project.ProjectModelResolver.resolveModel(ProjectModelResolver.java:155)
[2020-02-13T22:07:56.185Z] ... 22 more
[2020-02-13T22:07:56.185Z] Caused by: org.sonatype.aether.transfer.ArtifactTransferException: Could not transfer artifact org.apache.maven:maven-parent:pom:33 from/to central (http://repo.maven.apache.org/maven2): Failed to transfer file: http://repo.maven.apache.org/maven2/org/apache/maven/maven-parent/33/maven-parent-33.pom. Return code is: 501 , ReasonPhrase:HTTPS Required.
[2020-02-13T22:07:56.185Z] at org.sonatype.aether.connector.wagon.WagonRepositoryConnector$4.wrap(WagonRepositoryConnector.java:951)
[2020-02-13T22:07:56.185Z] at org.sonatype.aether.connector.wagon.WagonRepositoryConnector$4.wrap(WagonRepositoryConnector.java:941)
[2020-02-13T22:07:56.185Z] at org.sonatype.aether.connector.wagon.WagonRepositoryConnector$GetTask.run(WagonRepositoryConnector.java:669)
[2020-02-13T22:07:56.185Z] at org.sonatype.aether.util.concurrency.RunnableErrorForwarder$1.run(RunnableErrorForwarder.java:60)
[2020-02-13T22:07:56.185Z] at java.util.concurrent.ThreadPoolExecutor.runWorker(ThreadPoolExecutor.java:1149)
[2020-02-13T22:07:56.185Z] at java.util.concurrent.ThreadPoolExecutor$Worker.run(ThreadPoolExecutor.java:624)
[2020-02-13T22:07:56.185Z] at java.lang.Thread.run(Thread.java:748)
[2020-02-13T22:07:56.185Z] Caused by: org.apache.maven.wagon.TransferFailedException: Failed to transfer file: http://repo.maven.apache.org/maven2/org/apache/maven/maven-parent/33/maven-parent-33.pom. Return code is: 501 , ReasonPhrase:HTTPS Required.
[2020-02-13T22:07:56.185Z] at org.apache.maven.wagon.shared.http4.AbstractHttpClientWagon.fillInputData(AbstractHttpClientWagon.java:945)
[2020-02-13T22:07:56.185Z] at org.apache.maven.wagon.StreamWagon.getInputStream(StreamWagon.java:116)
[2020-02-13T22:07:56.185Z] at org.apache.maven.wagon.StreamWagon.getIfNewer(StreamWagon.java:88)
[2020-02-13T22:07:56.185Z] at org.apache.maven.wagon.StreamWagon.get(StreamWagon.java:61)
[2020-02-13T22:07:56.185Z] at org.sonatype.aether.connector.wagon.WagonRepositoryConnector$GetTask.run(WagonRepositoryConnector.java:601)
[2020-02-13T22:07:56.185Z] ... 4 more
[2020-02-13T22:07:56.185Z] [ERROR]
[2020-02-13T22:07:56.185Z] [ERROR] Re-run Maven using the -X switch to enable full debug logging.
[2020-02-13T22:07:56.185Z] [ERROR]
[2020-02-13T22:07:56.185Z] [ERROR] For more information about the errors and possible solutions, please read the following articles:
[2020-02-13T22:07:56.185Z] [ERROR] [Help 1] http://cwiki.apache.org/confluence/display/MAVEN/ProjectBuildingException
[2020-02-13T22:07:56.185Z] [ERROR] [Help 2] http://cwiki.apache.org/confluence/display/MAVEN/UnresolvableModelException
[Pipeline] }
[Pipeline] // withEnv
[Pipeline] }
[Pipeline] // stage
[Pipeline] fileExists
[Pipeline] fileExists
[Pipeline] archiveArtifacts
[2020-02-13T22:07:56.764Z] Archiving artifacts
[Pipeline] cleanWs
[2020-02-13T22:07:57.253Z] [WS-CLEANUP] Deleting project workspace...
[2020-02-13T22:07:57.253Z] [WS-CLEANUP] Deferred wipeout is used...
[2020-02-13T22:07:57.571Z] [WS-CLEANUP] done
[Pipeline] }
[Pipeline] // ws
[Pipeline] }
[Pipeline] // timestamps
[Pipeline] }
[Pipeline] // node
[Pipeline] }
[Pipeline] // parallel
[Pipeline] echo
Build result: FAILURE
[Pipeline] jiraIssueSelector
[Pipeline] echo
The authors of changes [tibordigana].
[Pipeline] echo
Sending email ...
[Pipeline] emailext
Reply | Threaded
Open this post in threaded view
|

Build failed in Jenkins: Maven TLP » maven-surefire » jenkins #11

Apache Jenkins Server-2
See https://builds.apache.org/job/maven-box/job/maven-surefire/job/jenkins/11/

Changes:

* unsupported tool

No tests ran.

Build log:
[...truncated 212 lines...]
[2020-02-13T22:20:09.058Z] Cloning the remote Git repository
[2020-02-13T22:20:09.059Z] Cloning with configured refspecs honoured and without tags
[2020-02-13T22:20:19.460Z] Cloning repository https://gitbox.apache.org/repos/asf/maven-surefire.git
[2020-02-13T22:20:19.460Z]  > git init /home/jenkins/jenkins-slave/workspace/maven-box_maven-surefire_jenkins@2 # timeout=10
[2020-02-13T22:20:19.469Z] Fetching upstream changes from https://gitbox.apache.org/repos/asf/maven-surefire.git
[2020-02-13T22:20:19.469Z]  > git --version # timeout=10
[2020-02-13T22:20:19.474Z]  > git fetch --no-tags --progress -- https://gitbox.apache.org/repos/asf/maven-surefire.git +refs/heads/*:refs/remotes/origin/*
[2020-02-13T22:20:12.392Z] Fetching without tags
[2020-02-13T22:20:22.359Z]  > git config remote.origin.url https://gitbox.apache.org/repos/asf/maven-surefire.git # timeout=10
[2020-02-13T22:20:22.365Z]  > git config --add remote.origin.fetch +refs/heads/*:refs/remotes/origin/* # timeout=10
[2020-02-13T22:20:22.632Z]  > git config remote.origin.url https://gitbox.apache.org/repos/asf/maven-surefire.git # timeout=10
[2020-02-13T22:20:22.792Z] Fetching upstream changes from https://gitbox.apache.org/repos/asf/maven-surefire.git
[2020-02-13T22:20:22.793Z]  > git fetch --no-tags --progress -- https://gitbox.apache.org/repos/asf/maven-surefire.git +refs/heads/*:refs/remotes/origin/*
[2020-02-13T22:20:13.107Z] Checking out Revision 86ae80e87d69f7454d7e444540912897c479a9de (jenkins)
[2020-02-13T22:20:13.835Z] Commit message: "unsupported tool"
[2020-02-13T22:20:13.835Z] Cleaning workspace
[2020-02-13T22:20:23.508Z]  > git config core.sparsecheckout # timeout=10
[2020-02-13T22:20:23.512Z]  > git checkout -f 86ae80e87d69f7454d7e444540912897c479a9de
[Pipeline] }
[Pipeline] // stage
[Pipeline] echo
[2020-02-13T22:20:14.498Z] Setting JDK for testing JDK 13 (latest)
[Pipeline] stage
[Pipeline] { (build linux-jdk13-maven3.1.x)
[Pipeline] isUnix
[Pipeline] tool
[Pipeline] tool
[Pipeline] tool
[Pipeline] }
[Pipeline] // stage
[Pipeline] cleanWs
[2020-02-13T22:20:15.065Z] [WS-CLEANUP] Deleting project workspace...
[2020-02-13T22:20:15.065Z] [WS-CLEANUP] Deferred wipeout is used...
[2020-02-13T22:20:24.235Z]  > git rev-parse --verify HEAD # timeout=10
[2020-02-13T22:20:24.240Z] Resetting working tree
[2020-02-13T22:20:24.240Z]  > git reset --hard # timeout=10
[2020-02-13T22:20:24.589Z]  > git clean -fdx # timeout=10
[2020-02-13T22:20:15.399Z] [WS-CLEANUP] done
[Pipeline] }
[Pipeline] // ws
[Pipeline] }
[Pipeline] // timestamps
[Pipeline] }
[Pipeline] // node
[Pipeline] }
Failed in branch linux-jdk13-maven3.1.x
Running on H28 in /home/jenkins/jenkins-slave/workspace/maven-box_maven-surefire_jenkins
[Pipeline] {
[Pipeline] timestamps
[Pipeline] {
[Pipeline] pwd
[Pipeline] ws
[2020-02-13T22:20:16.271Z] Running in /home/jenkins/jenkins-slave/workspace/maven-box_maven-surefire_jenkins@2
[Pipeline] {
[Pipeline] isUnix
[Pipeline] sh
[2020-02-13T22:20:18.123Z] + mkdir -p .m2
[Pipeline] pwd
[Pipeline] echo
[2020-02-13T22:20:18.469Z] Maven Local Repository = /home/jenkins/jenkins-slave/workspace/maven-box_maven-surefire_jenkins@2/.m2.
[Pipeline] stage
[Pipeline] { (checkout linux-jdk11-maven3.1.x)
[Pipeline] checkout
[2020-02-13T22:20:19.312Z] No credentials specified
[2020-02-13T22:20:19.468Z] Cloning the remote Git repository
[2020-02-13T22:20:19.468Z] Cloning with configured refspecs honoured and without tags
[2020-02-13T22:20:29.881Z] Cloning repository https://gitbox.apache.org/repos/asf/maven-surefire.git
[2020-02-13T22:20:29.881Z]  > git init /home/jenkins/jenkins-slave/workspace/maven-box_maven-surefire_jenkins@2 # timeout=10
[2020-02-13T22:20:29.890Z] Fetching upstream changes from https://gitbox.apache.org/repos/asf/maven-surefire.git
[2020-02-13T22:20:29.890Z]  > git --version # timeout=10
[2020-02-13T22:20:29.895Z]  > git fetch --no-tags --progress -- https://gitbox.apache.org/repos/asf/maven-surefire.git +refs/heads/*:refs/remotes/origin/*
[2020-02-13T22:20:22.620Z] Fetching without tags
[2020-02-13T22:20:32.695Z]  > git config remote.origin.url https://gitbox.apache.org/repos/asf/maven-surefire.git # timeout=10
[2020-02-13T22:20:32.700Z]  > git config --add remote.origin.fetch +refs/heads/*:refs/remotes/origin/* # timeout=10
[2020-02-13T22:20:32.860Z]  > git config remote.origin.url https://gitbox.apache.org/repos/asf/maven-surefire.git # timeout=10
[2020-02-13T22:20:33.020Z] Fetching upstream changes from https://gitbox.apache.org/repos/asf/maven-surefire.git
[2020-02-13T22:20:33.020Z]  > git fetch --no-tags --progress -- https://gitbox.apache.org/repos/asf/maven-surefire.git +refs/heads/*:refs/remotes/origin/*
[2020-02-13T22:20:23.344Z] Checking out Revision 86ae80e87d69f7454d7e444540912897c479a9de (jenkins)
[2020-02-13T22:20:24.079Z] Commit message: "unsupported tool"
[2020-02-13T22:20:24.079Z] Cleaning workspace
[2020-02-13T22:20:33.745Z]  > git config core.sparsecheckout # timeout=10
[2020-02-13T22:20:33.750Z]  > git checkout -f 86ae80e87d69f7454d7e444540912897c479a9de
[2020-02-13T22:20:34.479Z]  > git rev-parse --verify HEAD # timeout=10
[2020-02-13T22:20:34.484Z] Resetting working tree
[2020-02-13T22:20:34.484Z]  > git reset --hard # timeout=10
[Pipeline] }
[Pipeline] // stage
[Pipeline] echo
[2020-02-13T22:20:24.498Z] Setting JDK for testing JDK 11 (latest)
[Pipeline] stage
[Pipeline] { (build linux-jdk11-maven3.1.x)
[Pipeline] isUnix
[Pipeline] tool
[Pipeline] tool
[Pipeline] tool
[Pipeline] }
[Pipeline] // stage
[Pipeline] cleanWs
[2020-02-13T22:20:24.991Z] [WS-CLEANUP] Deleting project workspace...
[2020-02-13T22:20:24.991Z] [WS-CLEANUP] Deferred wipeout is used...
[2020-02-13T22:20:25.325Z] [WS-CLEANUP] done
[Pipeline] }
[Pipeline] // ws
[Pipeline] }
[Pipeline] // timestamps
[Pipeline] }
[Pipeline] // node
[Pipeline] }
Failed in branch linux-jdk11-maven3.1.x
[2020-02-13T22:20:34.637Z]  > git clean -fdx # timeout=10
Running on H28 in /home/jenkins/jenkins-slave/workspace/maven-box_maven-surefire_jenkins
[Pipeline] {
[Pipeline] timestamps
[Pipeline] {
[Pipeline] pwd
[Pipeline] ws
[2020-02-13T22:20:26.301Z] Running in /home/jenkins/jenkins-slave/workspace/maven-box_maven-surefire_jenkins@2
[Pipeline] {
[Pipeline] isUnix
[Pipeline] sh
[2020-02-13T22:20:28.105Z] + mkdir -p .m2
[Pipeline] pwd
[Pipeline] echo
[2020-02-13T22:20:28.439Z] Maven Local Repository = /home/jenkins/jenkins-slave/workspace/maven-box_maven-surefire_jenkins@2/.m2.
[Pipeline] stage
[Pipeline] { (checkout linux-jdk8-maven3.1.x)
[Pipeline] checkout
[2020-02-13T22:20:29.271Z] No credentials specified
[2020-02-13T22:20:29.427Z] Cloning the remote Git repository
[2020-02-13T22:20:29.427Z] Cloning with configured refspecs honoured and without tags
[2020-02-13T22:20:39.827Z] Cloning repository https://gitbox.apache.org/repos/asf/maven-surefire.git
[2020-02-13T22:20:39.828Z]  > git init /home/jenkins/jenkins-slave/workspace/maven-box_maven-surefire_jenkins@2 # timeout=10
[2020-02-13T22:20:39.836Z] Fetching upstream changes from https://gitbox.apache.org/repos/asf/maven-surefire.git
[2020-02-13T22:20:39.836Z]  > git --version # timeout=10
[2020-02-13T22:20:39.840Z]  > git fetch --no-tags --progress -- https://gitbox.apache.org/repos/asf/maven-surefire.git +refs/heads/*:refs/remotes/origin/*
[2020-02-13T22:20:33.558Z] Fetching without tags
[2020-02-13T22:20:34.277Z] Checking out Revision 86ae80e87d69f7454d7e444540912897c479a9de (jenkins)
[2020-02-13T22:20:43.522Z]  > git config remote.origin.url https://gitbox.apache.org/repos/asf/maven-surefire.git # timeout=10
[2020-02-13T22:20:43.527Z]  > git config --add remote.origin.fetch +refs/heads/*:refs/remotes/origin/* # timeout=10
[2020-02-13T22:20:43.797Z]  > git config remote.origin.url https://gitbox.apache.org/repos/asf/maven-surefire.git # timeout=10
[2020-02-13T22:20:43.958Z] Fetching upstream changes from https://gitbox.apache.org/repos/asf/maven-surefire.git
[2020-02-13T22:20:43.958Z]  > git fetch --no-tags --progress -- https://gitbox.apache.org/repos/asf/maven-surefire.git +refs/heads/*:refs/remotes/origin/*
[2020-02-13T22:20:35.580Z] Commit message: "unsupported tool"
[2020-02-13T22:20:35.580Z] Cleaning workspace
[2020-02-13T22:20:44.678Z]  > git config core.sparsecheckout # timeout=10
[2020-02-13T22:20:44.682Z]  > git checkout -f 86ae80e87d69f7454d7e444540912897c479a9de
[Pipeline] }
[Pipeline] // stage
[Pipeline] echo
[2020-02-13T22:20:36.058Z] Setting JDK for testing JDK 1.8 (latest)
[Pipeline] stage
[Pipeline] { (build linux-jdk8-maven3.1.x)
[Pipeline] isUnix
[Pipeline] tool
[Pipeline] tool
[Pipeline] tool
[Pipeline] }
[Pipeline] // stage
[Pipeline] cleanWs
[2020-02-13T22:20:36.644Z] [WS-CLEANUP] Deleting project workspace...
[2020-02-13T22:20:36.644Z] [WS-CLEANUP] Deferred wipeout is used...
[2020-02-13T22:20:45.981Z]  > git rev-parse --verify HEAD # timeout=10
[2020-02-13T22:20:45.986Z] Resetting working tree
[2020-02-13T22:20:45.986Z]  > git reset --hard # timeout=10
[2020-02-13T22:20:46.165Z]  > git clean -fdx # timeout=10
[2020-02-13T22:20:36.986Z] [WS-CLEANUP] done
[Pipeline] }
[Pipeline] // ws
[Pipeline] }
[Pipeline] // timestamps
[Pipeline] }
[Pipeline] // node
[Pipeline] }
Failed in branch linux-jdk8-maven3.1.x
Running on H28 in /home/jenkins/jenkins-slave/workspace/maven-box_maven-surefire_jenkins
[Pipeline] {
[Pipeline] timestamps
[Pipeline] {
[Pipeline] pwd
[Pipeline] ws
[2020-02-13T22:20:37.830Z] Running in /home/jenkins/jenkins-slave/workspace/maven-box_maven-surefire_jenkins@2
[Pipeline] {
[Pipeline] isUnix
[Pipeline] sh
[2020-02-13T22:20:39.518Z] + mkdir -p .m2
[Pipeline] pwd
[Pipeline] echo
[2020-02-13T22:20:39.869Z] Maven Local Repository = /home/jenkins/jenkins-slave/workspace/maven-box_maven-surefire_jenkins@2/.m2.
[Pipeline] stage
[Pipeline] { (checkout linux-jdk7-maven3.1.x)
[Pipeline] checkout
[2020-02-13T22:20:40.718Z] No credentials specified
[2020-02-13T22:20:40.874Z] Cloning the remote Git repository
[2020-02-13T22:20:40.874Z] Cloning with configured refspecs honoured and without tags
[2020-02-13T22:20:51.275Z] Cloning repository https://gitbox.apache.org/repos/asf/maven-surefire.git
[2020-02-13T22:20:51.276Z]  > git init /home/jenkins/jenkins-slave/workspace/maven-box_maven-surefire_jenkins@2 # timeout=10
[2020-02-13T22:20:51.285Z] Fetching upstream changes from https://gitbox.apache.org/repos/asf/maven-surefire.git
[2020-02-13T22:20:51.285Z]  > git --version # timeout=10
[2020-02-13T22:20:51.290Z]  > git fetch --no-tags --progress -- https://gitbox.apache.org/repos/asf/maven-surefire.git +refs/heads/*:refs/remotes/origin/*
[2020-02-13T22:20:44.118Z] Fetching without tags
[2020-02-13T22:20:54.194Z]  > git config remote.origin.url https://gitbox.apache.org/repos/asf/maven-surefire.git # timeout=10
[2020-02-13T22:20:54.199Z]  > git config --add remote.origin.fetch +refs/heads/*:refs/remotes/origin/* # timeout=10
[2020-02-13T22:20:54.359Z]  > git config remote.origin.url https://gitbox.apache.org/repos/asf/maven-surefire.git # timeout=10
[2020-02-13T22:20:54.520Z] Fetching upstream changes from https://gitbox.apache.org/repos/asf/maven-surefire.git
[2020-02-13T22:20:54.520Z]  > git fetch --no-tags --progress -- https://gitbox.apache.org/repos/asf/maven-surefire.git +refs/heads/*:refs/remotes/origin/*
[2020-02-13T22:20:44.843Z] Checking out Revision 86ae80e87d69f7454d7e444540912897c479a9de (jenkins)
[2020-02-13T22:20:45.566Z] Commit message: "unsupported tool"
[2020-02-13T22:20:45.567Z] Cleaning workspace
[2020-02-13T22:20:55.245Z]  > git config core.sparsecheckout # timeout=10
[2020-02-13T22:20:55.250Z]  > git checkout -f 86ae80e87d69f7454d7e444540912897c479a9de
[2020-02-13T22:20:55.967Z]  > git rev-parse --verify HEAD # timeout=10
[2020-02-13T22:20:55.972Z] Resetting working tree
[2020-02-13T22:20:55.973Z]  > git reset --hard # timeout=10
[Pipeline] }
[Pipeline] // stage
[Pipeline] echo
[2020-02-13T22:20:46.216Z] Setting JDK for testing JDK 1.7 (latest)
[Pipeline] stage
[Pipeline] { (build linux-jdk7-maven3.1.x)
[Pipeline] isUnix
[Pipeline] tool
[Pipeline] tool
[Pipeline] tool
[Pipeline] }
[Pipeline] // stage
[Pipeline] cleanWs
[2020-02-13T22:20:56.323Z]  > git clean -fdx # timeout=10
[2020-02-13T22:20:47.862Z] [WS-CLEANUP] Deleting project workspace...
[2020-02-13T22:20:47.862Z] [WS-CLEANUP] Deferred wipeout is used...
[2020-02-13T22:20:48.221Z] [WS-CLEANUP] done
[Pipeline] }
[Pipeline] // ws
[Pipeline] }
[Pipeline] // timestamps
[Pipeline] }
[Pipeline] // node
[Pipeline] }
Failed in branch linux-jdk7-maven3.1.x
[Pipeline] // parallel
[Pipeline] echo
hudson.AbortException: hudson.AbortException: No tool named Maven 3.1.1 found
[Pipeline] echo
Build result: FAILURE
[Pipeline] jiraIssueSelector
[Pipeline] echo
The authors of changes [tibordigana].
[Pipeline] echo
Sending email ...
[Pipeline] emailext
Reply | Threaded
Open this post in threaded view
|

Build failed in Jenkins: Maven TLP » maven-surefire » jenkins #12

Apache Jenkins Server-2
See https://builds.apache.org/job/maven-box/job/maven-surefire/job/jenkins/12/

Changes:

* [INFRA-19861] Configure Maven before 3.2.3 to use https
* Back to all ubuntu nodes
* [INFRA-19861] Test with node H22
* [INFRA-19861] fix typo
* [INFRA-19861] Fix confirmed, restoring original label
* [INFRA-19861] Analyzing...

No tests ran.

Build log:
[...truncated 204 lines...]
[2020-02-26T17:40:20.617Z]  > git checkout -f 86ae80e87d69f7454d7e444540912897c479a9de
[2020-02-26T17:40:21.259Z]  > git rev-parse --verify HEAD # timeout=10
[2020-02-26T17:40:21.263Z] Resetting working tree
[2020-02-26T17:40:21.263Z]  > git reset --hard # timeout=10
[2020-02-26T17:40:21.480Z]  > git clean -fdx # timeout=10
[Pipeline] isUnix
[Pipeline] tool
[Pipeline] // stage
[Pipeline] openTasks
[Pipeline] tool
[Pipeline] tool
[Pipeline] }
[Pipeline] // stage
[Pipeline] cleanWs
[Pipeline] }
[Pipeline] // stage
[Pipeline] echo
[2020-02-26T17:40:21.863Z] Setting JDK for testing JDK 11 (latest)
[Pipeline] stage
[2020-02-26T17:40:21.878Z] [TASKS] Scanning folder '/home/jenkins/jenkins-slave/workspace/maven-box_maven-surefire_jenkins@2' for files matching the pattern '**/maven-failsafe-plugin/src/main/java,**/maven-surefire-common/src/main/java,**/maven-surefire-plugin/src/main/java,**/maven-surefire-report-plugin/src/main/java,**/surefire-api/src/main/java,**/surefire-booter/src/main/java,**/surefire-extensions-api/src/main/java,**/surefire-grouper/src/main/java,**/surefire-its/src/main/java,**/surefire-logger-api/src/main/java,**/surefire-providers/**/src/main/java,**/surefire-report-parser/src/main/java' - excludes: null
[2020-02-26T17:40:21.878Z] [TASKS] Found 0 files to scan for tasks
[Pipeline] { (build linux-jdk11-maven3.1.x)
[2020-02-26T17:40:21.878Z] [TASKS] Found 0 open tasks.
[2020-02-26T17:40:21.878Z] Skipping warnings blame since pipelines do not have an SCM link.%n
[2020-02-26T17:40:21.895Z] [TASKS] Computing warning deltas based on reference build #6
[Pipeline] jacoco
[Pipeline] isUnix
[Pipeline] tool
[2020-02-26T17:40:21.964Z] [WS-CLEANUP] Deleting project workspace...
[2020-02-26T17:40:21.964Z] [WS-CLEANUP] Deferred wipeout is used...
[Pipeline] tool
[Pipeline] tool
[Pipeline] }
[2020-02-26T17:40:22.081Z] [JaCoCo plugin] Collecting JaCoCo coverage data...
[2020-02-26T17:40:22.082Z] [JaCoCo plugin] **/*.exec;**/maven-failsafe-plugin/target/classes,**/maven-surefire-common/target/classes,**/maven-surefire-plugin/target/classes,**/maven-surefire-report-plugin/target/classes,**/surefire-api/target/classes,**/surefire-booter/target/classes,**/surefire-extensions-api/target/classes,**/surefire-grouper/target/classes,**/surefire-its/target/classes,**/surefire-logger-api/target/classes,**/surefire-providers/**/target/classes,**/surefire-report-parser/target/classes;**/maven-failsafe-plugin/src/main/java,**/maven-surefire-common/src/main/java,**/maven-surefire-plugin/src/main/java,**/maven-surefire-report-plugin/src/main/java,**/surefire-api/src/main/java,**/surefire-booter/src/main/java,**/surefire-extensions-api/src/main/java,**/surefire-grouper/src/main/java,**/surefire-its/src/main/java,**/surefire-logger-api/src/main/java,**/surefire-providers/**/src/main/java,**/surefire-report-parser/src/main/java; locations are configured
[Pipeline] // stage
[Pipeline] cleanWs
[2020-02-26T17:40:22.282Z] [WS-CLEANUP] done
[Pipeline] }
[2020-02-26T17:40:22.310Z] [JaCoCo plugin] Number of found exec files for pattern **/*.exec: 0
[2020-02-26T17:40:21.642Z]  > git rev-parse --verify HEAD # timeout=10
[2020-02-26T17:40:21.647Z] Resetting working tree
[2020-02-26T17:40:21.648Z]  > git reset --hard # timeout=10
[2020-02-26T17:40:21.866Z]  > git clean -fdx # timeout=10
[Pipeline] // ws
[Pipeline] }
[2020-02-26T17:40:22.421Z] [WS-CLEANUP] Deleting project workspace...
[2020-02-26T17:40:22.421Z] [WS-CLEANUP] Deferred wipeout is used...
[Pipeline] // timestamps
[Pipeline] }
[Pipeline] // node
[Pipeline] }
Failed in branch linux-jdk13-maven3.1.x
[2020-02-26T17:40:22.738Z] [WS-CLEANUP] done
[Pipeline] }
[Pipeline] // ws
[Pipeline] }
[Pipeline] // timestamps
[Pipeline] }
[Pipeline] // node
[Pipeline] }
Failed in branch linux-jdk11-maven3.1.x
[2020-02-26T17:40:23.065Z] [JaCoCo plugin] Saving matched execfiles:  
Running on H42 in /home/jenkins/jenkins-slave/workspace/maven-box_maven-surefire_jenkins
[Pipeline] {
[Pipeline] timestamps
[Pipeline] {
[Pipeline] pwd
[Pipeline] ws
[2020-02-26T17:40:23.214Z] Running in /home/jenkins/jenkins-slave/workspace/maven-box_maven-surefire_jenkins@2
[Pipeline] {
[Pipeline] isUnix
[Pipeline] sh
[2020-02-26T17:40:23.299Z] [JaCoCo plugin] Saving matched class directories for class-pattern: **/maven-failsafe-plugin/target/classes,**/maven-surefire-common/target/classes,**/maven-surefire-plugin/target/classes,**/maven-surefire-report-plugin/target/classes,**/surefire-api/target/classes,**/surefire-booter/target/classes,**/surefire-extensions-api/target/classes,**/surefire-grouper/target/classes,**/surefire-its/target/classes,**/surefire-logger-api/target/classes,**/surefire-providers/**/target/classes,**/surefire-report-parser/target/classes:
[2020-02-26T17:40:23.299Z] [JaCoCo plugin] Saving matched source directories for source-pattern: **/maven-failsafe-plugin/src/main/java,**/maven-surefire-common/src/main/java,**/maven-surefire-plugin/src/main/java,**/maven-surefire-report-plugin/src/main/java,**/surefire-api/src/main/java,**/surefire-booter/src/main/java,**/surefire-extensions-api/src/main/java,**/surefire-grouper/src/main/java,**/surefire-its/src/main/java,**/surefire-logger-api/src/main/java,**/surefire-providers/**/src/main/java,**/surefire-report-parser/src/main/java:
[2020-02-26T17:40:23.299Z] [JaCoCo plugin] Source Inclusions: **/*.java
[2020-02-26T17:40:23.466Z] [JaCoCo plugin] Source Exclusions:
Running on H36 in /home/jenkins/jenkins-slave/workspace/maven-box_maven-surefire_jenkins
[2020-02-26T17:40:23.823Z] [JaCoCo plugin] - /home/jenkins/jenkins-slave/workspace/maven-box_maven-surefire_jenkins@2/maven-failsafe-plugin/src/main/java 3 files
[2020-02-26T17:40:23.984Z] [JaCoCo plugin] - /home/jenkins/jenkins-slave/workspace/maven-box_maven-surefire_jenkins@2/maven-surefire-common/src/main/java 87 files
[2020-02-26T17:40:24.151Z] [JaCoCo plugin] - /home/jenkins/jenkins-slave/workspace/maven-box_maven-surefire_jenkins@2/maven-surefire-plugin/src/main/java 1 files
[Pipeline] {
[Pipeline] timestamps
[Pipeline] {
[Pipeline] pwd
[Pipeline] ws
[2020-02-26T17:40:24.274Z] Running in /home/jenkins/jenkins-slave/workspace/maven-box_maven-surefire_jenkins@2
[Pipeline] {
[Pipeline] isUnix
[Pipeline] sh
[2020-02-26T17:40:24.356Z] [JaCoCo plugin] - /home/jenkins/jenkins-slave/workspace/maven-box_maven-surefire_jenkins@2/maven-surefire-report-plugin/src/main/java 7 files
[2020-02-26T17:40:24.539Z] [JaCoCo plugin] - /home/jenkins/jenkins-slave/workspace/maven-box_maven-surefire_jenkins@2/surefire-api/src/main/java 83 files
[2020-02-26T17:40:24.703Z] [JaCoCo plugin] - /home/jenkins/jenkins-slave/workspace/maven-box_maven-surefire_jenkins@2/surefire-booter/src/main/java 24 files
[2020-02-26T17:40:24.866Z] [JaCoCo plugin] - /home/jenkins/jenkins-slave/workspace/maven-box_maven-surefire_jenkins@2/surefire-extensions-api/src/main/java 14 files
[2020-02-26T17:40:24.906Z] + mkdir -p .m2
[2020-02-26T17:40:25.026Z] [JaCoCo plugin] - /home/jenkins/jenkins-slave/workspace/maven-box_maven-surefire_jenkins@2/surefire-grouper/src/main/java 6 files
[2020-02-26T17:40:25.189Z] [JaCoCo plugin] - /home/jenkins/jenkins-slave/workspace/maven-box_maven-surefire_jenkins@2/surefire-logger-api/src/main/java 6 files
[Pipeline] pwd
[Pipeline] echo
[2020-02-26T17:40:25.325Z] Maven Local Repository = /home/jenkins/jenkins-slave/workspace/maven-box_maven-surefire_jenkins@2/.m2.
[Pipeline] stage
[Pipeline] { (checkout linux-jdk8-maven3.1.x)
[2020-02-26T17:40:25.349Z] [JaCoCo plugin] - /home/jenkins/jenkins-slave/workspace/maven-box_maven-surefire_jenkins@2/surefire-providers/common-java5/src/main/java 5 files
[Pipeline] checkout
[2020-02-26T17:40:25.512Z] [JaCoCo plugin] - /home/jenkins/jenkins-slave/workspace/maven-box_maven-surefire_jenkins@2/surefire-providers/common-junit3/src/main/java 2 files
[2020-02-26T17:40:25.675Z] [JaCoCo plugin] - /home/jenkins/jenkins-slave/workspace/maven-box_maven-surefire_jenkins@2/surefire-providers/common-junit4/src/main/java 10 files
[2020-02-26T17:40:25.836Z] [JaCoCo plugin] - /home/jenkins/jenkins-slave/workspace/maven-box_maven-surefire_jenkins@2/surefire-providers/common-junit48/src/main/java 10 files
[2020-02-26T17:40:25.972Z] + mkdir -p .m2
[2020-02-26T17:40:25.997Z] [JaCoCo plugin] - /home/jenkins/jenkins-slave/workspace/maven-box_maven-surefire_jenkins@2/surefire-providers/surefire-junit-platform/src/main/java 4 files
[2020-02-26T17:40:26.190Z] No credentials specified
[2020-02-26T17:40:26.191Z] [JaCoCo plugin] - /home/jenkins/jenkins-slave/workspace/maven-box_maven-surefire_jenkins@2/surefire-providers/surefire-junit3/src/main/java 6 files
[Pipeline] pwd
[Pipeline] echo
[2020-02-26T17:40:26.302Z] Maven Local Repository = /home/jenkins/jenkins-slave/workspace/maven-box_maven-surefire_jenkins@2/.m2.
[Pipeline] stage
[Pipeline] { (checkout linux-jdk7-maven3.1.x)
[2020-02-26T17:40:26.348Z] Cloning the remote Git repository
[2020-02-26T17:40:26.348Z] Cloning with configured refspecs honoured and without tags
[Pipeline] checkout
[2020-02-26T17:40:26.383Z] [JaCoCo plugin] - /home/jenkins/jenkins-slave/workspace/maven-box_maven-surefire_jenkins@2/surefire-providers/surefire-junit4/src/main/java 2 files
[2020-02-26T17:40:26.545Z] [JaCoCo plugin] - /home/jenkins/jenkins-slave/workspace/maven-box_maven-surefire_jenkins@2/surefire-providers/surefire-junit47/src/main/java 39 files
[2020-02-26T17:40:26.751Z] Cloning repository https://gitbox.apache.org/repos/asf/maven-surefire.git
[2020-02-26T17:40:26.752Z]  > git init /home/jenkins/jenkins-slave/workspace/maven-box_maven-surefire_jenkins@2 # timeout=10
[2020-02-26T17:40:26.766Z] Fetching upstream changes from https://gitbox.apache.org/repos/asf/maven-surefire.git
[2020-02-26T17:40:26.766Z]  > git --version # timeout=10
[2020-02-26T17:40:26.769Z]  > git fetch --no-tags --progress -- https://gitbox.apache.org/repos/asf/maven-surefire.git +refs/heads/*:refs/remotes/origin/*
[2020-02-26T17:40:26.716Z] [JaCoCo plugin] - /home/jenkins/jenkins-slave/workspace/maven-box_maven-surefire_jenkins@2/surefire-providers/surefire-testng-utils/src/main/java 6 files
[2020-02-26T17:40:26.877Z] [JaCoCo plugin] - /home/jenkins/jenkins-slave/workspace/maven-box_maven-surefire_jenkins@2/surefire-providers/surefire-testng/src/main/java 17 files
[2020-02-26T17:40:26.877Z] [JaCoCo plugin] - /home/jenkins/jenkins-slave/workspace/maven-box_maven-surefire_jenkins@2/surefire-report-parser/src/main/java 4 files
[2020-02-26T17:40:26.877Z] [JaCoCo plugin] Loading inclusions files..
[2020-02-26T17:40:26.877Z] [JaCoCo plugin] inclusions: []
[2020-02-26T17:40:26.877Z] [JaCoCo plugin] exclusions: []
[2020-02-26T17:40:26.877Z] [JaCoCo plugin] Thresholds: JacocoHealthReportThresholds [minClass=0, maxClass=0, minMethod=0, maxMethod=0, minLine=0, maxLine=0, minBranch=0, maxBranch=0, minInstruction=0, maxInstruction=0, minComplexity=0, maxComplexity=0]
[2020-02-26T17:40:26.878Z] [JaCoCo plugin] Publishing the results..
[2020-02-26T17:40:26.878Z] [JaCoCo plugin] Loading packages..
[2020-02-26T17:40:26.878Z] [JaCoCo plugin] Done.
[2020-02-26T17:40:26.878Z] [JaCoCo plugin] Overall coverage: class: 100, method: 100, line: 100, branch: 100, instruction: 100
[Pipeline] junit
[2020-02-26T17:40:27.057Z] Recording test results
[2020-02-26T17:40:27.149Z] No credentials specified
[2020-02-26T17:40:27.300Z] None of the test reports contained any result
[2020-02-26T17:40:27.304Z] Cloning the remote Git repository
[2020-02-26T17:40:27.305Z] Cloning with configured refspecs honoured and without tags
[Pipeline] cleanWs
[2020-02-26T17:40:27.630Z] [WS-CLEANUP] Deleting project workspace...
[2020-02-26T17:40:27.630Z] [WS-CLEANUP] Deferred wipeout is used...
[2020-02-26T17:40:27.602Z] Cloning repository https://gitbox.apache.org/repos/asf/maven-surefire.git
[2020-02-26T17:40:27.603Z]  > git init /home/jenkins/jenkins-slave/workspace/maven-box_maven-surefire_jenkins@2 # timeout=10
[2020-02-26T17:40:27.609Z] Fetching upstream changes from https://gitbox.apache.org/repos/asf/maven-surefire.git
[2020-02-26T17:40:27.610Z]  > git --version # timeout=10
[2020-02-26T17:40:27.612Z]  > git fetch --no-tags --progress -- https://gitbox.apache.org/repos/asf/maven-surefire.git +refs/heads/*:refs/remotes/origin/*
[2020-02-26T17:40:27.950Z] [WS-CLEANUP] done
[Pipeline] }
[Pipeline] // ws
[Pipeline] }
[Pipeline] // timestamps
[Pipeline] }
[Pipeline] // node
[Pipeline] }
Failed in branch linux-jdk14-maven3.1.x
[2020-02-26T17:40:29.278Z] Fetching without tags
[2020-02-26T17:40:29.955Z]  > git config remote.origin.url https://gitbox.apache.org/repos/asf/maven-surefire.git # timeout=10
[2020-02-26T17:40:29.960Z]  > git config --add remote.origin.fetch +refs/heads/*:refs/remotes/origin/* # timeout=10
[2020-02-26T17:40:29.979Z] Fetching without tags
[2020-02-26T17:40:29.983Z] Checking out Revision 86ae80e87d69f7454d7e444540912897c479a9de (jenkins)
[2020-02-26T17:40:29.342Z]  > git config remote.origin.url https://gitbox.apache.org/repos/asf/maven-surefire.git # timeout=10
[2020-02-26T17:40:29.346Z]  > git config --add remote.origin.fetch +refs/heads/*:refs/remotes/origin/* # timeout=10
[2020-02-26T17:40:29.520Z]  > git config remote.origin.url https://gitbox.apache.org/repos/asf/maven-surefire.git # timeout=10
[2020-02-26T17:40:29.681Z] Fetching upstream changes from https://gitbox.apache.org/repos/asf/maven-surefire.git
[2020-02-26T17:40:29.681Z]  > git fetch --no-tags --progress -- https://gitbox.apache.org/repos/asf/maven-surefire.git +refs/heads/*:refs/remotes/origin/*
[2020-02-26T17:40:30.385Z]  > git config core.sparsecheckout # timeout=10
[2020-02-26T17:40:30.390Z]  > git checkout -f 86ae80e87d69f7454d7e444540912897c479a9de
[2020-02-26T17:40:30.563Z] Commit message: "unsupported tool"
[2020-02-26T17:40:30.563Z] Cleaning workspace
[2020-02-26T17:40:30.671Z] Checking out Revision 86ae80e87d69f7454d7e444540912897c479a9de (jenkins)
[2020-02-26T17:40:30.118Z]  > git config remote.origin.url https://gitbox.apache.org/repos/asf/maven-surefire.git # timeout=10
[2020-02-26T17:40:30.277Z] Fetching upstream changes from https://gitbox.apache.org/repos/asf/maven-surefire.git
[2020-02-26T17:40:30.277Z]  > git fetch --no-tags --progress -- https://gitbox.apache.org/repos/asf/maven-surefire.git +refs/heads/*:refs/remotes/origin/*
[2020-02-26T17:40:30.969Z]  > git config core.sparsecheckout # timeout=10
[2020-02-26T17:40:30.974Z]  > git checkout -f 86ae80e87d69f7454d7e444540912897c479a9de
[Pipeline] }
[Pipeline] // stage
[Pipeline] echo
[2020-02-26T17:40:31.076Z] Setting JDK for testing JDK 1.8 (latest)
[Pipeline] stage
[Pipeline] { (build linux-jdk8-maven3.1.x)
[Pipeline] isUnix
[Pipeline] tool
[Pipeline] tool
[Pipeline] tool
[2020-02-26T17:40:30.965Z]  > git rev-parse --verify HEAD # timeout=10
[2020-02-26T17:40:30.970Z] Resetting working tree
[2020-02-26T17:40:30.970Z]  > git reset --hard # timeout=10
[2020-02-26T17:40:31.192Z]  > git clean -fdx # timeout=10
[2020-02-26T17:40:31.238Z] Commit message: "unsupported tool"
[2020-02-26T17:40:31.238Z] Cleaning workspace
[Pipeline] }
[Pipeline] // stage
[Pipeline] cleanWs
[2020-02-26T17:40:31.654Z] [WS-CLEANUP] Deleting project workspace...
[2020-02-26T17:40:31.654Z] [WS-CLEANUP] Deferred wipeout is used...
[Pipeline] }
[Pipeline] // stage
[Pipeline] echo
[2020-02-26T17:40:31.759Z] Setting JDK for testing JDK 1.7 (latest)
[Pipeline] stage
[Pipeline] { (build linux-jdk7-maven3.1.x)
[Pipeline] isUnix
[Pipeline] tool
[Pipeline] tool
[Pipeline] tool
[Pipeline] }
[Pipeline] // stage
[2020-02-26T17:40:31.974Z] [WS-CLEANUP] done
[Pipeline] cleanWs
[Pipeline] }
[Pipeline] // ws
[Pipeline] }
[Pipeline] // timestamps
[Pipeline] }
[2020-02-26T17:40:31.535Z]  > git rev-parse --verify HEAD # timeout=10
[2020-02-26T17:40:31.540Z] Resetting working tree
[2020-02-26T17:40:31.540Z]  > git reset --hard # timeout=10
[2020-02-26T17:40:31.750Z]  > git clean -fdx # timeout=10
[Pipeline] // node
[Pipeline] }
Failed in branch linux-jdk8-maven3.1.x
[2020-02-26T17:40:32.310Z] [WS-CLEANUP] Deleting project workspace...
[2020-02-26T17:40:32.310Z] [WS-CLEANUP] Deferred wipeout is used...
[2020-02-26T17:40:32.631Z] [WS-CLEANUP] done
[Pipeline] }
[Pipeline] // ws
[Pipeline] }
[Pipeline] // timestamps
[Pipeline] }
[Pipeline] // node
[Pipeline] }
Failed in branch linux-jdk7-maven3.1.x
[Pipeline] // parallel
[Pipeline] echo
hudson.AbortException: hudson.AbortException: No tool named Maven 3.1.1 found
[Pipeline] echo
Build result: FAILURE
[Pipeline] jiraIssueSelector
[Pipeline] echo
The authors of changes [rfscholte].
[Pipeline] echo
Sending email ...
[Pipeline] emailext