Build failed in Jenkins: Maven TLP » maven-surefire » jdk12 #1

classic Classic list List threaded Threaded
1 message Options
Reply | Threaded
Open this post in threaded view
|

Build failed in Jenkins: Maven TLP » maven-surefire » jdk12 #1

Apache Jenkins Server-2
See https://builds.apache.org/job/maven-box/job/maven-surefire/job/jdk12/1/

No changes.

1 tests failed.
FAILED:  junit.framework.TestSuite.org.apache.maven.surefire.booter.SystemUtilsTest

Error Message:
Internal error: Failed to find the "modifiers" field in method setInternalState.

Stack Trace:
java.lang.RuntimeException: Internal error: Failed to find the "modifiers" field in method setInternalState.
        at org.powermock.reflect.internal.WhiteboxImpl.sedModifiersToField(WhiteboxImpl.java:2356)
        at org.powermock.reflect.internal.WhiteboxImpl.removeFinalModifierIfPresent(WhiteboxImpl.java:2320)
        at org.powermock.reflect.internal.WhiteboxImpl.setField(WhiteboxImpl.java:2306)
        at org.powermock.reflect.internal.WhiteboxImpl.setInternalState(WhiteboxImpl.java:304)
        at org.powermock.reflect.internal.WhiteboxImpl.setInternalState(WhiteboxImpl.java:317)
        at org.powermock.reflect.Whitebox.setInternalState(Whitebox.java:190)
        at org.powermock.modules.junit4.PowerMockRunner.run(PowerMockRunner.java:61)
        at org.junit.runners.Suite.runChild(Suite.java:128)
        at org.junit.runners.Suite.runChild(Suite.java:27)
        at org.junit.runners.ParentRunner$3.run(ParentRunner.java:290)
        at org.junit.runners.ParentRunner$1.schedule(ParentRunner.java:71)
        at org.junit.runners.ParentRunner.runChildren(ParentRunner.java:288)
        at org.junit.runners.ParentRunner.access$000(ParentRunner.java:58)
        at org.junit.runners.ParentRunner$2.evaluate(ParentRunner.java:268)
        at org.junit.runners.ParentRunner.run(ParentRunner.java:363)
        at org.junit.runners.Suite.runChild(Suite.java:128)
        at org.junit.runners.Suite.runChild(Suite.java:27)
        at org.junit.runners.ParentRunner$3.run(ParentRunner.java:290)
        at org.junit.runners.ParentRunner$1.schedule(ParentRunner.java:71)
        at org.junit.runners.ParentRunner.runChildren(ParentRunner.java:288)
        at org.junit.runners.ParentRunner.access$000(ParentRunner.java:58)
        at org.junit.runners.ParentRunner$2.evaluate(ParentRunner.java:268)
        at org.junit.runners.ParentRunner.run(ParentRunner.java:363)
        at junit.framework.JUnit4TestAdapter.run(JUnit4TestAdapter.java:38)
        at java.base/jdk.internal.reflect.NativeMethodAccessorImpl.invoke0(Native Method)
        at java.base/jdk.internal.reflect.NativeMethodAccessorImpl.invoke(NativeMethodAccessorImpl.java:62)
        at java.base/jdk.internal.reflect.DelegatingMethodAccessorImpl.invoke(DelegatingMethodAccessorImpl.java:43)
        at java.base/java.lang.reflect.Method.invoke(Method.java:566)
        at org.apache.maven.surefire.shadefire.junit.JUnitTestSet.execute(JUnitTestSet.java:95)
        at org.apache.maven.surefire.shadefire.junit.JUnit3Provider.executeTestSet(JUnit3Provider.java:121)
        at org.apache.maven.surefire.shadefire.junit.JUnit3Provider.invoke(JUnit3Provider.java:98)
        at java.base/jdk.internal.reflect.NativeMethodAccessorImpl.invoke0(Native Method)
        at java.base/jdk.internal.reflect.NativeMethodAccessorImpl.invoke(NativeMethodAccessorImpl.java:62)
        at java.base/jdk.internal.reflect.DelegatingMethodAccessorImpl.invoke(DelegatingMethodAccessorImpl.java:43)
        at java.base/java.lang.reflect.Method.invoke(Method.java:566)
        at org.apache.maven.surefire.shadefire.util.ReflectionUtils.invokeMethodWithArray(ReflectionUtils.java:189)
        at org.apache.maven.surefire.shadefire.booter.ProviderFactory$ProviderProxy.invoke(ProviderFactory.java:165)
        at org.apache.maven.surefire.shadefire.booter.ProviderFactory.invokeProvider(ProviderFactory.java:85)
        at org.apache.maven.surefire.shadefire.booter.ForkedBooter.runSuitesInProcess(ForkedBooter.java:103)
        at org.apache.maven.surefire.shadefire.booter.ForkedBooter.main(ForkedBooter.java:74)
Caused by: java.lang.NoSuchFieldException: modifiers
        at java.base/java.lang.Class.getDeclaredField(Class.java:2399)
        at org.powermock.reflect.internal.WhiteboxImpl.sedModifiersToField(WhiteboxImpl.java:2350)
        ... 39 more
Caused by: java.lang.NoSuchFieldException: modifiers
        at java.base/java.lang.Class.getDeclaredField(Class.java:2399)
        at org.powermock.reflect.internal.WhiteboxImpl.sedModifiersToField(WhiteboxImpl.java:2350)
        ... 39 more




Build log:
[...truncated 12.74 MB...]
[Pipeline] [windows-jdk7-maven3.5.x] }
[Pipeline] [windows-jdk7-maven3.5.x] // stage
[Pipeline] [windows-jdk7-maven3.5.x] }
[Pipeline] [windows-jdk7-maven3.5.x] // timestamps
[Pipeline] [windows-jdk7-maven3.5.x] }
[Pipeline] [windows-jdk7-maven3.5.x] // node
[Pipeline] [windows-jdk7-maven3.5.x] }
[windows-jdk8-maven3.5.x] Running org.apache.maven.surefire.its.jiras.Surefire1209RerunAndForkCountIT
[windows-jdk8-maven3.5.x] Tests run: 4, Failures: 0, Errors: 0, Skipped: 0, Time elapsed: 59.884 sec
[windows-jdk8-maven3.5.x] Running org.apache.maven.surefire.its.jiras.Surefire1211JUnitTestNgIT
[windows-jdk8-maven3.5.x] Tests run: 2, Failures: 0, Errors: 0, Skipped: 0, Time elapsed: 15.864 sec
[windows-jdk8-maven3.5.x] Running org.apache.maven.surefire.its.jiras.Surefire1264IT
[windows-jdk8-maven3.5.x] Tests run: 2, Failures: 0, Errors: 0, Skipped: 0, Time elapsed: 16.58 sec
[windows-jdk8-maven3.5.x] Running org.apache.maven.surefire.its.jiras.Surefire1278GroupNameEndingIT
[windows-jdk8-maven3.5.x] Tests run: 1, Failures: 0, Errors: 0, Skipped: 0, Time elapsed: 7.313 sec
[windows-jdk8-maven3.5.x] Running org.apache.maven.surefire.its.jiras.Surefire1364SystemPropertiesIT
[windows-jdk8-maven3.5.x] Tests run: 10, Failures: 0, Errors: 0, Skipped: 0, Time elapsed: 73.597 sec
[windows-jdk8-maven3.5.x] Running org.apache.maven.surefire.its.jiras.Surefire1367AssumptionLogsIT
[windows-jdk8-maven3.5.x] Tests run: 4, Failures: 0, Errors: 0, Skipped: 0, Time elapsed: 25.495 sec
[windows-jdk8-maven3.5.x] Running org.apache.maven.surefire.its.jiras.Surefire1383ScanSessionDependenciesIT
[windows-jdk8-maven3.5.x] Tests run: 1, Failures: 0, Errors: 0, Skipped: 0, Time elapsed: 7.425 sec
[windows-jdk8-maven3.5.x] Running org.apache.maven.surefire.its.jiras.Surefire1396CustomProviderClassPathIT
[windows-jdk8-maven3.5.x] Tests run: 1, Failures: 0, Errors: 0, Skipped: 0, Time elapsed: 8.974 sec
[windows-jdk8-maven3.5.x] Running org.apache.maven.surefire.its.jiras.Surefire141PluggableProvidersIT
[windows-jdk8-maven3.5.x] Tests run: 4, Failures: 0, Errors: 0, Skipped: 0, Time elapsed: 32.57 sec
[windows-jdk8-maven3.5.x] Running org.apache.maven.surefire.its.jiras.Surefire146ForkPerTestNoSetupIT
[windows-jdk8-maven3.5.x] Tests run: 1, Failures: 0, Errors: 0, Skipped: 0, Time elapsed: 6.252 sec
[windows-jdk8-maven3.5.x] Running org.apache.maven.surefire.its.jiras.Surefire1490ReportTitleDescriptionIT
[windows-jdk8-maven3.5.x] Tests run: 2, Failures: 0, Errors: 0, Skipped: 0, Time elapsed: 30.887 sec
[windows-jdk8-maven3.5.x] Running org.apache.maven.surefire.its.jiras.Surefire1535TestNGParallelSuitesIT
[windows-jdk8-maven3.5.x] Tests run: 4, Failures: 0, Errors: 0, Skipped: 0, Time elapsed: 32.928 sec
[windows-jdk8-maven3.5.x] Running org.apache.maven.surefire.its.jiras.Surefire162CharsetProviderIT
[windows-jdk8-maven3.5.x] Tests run: 1, Failures: 0, Errors: 0, Skipped: 0, Time elapsed: 6.905 sec
[windows-jdk8-maven3.5.x] Running org.apache.maven.surefire.its.jiras.Surefire224WellFormedXmlFailuresIT
[windows-jdk8-maven3.5.x] Tests run: 1, Failures: 0, Errors: 0, Skipped: 0, Time elapsed: 6.7 sec
[windows-jdk8-maven3.5.x] Running org.apache.maven.surefire.its.jiras.Surefire257NotRerunningTestsIT
[windows-jdk8-maven3.5.x] Tests run: 1, Failures: 0, Errors: 0, Skipped: 0, Time elapsed: 8.669 sec
[windows-jdk8-maven3.5.x] Running org.apache.maven.surefire.its.jiras.Surefire260TestWithIdenticalNamesIT
[windows-jdk8-maven3.5.x] Tests run: 1, Failures: 0, Errors: 0, Skipped: 0, Time elapsed: 15.634 sec
[windows-jdk8-maven3.5.x] Running org.apache.maven.surefire.its.jiras.Surefire34SecurityManagerIT
[windows-jdk8-maven3.5.x] Tests run: 2, Failures: 0, Errors: 0, Skipped: 0, Time elapsed: 13.364 sec
[windows-jdk8-maven3.5.x] Running org.apache.maven.surefire.its.jiras.Surefire376TestNgAfterSuiteFailureIT
[windows-jdk8-maven3.5.x] Tests run: 1, Failures: 0, Errors: 0, Skipped: 0, Time elapsed: 6.803 sec
[windows-jdk8-maven3.5.x] Running org.apache.maven.surefire.its.jiras.Surefire377TestNgAndJUnitTogetherIT
[windows-jdk8-maven3.5.x] Tests run: 2, Failures: 0, Errors: 0, Skipped: 0, Time elapsed: 13.157 sec
[windows-jdk8-maven3.5.x] Running org.apache.maven.surefire.its.jiras.Surefire408ManualProviderSelectionIT
[windows-jdk8-maven3.5.x] Tests run: 1, Failures: 0, Errors: 0, Skipped: 0, Time elapsed: 6.788 sec
[windows-jdk8-maven3.5.x] Running org.apache.maven.surefire.its.jiras.Surefire42NotExtendingTestCaseIT
[windows-jdk8-maven3.5.x] Tests run: 1, Failures: 0, Errors: 0, Skipped: 0, Time elapsed: 6.11 sec
[windows-jdk8-maven3.5.x] Running org.apache.maven.surefire.its.jiras.Surefire44InnerClassTestIT
[windows-jdk8-maven3.5.x] Tests run: 1, Failures: 0, Errors: 0, Skipped: 0, Time elapsed: 6.78 sec
[windows-jdk8-maven3.5.x] Running org.apache.maven.surefire.its.jiras.Surefire500PuzzlingErrorIT
[windows-jdk8-maven3.5.x] Tests run: 1, Failures: 0, Errors: 0, Skipped: 0, Time elapsed: 6.479 sec
[windows-jdk8-maven3.5.x] Running org.apache.maven.surefire.its.jiras.Surefire510TestClassPathForkModesIT
[windows-jdk8-maven3.5.x] Tests run: 2, Failures: 0, Errors: 0, Skipped: 0, Time elapsed: 13.471 sec
[windows-jdk8-maven3.5.x] Running org.apache.maven.surefire.its.jiras.Surefire569RunTestFromDependencyJarsIT
[windows-jdk8-maven3.5.x] Tests run: 1, Failures: 0, Errors: 0, Skipped: 0, Time elapsed: 6.368 sec
[windows-jdk8-maven3.5.x] Running org.apache.maven.surefire.its.jiras.Surefire570MultipleReportDirectoriesIT
[windows-jdk8-maven3.5.x] Tests run: 2, Failures: 0, Errors: 0, Skipped: 0, Time elapsed: 34.821 sec
[windows-jdk8-maven3.5.x] Running org.apache.maven.surefire.its.jiras.Surefire613TestCountInParallelIT
[windows-jdk8-maven3.5.x] Tests run: 1, Failures: 0, Errors: 0, Skipped: 0, Time elapsed: 6.833 sec
[windows-jdk8-maven3.5.x] Running org.apache.maven.surefire.its.jiras.Surefire621TestCountingJunit3InParallelIT
[windows-jdk8-maven3.5.x] Tests run: 5, Failures: 0, Errors: 0, Skipped: 0, Time elapsed: 36.443 sec
[windows-jdk8-maven3.5.x] Running org.apache.maven.surefire.its.jiras.Surefire628ConsoleOutputBeforeAndAfterClassIT
[windows-jdk8-maven3.5.x] Tests run: 1, Failures: 0, Errors: 0, Skipped: 0, Time elapsed: 7.167 sec
[windows-jdk8-maven3.5.x] Running org.apache.maven.surefire.its.jiras.Surefire634UnsettableSystemPropertiesWarningIT
[windows-jdk8-maven3.5.x] Tests run: 1, Failures: 0, Errors: 0, Skipped: 0, Time elapsed: 7.09 sec
[windows-jdk8-maven3.5.x] Running org.apache.maven.surefire.its.jiras.Surefire649EmptyStringSystemPropertiesIT
[windows-jdk8-maven3.5.x] Tests run: 2, Failures: 0, Errors: 0, Skipped: 0, Time elapsed: 11.286 sec
[windows-jdk8-maven3.5.x] Running org.apache.maven.surefire.its.jiras.Surefire673MockitoIT
[windows-jdk8-maven3.5.x] Tests run: 1, Failures: 0, Errors: 0, Skipped: 0, Time elapsed: 8.989 sec
[windows-jdk8-maven3.5.x] Running org.apache.maven.surefire.its.jiras.Surefire674BuildFailingWhenErrorsIT
[windows-jdk8-maven3.5.x] Tests run: 1, Failures: 0, Errors: 0, Skipped: 0, Time elapsed: 6.939 sec
[windows-jdk8-maven3.5.x] Running org.apache.maven.surefire.its.jiras.Surefire674BuildFailingWhenFailsafeErrorsIT
[windows-jdk8-maven3.5.x] Tests run: 1, Failures: 0, Errors: 0, Skipped: 0, Time elapsed: 8.725 sec
[windows-jdk8-maven3.5.x] Running org.apache.maven.surefire.its.jiras.Surefire685CommaSeparatedIncludesIT
[windows-jdk8-maven3.5.x] Tests run: 1, Failures: 0, Errors: 0, Skipped: 0, Time elapsed: 6.979 sec
[windows-jdk8-maven3.5.x] Running org.apache.maven.surefire.its.jiras.Surefire697NiceSummaryIT
[windows-jdk8-maven3.5.x] Tests run: 1, Failures: 0, Errors: 0, Skipped: 0, Time elapsed: 6.797 sec
[windows-jdk8-maven3.5.x] Running org.apache.maven.surefire.its.jiras.Surefire705ParallelForkTimeoutIT
[windows-jdk8-maven3.5.x] Tests run: 1, Failures: 0, Errors: 0, Skipped: 0, Time elapsed: 8.641 sec
[windows-jdk8-maven3.5.x] Running org.apache.maven.surefire.its.jiras.Surefire733AllOverrridesCapturedIT
[windows-jdk8-maven3.5.x] Tests run: 1, Failures: 0, Errors: 0, Skipped: 0, Time elapsed: 7.09 sec
[windows-jdk8-maven3.5.x] Running org.apache.maven.surefire.its.jiras.Surefire735ForkFailWithRedirectConsoleOutputIT
[windows-jdk8-maven3.5.x] Tests run: 2, Failures: 0, Errors: 0, Skipped: 0, Time elapsed: 11.915 sec
[windows-jdk8-maven3.5.x] Running org.apache.maven.surefire.its.jiras.Surefire740TruncatedCommaIT
[windows-jdk8-maven3.5.x] Tests run: 1, Failures: 0, Errors: 0, Skipped: 0, Time elapsed: 5.897 sec
[windows-jdk8-maven3.5.x] Running org.apache.maven.surefire.its.jiras.Surefire747MethodParallelWithSuiteCountIT
[windows-jdk8-maven3.5.x] Tests run: 2, Failures: 0, Errors: 0, Skipped: 0, Time elapsed: 24.972 sec
[windows-jdk8-maven3.5.x] Running org.apache.maven.surefire.its.jiras.Surefire772BothReportsIT
[windows-jdk8-maven3.5.x] Tests run: 3, Failures: 0, Errors: 0, Skipped: 0, Time elapsed: 13.285 sec
[windows-jdk8-maven3.5.x] Running org.apache.maven.surefire.its.jiras.Surefire772NoFailsafeReportsIT
[windows-jdk8-maven3.5.x] Tests run: 4, Failures: 0, Errors: 0, Skipped: 0, Time elapsed: 17.748 sec
[windows-jdk8-maven3.5.x] Running org.apache.maven.surefire.its.jiras.Surefire772NoSurefireReportsIT
[windows-jdk8-maven3.5.x] Tests run: 4, Failures: 0, Errors: 0, Skipped: 0, Time elapsed: 17.326 sec
[windows-jdk8-maven3.5.x] Running org.apache.maven.surefire.its.jiras.Surefire772SpecifiedReportsIT
[windows-jdk8-maven3.5.x] Tests run: 3, Failures: 0, Errors: 0, Skipped: 0, Time elapsed: 13.799 sec
[windows-jdk8-maven3.5.x] Running org.apache.maven.surefire.its.jiras.Surefire801ForkModeNoneClassLoaderIT
[windows-jdk8-maven3.5.x] Tests run: 1, Failures: 0, Errors: 0, Skipped: 0, Time elapsed: 5.626 sec
[windows-jdk8-maven3.5.x] Running org.apache.maven.surefire.its.jiras.Surefire803MultiFailsafeExecsIT
[windows-jdk8-maven3.5.x] Tests run: 2, Failures: 0, Errors: 0, Skipped: 0, Time elapsed: 23.999 sec
[windows-jdk8-maven3.5.x] Running org.apache.maven.surefire.its.jiras.Surefire806SpecifiedTestControlsIT
[windows-jdk8-maven3.5.x] Tests run: 3, Failures: 0, Errors: 0, Skipped: 2, Time elapsed: 6.584 sec
[windows-jdk8-maven3.5.x] Running org.apache.maven.surefire.its.jiras.Surefire809GroupExpressionsIT
[windows-jdk8-maven3.5.x] Tests run: 6, Failures: 0, Errors: 0, Skipped: 0, Time elapsed: 39.895 sec
[windows-jdk8-maven3.5.x] Running org.apache.maven.surefire.its.jiras.Surefire812Log4JClassLoaderIT
[windows-jdk8-maven3.5.x] Tests run: 1, Failures: 0, Errors: 0, Skipped: 0, Time elapsed: 7.903 sec
[windows-jdk8-maven3.5.x] Running org.apache.maven.surefire.its.jiras.Surefire817SystemExitIT
[windows-jdk8-maven3.5.x] Tests run: 1, Failures: 0, Errors: 0, Skipped: 0, Time elapsed: 7.215 sec
[windows-jdk8-maven3.5.x] Running org.apache.maven.surefire.its.jiras.Surefire818NpeIgnoresTestsIT
[windows-jdk8-maven3.5.x] Tests run: 1, Failures: 0, Errors: 0, Skipped: 0, Time elapsed: 7.709 sec
[windows-jdk8-maven3.5.x] Running org.apache.maven.surefire.its.jiras.Surefire828EmptyGroupExprIT
[windows-jdk8-maven3.5.x] Tests run: 4, Failures: 0, Errors: 0, Skipped: 0, Time elapsed: 27.725 sec
[windows-jdk8-maven3.5.x] Running org.apache.maven.surefire.its.jiras.Surefire832ProviderSelectionIT
[windows-jdk8-maven3.5.x] Tests run: 1, Failures: 0, Errors: 0, Skipped: 0, Time elapsed: 6.721 sec
[windows-jdk8-maven3.5.x] Running org.apache.maven.surefire.its.jiras.Surefire839TestWithoutCategoriesIT
[windows-jdk8-maven3.5.x] Tests run: 2, Failures: 0, Errors: 0, Skipped: 0, Time elapsed: 14.353 sec
[windows-jdk8-maven3.5.x] Running org.apache.maven.surefire.its.jiras.Surefire847AdditionalFailureIT
[windows-jdk8-maven3.5.x] Tests run: 1, Failures: 0, Errors: 0, Skipped: 0, Time elapsed: 8.804 sec
[windows-jdk8-maven3.5.x] Running org.apache.maven.surefire.its.jiras.Surefire855AllowFailsafeUseArtifactFileIT
[windows-jdk8-maven3.5.x] Tests run: 4, Failures: 0, Errors: 0, Skipped: 0, Time elapsed: 54.195 sec
[windows-jdk8-maven3.5.x] Running org.apache.maven.surefire.its.jiras.Surefire901MIssingResultfileWhenNoTestsIT
[windows-jdk8-maven3.5.x] Tests run: 1, Failures: 0, Errors: 0, Skipped: 0, Time elapsed: 5.747 sec
[windows-jdk8-maven3.5.x] Running org.apache.maven.surefire.its.jiras.Surefire907PerThreadWithoutThreadCountIT
[windows-jdk8-maven3.5.x] Tests run: 1, Failures: 0, Errors: 0, Skipped: 0, Time elapsed: 4.763 sec
[windows-jdk8-maven3.5.x] Running org.apache.maven.surefire.its.jiras.Surefire920TestFailureIgnoreWithTimeoutIT
[windows-jdk8-maven3.5.x] Tests run: 2, Failures: 0, Errors: 0, Skipped: 0, Time elapsed: 15.398 sec
[windows-jdk8-maven3.5.x] Running org.apache.maven.surefire.its.jiras.Surefire926FailureWith2ProvidersIT
[windows-jdk8-maven3.5.x] Tests run: 1, Failures: 0, Errors: 0, Skipped: 0, Time elapsed: 9.116 sec
[windows-jdk8-maven3.5.x] Running org.apache.maven.surefire.its.jiras.Surefire930TestNgSuiteXmlIT
[windows-jdk8-maven3.5.x] Tests run: 1, Failures: 0, Errors: 0, Skipped: 0, Time elapsed: 7.929 sec
[windows-jdk8-maven3.5.x] Running org.apache.maven.surefire.its.jiras.Surefire943ReportContentIT
[windows-jdk8-maven3.5.x] Tests run: 2, Failures: 0, Errors: 0, Skipped: 0, Time elapsed: 21.913 sec
[windows-jdk8-maven3.5.x] Running org.apache.maven.surefire.its.jiras.Surefire946KillMainProcessInReusableForkIT
[windows-jdk8-maven3.5.x] Tests run: 3, Failures: 0, Errors: 0, Skipped: 0, Time elapsed: 26.563 sec
[windows-jdk8-maven3.5.x] Running org.apache.maven.surefire.its.jiras.Surefire972BizarreNoClassDefIT
[windows-jdk8-maven3.5.x] Tests run: 1, Failures: 0, Errors: 0, Skipped: 0, Time elapsed: 10.014 sec
[windows-jdk8-maven3.5.x] Running org.apache.maven.surefire.its.jiras.Surefire975DefaultVMEncodingIT
[windows-jdk8-maven3.5.x] Tests run: 1, Failures: 0, Errors: 0, Skipped: 0, Time elapsed: 7.988 sec
[windows-jdk8-maven3.5.x] Running org.apache.maven.surefire.its.jiras.Surefire979WrongClassLoaderIT
[windows-jdk8-maven3.5.x] Tests run: 1, Failures: 0, Errors: 0, Skipped: 0, Time elapsed: 6.946 sec
[windows-jdk8-maven3.5.x] Running org.apache.maven.surefire.its.jiras.Surefire985ParameterizedRunnerAndCategoriesIT
[windows-jdk8-maven3.5.x] Tests run: 1, Failures: 0, Errors: 0, Skipped: 0, Time elapsed: 5.578 sec
[windows-jdk8-maven3.5.x] Running org.apache.maven.surefire.its.jiras.Surefire995CategoryInheritanceIT
[windows-jdk8-maven3.5.x] Tests run: 5, Failures: 0, Errors: 0, Skipped: 0, Time elapsed: 27.753 sec
[windows-jdk8-maven3.5.x] Running org.apache.maven.surefire.its.jiras.Surefire1265Java9IT
[windows-jdk8-maven3.5.x] Tests run: 1, Failures: 0, Errors: 0, Skipped: 1, Time elapsed: 0.001 sec
[windows-jdk8-maven3.5.x] Running org.apache.maven.surefire.its.jiras.Surefire1295AttributeJvmCrashesToTestsIT
[windows-jdk8-maven3.5.x] Tests run: 9, Failures: 0, Errors: 0, Skipped: 9, Time elapsed: 0.002 sec
[windows-jdk8-maven3.5.x] Running org.apache.maven.surefire.its.TestMultipleMethodPatternsTestNGIT
[windows-jdk8-maven3.5.x] Tests run: 90, Failures: 0, Errors: 0, Skipped: 41, Time elapsed: 294.993 sec
[windows-jdk8-maven3.5.x] Running org.apache.maven.surefire.its.Java9FullApiIT
[windows-jdk8-maven3.5.x] Tests run: 3, Failures: 0, Errors: 0, Skipped: 3, Time elapsed: 0.004 sec
[windows-jdk8-maven3.5.x] Running org.apache.maven.surefire.its.TestMultipleMethodPatternsIT
[windows-jdk8-maven3.5.x] Tests run: 180, Failures: 0, Errors: 0, Skipped: 87, Time elapsed: 556.918 sec
[windows-jdk8-maven3.5.x] Running org.apache.maven.surefire.its.ModulePathIT
[windows-jdk8-maven3.5.x] Tests run: 2, Failures: 0, Errors: 0, Skipped: 2, Time elapsed: 0 sec
[windows-jdk8-maven3.5.x]
[windows-jdk8-maven3.5.x] Results :
[windows-jdk8-maven3.5.x]
[windows-jdk8-maven3.5.x] Tests run: 781, Failures: 0, Errors: 0, Skipped: 147
[windows-jdk8-maven3.5.x]
[windows-jdk8-maven3.5.x] [INFO]
[windows-jdk8-maven3.5.x] [INFO] --- maven-checkstyle-plugin:3.0.0:check (checkstyle-check) @ surefire-its ---
[windows-jdk8-maven3.5.x] [INFO]
[windows-jdk8-maven3.5.x] [INFO] --- maven-failsafe-plugin:2.12.4:verify (default) @ surefire-its ---
[windows-jdk8-maven3.5.x] [INFO] Failsafe report directory: F:\jenkins\jenkins-slave\workspace\en-box_maven-surefire_jdk12-XQ4HYKIPAGXNSUW5DYAVXM6W4QD3GULKZMFKCHEGV47KBUANPQTA@2\surefire-its\target\failsafe-reports
[windows-jdk8-maven3.5.x] [INFO]
[windows-jdk8-maven3.5.x] [INFO] --- maven-install-plugin:2.5.2:install (default-install) @ surefire-its ---
[windows-jdk8-maven3.5.x] [INFO] Skipping artifact installation
[windows-jdk8-maven3.5.x] [INFO]
[windows-jdk8-maven3.5.x] [INFO] --- jacoco-maven-plugin:0.8.2:report (default-cli) @ surefire-its ---
[windows-jdk8-maven3.5.x] [INFO] Skipping JaCoCo execution because property jacoco.skip is set.
[windows-jdk8-maven3.5.x] [INFO] ------------------------------------------------------------------------
[windows-jdk8-maven3.5.x] [INFO] Reactor Summary:
[windows-jdk8-maven3.5.x] [INFO]
[windows-jdk8-maven3.5.x] [INFO] Apache Maven Surefire .............................. SUCCESS [ 23.546 s]
[windows-jdk8-maven3.5.x] [INFO] SureFire Logger API ................................ SUCCESS [  5.671 s]
[windows-jdk8-maven3.5.x] [INFO] SureFire API ....................................... SUCCESS [ 10.030 s]
[windows-jdk8-maven3.5.x] [INFO] SureFire Booter .................................... SUCCESS [ 14.145 s]
[windows-jdk8-maven3.5.x] [INFO] Maven Surefire Test-Grouping Support ............... SUCCESS [  7.101 s]
[windows-jdk8-maven3.5.x] [INFO] SureFire Providers ................................. SUCCESS [  1.359 s]
[windows-jdk8-maven3.5.x] [INFO] Shared JUnit3 Provider Code ........................ SUCCESS [  4.888 s]
[windows-jdk8-maven3.5.x] [INFO] Shared Java 5 Provider Base ........................ SUCCESS [  5.491 s]
[windows-jdk8-maven3.5.x] [INFO] Shared JUnit4 Provider Code ........................ SUCCESS [  5.912 s]
[windows-jdk8-maven3.5.x] [INFO] Shared JUnit48 Provider Code ....................... SUCCESS [  6.513 s]
[windows-jdk8-maven3.5.x] [INFO] SureFire JUnit Runner .............................. SUCCESS [  4.748 s]
[windows-jdk8-maven3.5.x] [INFO] SureFire JUnit4 Runner ............................. SUCCESS [  5.353 s]
[windows-jdk8-maven3.5.x] [INFO] Maven Surefire Common .............................. SUCCESS [ 27.022 s]
[windows-jdk8-maven3.5.x] [INFO] SureFire JUnitCore Runner .......................... SUCCESS [02:11 min]
[windows-jdk8-maven3.5.x] [INFO] SureFire JUnit Platform Runner ..................... SUCCESS [  8.959 s]
[windows-jdk8-maven3.5.x] [INFO] SureFire TestNG Utils .............................. SUCCESS [  5.155 s]
[windows-jdk8-maven3.5.x] [INFO] SureFire TestNG Runner ............................. SUCCESS [  5.488 s]
[windows-jdk8-maven3.5.x] [INFO] ShadeFire JUnit3 Provider .......................... SUCCESS [  1.585 s]
[windows-jdk8-maven3.5.x] [INFO] Surefire Report Parser ............................. SUCCESS [  6.165 s]
[windows-jdk8-maven3.5.x] [INFO] Maven Surefire Plugin .............................. SUCCESS [ 11.833 s]
[windows-jdk8-maven3.5.x] [INFO] Maven Failsafe Plugin .............................. SUCCESS [01:10 min]
[windows-jdk8-maven3.5.x] [INFO] Maven Surefire Report Plugin ....................... SUCCESS [ 15.497 s]
[windows-jdk8-maven3.5.x] [INFO] Maven Surefire Integration Tests ................... SUCCESS [  01:24 h]
[windows-jdk8-maven3.5.x] [INFO] ------------------------------------------------------------------------
[windows-jdk8-maven3.5.x] [INFO] BUILD SUCCESS
[windows-jdk8-maven3.5.x] [INFO] ------------------------------------------------------------------------
[windows-jdk8-maven3.5.x] [INFO] Total time: 01:30 h
[windows-jdk8-maven3.5.x] [INFO] Finished at: 2018-12-02T11:17:14Z
[windows-jdk8-maven3.5.x] [INFO] Final Memory: 50M/167M
[windows-jdk8-maven3.5.x] [INFO] ------------------------------------------------------------------------
[Pipeline] [windows-jdk8-maven3.5.x] }
[Pipeline] [windows-jdk8-maven3.5.x] // withEnv
[Pipeline] [windows-jdk8-maven3.5.x] }
[Pipeline] [windows-jdk8-maven3.5.x] // stage
[Pipeline] [windows-jdk8-maven3.5.x] stage
[Pipeline] [windows-jdk8-maven3.5.x] { (reporting windows-jdk8-maven3.5.x)
[Pipeline] [windows-jdk8-maven3.5.x] fileExists
[Pipeline] [windows-jdk8-maven3.5.x] zip
[windows-jdk8-maven3.5.x] Writing zip file of f:\jenkins\jenkins-slave\workspace\en-box_maven-surefire_jdk12-XQ4HYKIPAGXNSUW5DYAVXM6W4QD3GULKZMFKCHEGV47KBUANPQTA@2\maven-failsafe-plugin\target\it to f:\jenkins\jenkins-slave\workspace\en-box_maven-surefire_jdk12-XQ4HYKIPAGXNSUW5DYAVXM6W4QD3GULKZMFKCHEGV47KBUANPQTA@2\maven-failsafe-plugin--windows-jdk8-maven3.5.x.zip
[windows-jdk8-maven3.5.x] Zipped 83 entries.
[windows-jdk8-maven3.5.x] Archiving f:\jenkins\jenkins-slave\workspace\en-box_maven-surefire_jdk12-XQ4HYKIPAGXNSUW5DYAVXM6W4QD3GULKZMFKCHEGV47KBUANPQTA@2\maven-failsafe-plugin--windows-jdk8-maven3.5.x.zip
[windows-jdk8-maven3.5.x] [Fast Archiver] No prior successful build to compare, so performing full copy of artifacts
[Pipeline] [windows-jdk8-maven3.5.x] fileExists
[Pipeline] [windows-jdk8-maven3.5.x] zip
[windows-jdk8-maven3.5.x] Writing zip file of f:\jenkins\jenkins-slave\workspace\en-box_maven-surefire_jdk12-XQ4HYKIPAGXNSUW5DYAVXM6W4QD3GULKZMFKCHEGV47KBUANPQTA@2\surefire-its\target to f:\jenkins\jenkins-slave\workspace\en-box_maven-surefire_jdk12-XQ4HYKIPAGXNSUW5DYAVXM6W4QD3GULKZMFKCHEGV47KBUANPQTA@2\surefire-its--windows-jdk8-maven3.5.x.zip
[windows-jdk8-maven3.5.x] Zipped 16145 entries.
[windows-jdk8-maven3.5.x] Archiving f:\jenkins\jenkins-slave\workspace\en-box_maven-surefire_jdk12-XQ4HYKIPAGXNSUW5DYAVXM6W4QD3GULKZMFKCHEGV47KBUANPQTA@2\surefire-its--windows-jdk8-maven3.5.x.zip
[windows-jdk8-maven3.5.x] [Fast Archiver] No prior successful build to compare, so performing full copy of artifacts
[Pipeline] [windows-jdk8-maven3.5.x] archiveArtifacts
[windows-jdk8-maven3.5.x] Archiving artifacts
[windows-jdk8-maven3.5.x] [Fast Archiver] No prior successful build to compare, so performing full copy of artifacts
[Pipeline] [windows-jdk8-maven3.5.x] }
[Pipeline] [windows-jdk8-maven3.5.x] // stage
[Pipeline] [windows-jdk8-maven3.5.x] stage
[Pipeline] [windows-jdk8-maven3.5.x] { (cleanup windows-jdk8-maven3.5.x)
[Pipeline] [windows-jdk8-maven3.5.x] cleanWs
[windows-jdk8-maven3.5.x] [WS-CLEANUP] Deleting project workspace...[WS-CLEANUP] done
[Pipeline] [windows-jdk8-maven3.5.x] }
[Pipeline] [windows-jdk8-maven3.5.x] // stage
[Pipeline] [windows-jdk8-maven3.5.x] }
[Pipeline] [windows-jdk8-maven3.5.x] // timestamps
[Pipeline] [windows-jdk8-maven3.5.x] }
[Pipeline] [windows-jdk8-maven3.5.x] // node
[Pipeline] [windows-jdk8-maven3.5.x] }
[Pipeline] // parallel
[Pipeline] echo
hudson.AbortException: hudson.AbortException: script returned exit code 1
[Pipeline] stage
[Pipeline] { (notifications)
[Pipeline] echo
Build result: FAILURE
[Pipeline] jiraIssueSelector
[Pipeline] emailext