Build failed in Jenkins: Maven TLP » maven-surefire » cli #3

classic Classic list List threaded Threaded
3 messages Options
Reply | Threaded
Open this post in threaded view
|

Build failed in Jenkins: Maven TLP » maven-surefire » cli #3

Apache Jenkins Server-2
See https://builds.apache.org/job/maven-box/job/maven-surefire/job/cli/3/

Changes:

* substitutes the old call executeCommandLineAsCallable() - (process call

All tests passed

Build log:
[...truncated 33959 lines...]
[2019-12-02T04:22:56.864Z] [INFO] ------------------------------------------------------------------------
[2019-12-02T04:22:56.864Z] [INFO] Reactor Summary for Apache Maven Surefire 3.0.0-SNAPSHOT:
[2019-12-02T04:22:56.864Z] [INFO]
[2019-12-02T04:22:56.864Z] [INFO] Apache Maven Surefire .............................. SUCCESS [01:03 min]
[2019-12-02T04:22:56.864Z] [INFO] SureFire Logger API ................................ SUCCESS [ 21.991 s]
[2019-12-02T04:22:56.864Z] [INFO] SureFire API ....................................... SUCCESS [ 17.243 s]
[2019-12-02T04:22:56.864Z] [INFO] Surefire Extensions API ............................ SUCCESS [  3.798 s]
[2019-12-02T04:22:56.864Z] [INFO] SureFire Booter .................................... SUCCESS [ 17.026 s]
[2019-12-02T04:22:56.864Z] [INFO] Maven Surefire Test-Grouping Support ............... SUCCESS [ 10.738 s]
[2019-12-02T04:22:56.864Z] [INFO] SureFire Providers ................................. SUCCESS [  1.261 s]
[2019-12-02T04:22:56.864Z] [INFO] Shared JUnit3 Provider Code ........................ SUCCESS [  5.114 s]
[2019-12-02T04:22:56.864Z] [INFO] Shared Java 5 Provider Base ........................ SUCCESS [  5.734 s]
[2019-12-02T04:22:56.864Z] [INFO] Shared JUnit4 Provider Code ........................ SUCCESS [  7.017 s]
[2019-12-02T04:22:56.864Z] [INFO] Shared JUnit48 Provider Code ....................... SUCCESS [  7.447 s]
[2019-12-02T04:22:56.864Z] [INFO] SureFire JUnit Runner .............................. SUCCESS [  5.600 s]
[2019-12-02T04:22:56.864Z] [INFO] SureFire JUnit4 Runner ............................. SUCCESS [ 15.135 s]
[2019-12-02T04:22:56.864Z] [INFO] Maven Surefire Common .............................. SUCCESS [ 53.421 s]
[2019-12-02T04:22:56.864Z] [INFO] SureFire JUnitCore Runner .......................... SUCCESS [02:23 min]
[2019-12-02T04:22:56.864Z] [INFO] SureFire JUnit Platform Runner ..................... SUCCESS [ 12.904 s]
[2019-12-02T04:22:56.864Z] [INFO] SureFire TestNG Utils .............................. SUCCESS [  6.198 s]
[2019-12-02T04:22:56.864Z] [INFO] SureFire TestNG Runner ............................. SUCCESS [  7.019 s]
[2019-12-02T04:22:56.864Z] [INFO] ShadeFire JUnit3 Provider .......................... SUCCESS [  2.648 s]
[2019-12-02T04:22:56.864Z] [INFO] Surefire Report Parser ............................. SUCCESS [  8.075 s]
[2019-12-02T04:22:56.864Z] [INFO] Maven Surefire Plugin .............................. SUCCESS [ 18.192 s]
[2019-12-02T04:22:56.864Z] [INFO] Maven Failsafe Plugin .............................. SUCCESS [01:47 min]
[2019-12-02T04:22:56.864Z] [INFO] Maven Surefire Report Plugin ....................... SUCCESS [ 20.175 s]
[2019-12-02T04:22:56.864Z] [INFO] Maven Surefire Integration Tests ................... SUCCESS [  01:11 h]
[2019-12-02T04:22:56.864Z] [INFO] Surefire Shared Utils .............................. SUCCESS [  3.778 s]
[2019-12-02T04:22:56.864Z] [INFO] ------------------------------------------------------------------------
[2019-12-02T04:22:56.865Z] [INFO] BUILD SUCCESS
[2019-12-02T04:22:56.865Z] [INFO] ------------------------------------------------------------------------
[2019-12-02T04:22:56.865Z] [INFO] Total time:  01:20 h
[2019-12-02T04:22:56.865Z] [INFO] Finished at: 2019-12-01T20:22:56-08:00
[2019-12-02T04:22:56.865Z] [INFO] ------------------------------------------------------------------------
[Pipeline] }
[Pipeline] // withEnv
[Pipeline] }
[Pipeline] // stage
[Pipeline] fileExists
[Pipeline] zip
[2019-12-02T04:22:57.276Z] Writing zip file of C:\Users\jenkins\AppData\Local\Temp\2\jenkins-maven-box-maven-surefire-cli-3\maven-failsafe-plugin\target\it to C:\Users\jenkins\AppData\Local\Temp\2\jenkins-maven-box-maven-surefire-cli-3\maven-failsafe-plugin--windows-jdk13-maven3.6.x.zip
[2019-12-02T04:22:57.401Z] Zipped 78 entries.
[2019-12-02T04:22:57.402Z] Archiving C:\Users\jenkins\AppData\Local\Temp\2\jenkins-maven-box-maven-surefire-cli-3\maven-failsafe-plugin--windows-jdk13-maven3.6.x.zip
[2019-12-02T04:22:57.402Z] [Fast Archiver] No artifacts from Maven TLP » maven-surefire » cli #2 to compare, so performing full copy of artifacts
[Pipeline] fileExists
[Pipeline] zip
[2019-12-02T04:22:57.470Z] Writing zip file of C:\Users\jenkins\AppData\Local\Temp\2\jenkins-maven-box-maven-surefire-cli-3\surefire-its\target to C:\Users\jenkins\AppData\Local\Temp\2\jenkins-maven-box-maven-surefire-cli-3\surefire-its--windows-jdk13-maven3.6.x.zip
[2019-12-02T04:23:00.517Z] [INFO] Tests run: 5, Failures: 0, Errors: 0, Skipped: 0, Time elapsed: 19.874 s - in org.apache.maven.surefire.its.jiras.Surefire995CategoryInheritanceIT
[2019-12-02T04:23:00.517Z] [INFO]
[2019-12-02T04:23:00.517Z] [INFO] Results:
[2019-12-02T04:23:00.517Z] [INFO]
[2019-12-02T04:23:00.517Z] [WARNING] Tests run: 849, Failures: 0, Errors: 0, Skipped: 143
[2019-12-02T04:23:00.517Z] [INFO]
[2019-12-02T04:23:00.517Z] [INFO]
[2019-12-02T04:23:00.517Z] [INFO] --- maven-checkstyle-plugin:3.0.0:check (checkstyle-check) @ surefire-its ---
[2019-12-02T04:23:00.517Z] [INFO]
[2019-12-02T04:23:00.517Z] [INFO] --- maven-failsafe-plugin:3.0.0-M3:verify (default) @ surefire-its ---
[2019-12-02T04:23:00.517Z] [INFO] Failsafe report directory: C:\Users\jenkins\AppData\Local\Temp\2\jenkins-maven-box-maven-surefire-cli-3\surefire-its\target\failsafe-reports
[2019-12-02T04:23:00.517Z] [INFO]
[2019-12-02T04:23:00.517Z] [INFO] --- maven-install-plugin:2.5.2:install (default-install) @ surefire-its ---
[2019-12-02T04:23:00.517Z] [INFO] Skipping artifact installation
[2019-12-02T04:23:00.517Z] [INFO]
[2019-12-02T04:23:00.517Z] [INFO] ----------< org.apache.maven.surefire:surefire-shared-utils >-----------
[2019-12-02T04:23:00.517Z] [INFO] Building Surefire Shared Utils 3.0.0-SNAPSHOT                    [25/25]
[2019-12-02T04:23:00.517Z] [INFO] --------------------------------[ jar ]---------------------------------
[2019-12-02T04:23:00.517Z] [INFO]
[2019-12-02T04:23:00.517Z] [INFO] --- maven-clean-plugin:3.1.0:clean (default-clean) @ surefire-shared-utils ---
[2019-12-02T04:23:00.517Z] [INFO]
[2019-12-02T04:23:00.517Z] [INFO] --- maven-enforcer-plugin:3.0.0-M2:enforce (enforce-maven-version) @ surefire-shared-utils ---
[2019-12-02T04:23:00.517Z] [INFO]
[2019-12-02T04:23:00.517Z] [INFO] --- maven-enforcer-plugin:3.0.0-M2:enforce (enforce-bytecode-version) @ surefire-shared-utils ---
[2019-12-02T04:23:00.517Z] [INFO]
[2019-12-02T04:23:00.517Z] [INFO] --- maven-enforcer-plugin:3.0.0-M2:enforce (ban-known-bad-maven-versions) @ surefire-shared-utils ---
[2019-12-02T04:23:00.517Z] [INFO]
[2019-12-02T04:23:00.517Z] [INFO] --- maven-enforcer-plugin:3.0.0-M2:enforce (enforce-java) @ surefire-shared-utils ---
[2019-12-02T04:23:00.517Z] [INFO]
[2019-12-02T04:23:00.517Z] [INFO] --- maven-enforcer-plugin:3.0.0-M2:enforce (enforce-maven) @ surefire-shared-utils ---
[2019-12-02T04:23:00.517Z] [INFO]
[2019-12-02T04:23:00.517Z] [INFO] --- apache-rat-plugin:0.12:check (rat-check) @ surefire-shared-utils ---
[2019-12-02T04:23:00.517Z] [INFO] Enabled default license matchers.
[2019-12-02T04:23:00.517Z] [INFO] Will parse SCM ignores for exclusions...
[2019-12-02T04:23:00.517Z] [INFO] Finished adding exclusions from SCM ignore files.
[2019-12-02T04:23:00.517Z] [INFO] 61 implicit excludes (use -debug for more details).
[2019-12-02T04:23:00.517Z] [INFO] Exclude: .repository/**
[2019-12-02T04:23:00.517Z] [INFO] Exclude: .maven/spy.log
[2019-12-02T04:23:00.517Z] [INFO] Exclude: dependency-reduced-pom.xml
[2019-12-02T04:23:00.517Z] [INFO] Exclude: .java-version
[2019-12-02T04:23:00.517Z] [INFO] Exclude: Jenkinsfile
[2019-12-02T04:23:00.517Z] [INFO] Exclude: README.md
[2019-12-02T04:23:00.517Z] [INFO] Exclude: .editorconfig
[2019-12-02T04:23:00.517Z] [INFO] Exclude: .gitignore
[2019-12-02T04:23:00.517Z] [INFO] Exclude: .git/**/*
[2019-12-02T04:23:00.517Z] [INFO] Exclude: **/.github/**
[2019-12-02T04:23:00.517Z] [INFO] Exclude: **/.idea
[2019-12-02T04:23:00.517Z] [INFO] Exclude: **/.svn/**/*
[2019-12-02T04:23:00.517Z] [INFO] Exclude: **/*.iml
[2019-12-02T04:23:00.517Z] [INFO] Exclude: **/*.ipr
[2019-12-02T04:23:00.517Z] [INFO] Exclude: **/*.iws
[2019-12-02T04:23:00.517Z] [INFO] Exclude: **/*.versionsBackup
[2019-12-02T04:23:00.517Z] [INFO] Exclude: **/dependency-reduced-pom.xml
[2019-12-02T04:23:00.517Z] [INFO] Exclude: .repository/**
[2019-12-02T04:23:00.517Z] [INFO] Exclude: src/test/resources/**/*
[2019-12-02T04:23:00.517Z] [INFO] Exclude: src/test/resources/**/*.css
[2019-12-02T04:23:00.517Z] [INFO] Exclude: **/*.jj
[2019-12-02T04:23:00.517Z] [INFO] Exclude: src/main/resources/META-INF/services/org.apache.maven.surefire.providerapi.SurefireProvider
[2019-12-02T04:23:00.517Z] [INFO] Exclude: DEPENDENCIES
[2019-12-02T04:23:00.517Z] [INFO] Exclude: .m2/**
[2019-12-02T04:23:00.517Z] [INFO] Exclude: .m2
[2019-12-02T04:23:00.517Z] [INFO] Exclude: .travis.yml
[2019-12-02T04:23:00.517Z] [INFO] 1 resources included (use -debug for more details)
[2019-12-02T04:23:00.517Z] [INFO] Rat check: Summary over all files. Unapproved: 0, unknown: 0, generated: 0, approved: 1 licenses.
[2019-12-02T04:23:00.517Z] [INFO]
[2019-12-02T04:23:00.517Z] [INFO] --- maven-compiler-plugin:3.7.0:compile (compile-generated) @ surefire-shared-utils ---
[2019-12-02T04:23:00.517Z] [INFO] No sources to compile
[2019-12-02T04:23:00.517Z] [INFO]
[2019-12-02T04:23:00.517Z] [INFO] --- maven-remote-resources-plugin:1.5:process (process-resource-bundles) @ surefire-shared-utils ---
[2019-12-02T04:23:00.517Z] [INFO]
[2019-12-02T04:23:00.517Z] [INFO] --- maven-resources-plugin:3.1.0:resources (default-resources) @ surefire-shared-utils ---
[2019-12-02T04:23:00.517Z] [INFO] Using 'UTF-8' encoding to copy filtered resources.
[2019-12-02T04:23:00.517Z] [INFO] skip non existing resourceDirectory C:\Users\jenkins\AppData\Local\Temp\2\jenkins-maven-box-maven-surefire-cli-3\surefire-shared-utils\src\main\resources
[2019-12-02T04:23:00.517Z] [INFO] Copying 3 resources
[2019-12-02T04:23:00.517Z] [INFO]
[2019-12-02T04:23:00.517Z] [INFO] --- maven-compiler-plugin:3.7.0:compile (default-compile) @ surefire-shared-utils ---
[2019-12-02T04:23:00.517Z] [INFO] No sources to compile
[2019-12-02T04:23:00.517Z] [INFO]
[2019-12-02T04:23:00.517Z] [INFO] --- animal-sniffer-maven-plugin:1.17:check (signature-check) @ surefire-shared-utils ---
[2019-12-02T04:23:00.517Z] [INFO] Checking unresolved references to org.codehaus.mojo.signature:java17:1.0
[2019-12-02T04:23:00.916Z] [INFO]
[2019-12-02T04:23:00.916Z] [INFO] --- maven-resources-plugin:3.1.0:testResources (default-testResources) @ surefire-shared-utils ---
[2019-12-02T04:23:00.916Z] [INFO] Using 'UTF-8' encoding to copy filtered resources.
[2019-12-02T04:23:00.916Z] [INFO] skip non existing resourceDirectory C:\Users\jenkins\AppData\Local\Temp\2\jenkins-maven-box-maven-surefire-cli-3\surefire-shared-utils\src\test\resources
[2019-12-02T04:23:00.916Z] [INFO] Copying 3 resources
[2019-12-02T04:23:00.916Z] [INFO]
[2019-12-02T04:23:00.916Z] [INFO] --- maven-compiler-plugin:3.7.0:testCompile (default-testCompile) @ surefire-shared-utils ---
[2019-12-02T04:23:00.916Z] [INFO] No sources to compile
[2019-12-02T04:23:00.916Z] [INFO]
[2019-12-02T04:23:00.916Z] [INFO] --- maven-surefire-plugin:3.0.0-M3:test (default-test) @ surefire-shared-utils ---
[2019-12-02T04:23:00.916Z] [INFO]
[2019-12-02T04:23:00.916Z] [INFO] --- maven-jar-plugin:3.1.0:jar (default-jar) @ surefire-shared-utils ---
[2019-12-02T04:23:00.916Z] [INFO] Building jar: C:\Users\jenkins\AppData\Local\Temp\2\jenkins-maven-box-maven-surefire-cli-3\surefire-shared-utils\target\surefire-shared-utils-3.0.0-SNAPSHOT.jar
[2019-12-02T04:23:01.244Z] [INFO]
[2019-12-02T04:23:01.244Z] [INFO] --- maven-site-plugin:3.8.2:attach-descriptor (attach-descriptor) @ surefire-shared-utils ---
[2019-12-02T04:23:01.244Z] [INFO] Skipping because packaging 'jar' is not pom.
[2019-12-02T04:23:01.244Z] [INFO]
[2019-12-02T04:23:01.244Z] [INFO] --- maven-shade-plugin:3.1.1:shade (default) @ surefire-shared-utils ---
[2019-12-02T04:23:01.244Z] [INFO] Including org.apache.maven.shared:maven-shared-utils:jar:3.1.0 in the shaded jar.
[2019-12-02T04:23:01.244Z] [INFO] Including commons-io:commons-io:jar:2.6 in the shaded jar.
[2019-12-02T04:23:01.244Z] [INFO] Including org.apache.commons:commons-lang3:jar:3.8.1 in the shaded jar.
[2019-12-02T04:23:01.244Z] [INFO] Including org.apache.commons:commons-compress:jar:1.19 in the shaded jar.
[2019-12-02T04:23:01.244Z] [INFO] Including commons-codec:commons-codec:jar:1.11 in the shaded jar.
[2019-12-02T04:23:02.678Z] [INFO] Replacing original artifact with shaded artifact.
[2019-12-02T04:23:02.678Z] [INFO] Replacing C:\Users\jenkins\AppData\Local\Temp\2\jenkins-maven-box-maven-surefire-cli-3\surefire-shared-utils\target\surefire-shared-utils-3.0.0-SNAPSHOT.jar with C:\Users\jenkins\AppData\Local\Temp\2\jenkins-maven-box-maven-surefire-cli-3\surefire-shared-utils\target\surefire-shared-utils-3.0.0-SNAPSHOT-shaded.jar
[2019-12-02T04:23:02.678Z] [INFO] Dependency-reduced POM written at: C:\Users\jenkins\AppData\Local\Temp\2\jenkins-maven-box-maven-surefire-cli-3\surefire-shared-utils\dependency-reduced-pom.xml
[2019-12-02T04:23:02.678Z] [INFO]
[2019-12-02T04:23:02.678Z] [INFO] --- maven-checkstyle-plugin:3.0.0:check (checkstyle-check) @ surefire-shared-utils ---
[2019-12-02T04:23:02.961Z] [INFO]
[2019-12-02T04:23:02.961Z] [INFO] --- maven-install-plugin:2.5.2:install (default-install) @ surefire-shared-utils ---
[2019-12-02T04:23:02.961Z] [INFO] Installing C:\Users\jenkins\AppData\Local\Temp\2\jenkins-maven-box-maven-surefire-cli-3\surefire-shared-utils\target\surefire-shared-utils-3.0.0-SNAPSHOT.jar to C:\Users\jenkins\AppData\Local\Temp\2\jenkins-maven-box-maven-surefire-cli-3\.m2\org\apache\maven\surefire\surefire-shared-utils\3.0.0-SNAPSHOT\surefire-shared-utils-3.0.0-SNAPSHOT.jar
[2019-12-02T04:23:02.961Z] [INFO] Installing C:\Users\jenkins\AppData\Local\Temp\2\jenkins-maven-box-maven-surefire-cli-3\surefire-shared-utils\dependency-reduced-pom.xml to C:\Users\jenkins\AppData\Local\Temp\2\jenkins-maven-box-maven-surefire-cli-3\.m2\org\apache\maven\surefire\surefire-shared-utils\3.0.0-SNAPSHOT\surefire-shared-utils-3.0.0-SNAPSHOT.pom
[2019-12-02T04:23:03.231Z] [INFO] ------------------------------------------------------------------------
[2019-12-02T04:23:03.231Z] [INFO] Reactor Summary for Apache Maven Surefire 3.0.0-SNAPSHOT:
[2019-12-02T04:23:03.231Z] [INFO]
[2019-12-02T04:23:03.231Z] [INFO] Apache Maven Surefire .............................. SUCCESS [01:00 min]
[2019-12-02T04:23:03.231Z] [INFO] SureFire Logger API ................................ SUCCESS [ 24.382 s]
[2019-12-02T04:23:03.231Z] [INFO] SureFire API ....................................... SUCCESS [ 14.680 s]
[2019-12-02T04:23:03.231Z] [INFO] Surefire Extensions API ............................ SUCCESS [  3.312 s]
[2019-12-02T04:23:03.231Z] [INFO] SureFire Booter .................................... SUCCESS [ 16.311 s]
[2019-12-02T04:23:03.231Z] [INFO] Maven Surefire Test-Grouping Support ............... SUCCESS [  7.517 s]
[2019-12-02T04:23:03.231Z] [INFO] SureFire Providers ................................. SUCCESS [  1.286 s]
[2019-12-02T04:23:03.231Z] [INFO] Shared JUnit3 Provider Code ........................ SUCCESS [  5.385 s]
[2019-12-02T04:23:03.231Z] [INFO] Shared Java 5 Provider Base ........................ SUCCESS [  6.396 s]
[2019-12-02T04:23:03.231Z] [INFO] Shared JUnit4 Provider Code ........................ SUCCESS [  5.932 s]
[2019-12-02T04:23:03.231Z] [INFO] Shared JUnit48 Provider Code ....................... SUCCESS [  6.732 s]
[2019-12-02T04:23:03.231Z] [INFO] SureFire JUnit Runner .............................. SUCCESS [  4.517 s]
[2019-12-02T04:23:03.231Z] [INFO] SureFire JUnit4 Runner ............................. SUCCESS [ 35.037 s]
[2019-12-02T04:23:03.231Z] [INFO] Maven Surefire Common .............................. SUCCESS [ 50.590 s]
[2019-12-02T04:23:03.231Z] [INFO] SureFire JUnitCore Runner .......................... SUCCESS [02:21 min]
[2019-12-02T04:23:03.231Z] [INFO] SureFire JUnit Platform Runner ..................... SUCCESS [ 11.390 s]
[2019-12-02T04:23:03.231Z] [INFO] SureFire TestNG Utils .............................. SUCCESS [  5.519 s]
[2019-12-02T04:23:03.231Z] [INFO] SureFire TestNG Runner ............................. SUCCESS [  5.684 s]
[2019-12-02T04:23:03.231Z] [INFO] ShadeFire JUnit3 Provider .......................... SUCCESS [  2.025 s]
[2019-12-02T04:23:03.231Z] [INFO] Surefire Report Parser ............................. SUCCESS [  7.069 s]
[2019-12-02T04:23:03.231Z] [INFO] Maven Surefire Plugin .............................. SUCCESS [ 13.843 s]
[2019-12-02T04:23:03.231Z] [INFO] Maven Failsafe Plugin .............................. SUCCESS [01:38 min]
[2019-12-02T04:23:03.231Z] [INFO] Maven Surefire Report Plugin ....................... SUCCESS [ 18.528 s]
[2019-12-02T04:23:03.231Z] [INFO] Maven Surefire Integration Tests ................... SUCCESS [  01:11 h]
[2019-12-02T04:23:03.231Z] [INFO] Surefire Shared Utils .............................. SUCCESS [  3.281 s]
[2019-12-02T04:23:03.231Z] [INFO] ------------------------------------------------------------------------
[2019-12-02T04:23:03.231Z] [INFO] BUILD SUCCESS
[2019-12-02T04:23:03.231Z] [INFO] ------------------------------------------------------------------------
[2019-12-02T04:23:03.231Z] [INFO] Total time:  01:20 h
[2019-12-02T04:23:03.231Z] [INFO] Finished at: 2019-12-01T20:23:02-08:00
[2019-12-02T04:23:03.232Z] [INFO] ------------------------------------------------------------------------
[Pipeline] }
[Pipeline] // withEnv
[Pipeline] }
[Pipeline] // stage
[Pipeline] fileExists
[Pipeline] zip
[2019-12-02T04:23:03.362Z] Writing zip file of C:\Users\jenkins\AppData\Local\Temp\2\jenkins-maven-box-maven-surefire-cli-3\maven-failsafe-plugin\target\it to C:\Users\jenkins\AppData\Local\Temp\2\jenkins-maven-box-maven-surefire-cli-3\maven-failsafe-plugin--windows-jdk11-maven3.6.x.zip
[2019-12-02T04:23:03.448Z] Zipped 78 entries.
[2019-12-02T04:23:03.448Z] Archiving C:\Users\jenkins\AppData\Local\Temp\2\jenkins-maven-box-maven-surefire-cli-3\maven-failsafe-plugin--windows-jdk11-maven3.6.x.zip
[2019-12-02T04:23:03.449Z] [Fast Archiver] No artifacts from Maven TLP » maven-surefire » cli #2 to compare, so performing full copy of artifacts
[Pipeline] fileExists
[Pipeline] zip
[2019-12-02T04:23:03.524Z] Writing zip file of C:\Users\jenkins\AppData\Local\Temp\2\jenkins-maven-box-maven-surefire-cli-3\surefire-its\target to C:\Users\jenkins\AppData\Local\Temp\2\jenkins-maven-box-maven-surefire-cli-3\surefire-its--windows-jdk11-maven3.6.x.zip
[2019-12-02T04:23:12.715Z] Zipped 17118 entries.
[2019-12-02T04:23:12.716Z] Archiving C:\Users\jenkins\AppData\Local\Temp\2\jenkins-maven-box-maven-surefire-cli-3\surefire-its--windows-jdk13-maven3.6.x.zip
[2019-12-02T04:23:12.717Z] [Fast Archiver] No artifacts from Maven TLP » maven-surefire » cli #2 to compare, so performing full copy of artifacts
[Pipeline] archiveArtifacts
[2019-12-02T04:23:14.540Z] Archiving artifacts
[2019-12-02T04:23:14.550Z] [Fast Archiver] No artifacts from Maven TLP » maven-surefire » cli #2 to compare, so performing full copy of artifacts
[2019-12-02T04:23:16.194Z] Zipped 17132 entries.
[2019-12-02T04:23:16.195Z] Archiving C:\Users\jenkins\AppData\Local\Temp\2\jenkins-maven-box-maven-surefire-cli-3\surefire-its--windows-jdk11-maven3.6.x.zip
[2019-12-02T04:23:16.196Z] [Fast Archiver] No artifacts from Maven TLP » maven-surefire » cli #2 to compare, so performing full copy of artifacts
[Pipeline] cleanWs
[2019-12-02T04:23:16.242Z] [WS-CLEANUP] Deleting project workspace...
[2019-12-02T04:23:16.243Z] [WS-CLEANUP] Deferred wipeout is used...
[2019-12-02T04:23:16.354Z] [WS-CLEANUP] done
[Pipeline] }
[Pipeline] // ws
[Pipeline] }
[Pipeline] // timestamps
[Pipeline] }
[Pipeline] // node
[Pipeline] }
[Pipeline] archiveArtifacts
[2019-12-02T04:23:17.505Z] Archiving artifacts
[2019-12-02T04:23:17.514Z] [Fast Archiver] No artifacts from Maven TLP » maven-surefire » cli #2 to compare, so performing full copy of artifacts
[Pipeline] cleanWs
[2019-12-02T04:23:19.597Z] [WS-CLEANUP] Deleting project workspace...
[2019-12-02T04:23:19.597Z] [WS-CLEANUP] Deferred wipeout is used...
[2019-12-02T04:23:19.692Z] [WS-CLEANUP] done
[Pipeline] }
[Pipeline] // ws
[Pipeline] }
[Pipeline] // timestamps
[Pipeline] }
[Pipeline] // node
[Pipeline] }
[Pipeline] // parallel
[Pipeline] echo
Build result: FAILURE
[Pipeline] jiraIssueSelector
[Pipeline] echo
The authors of changes [tibordigana].
[Pipeline] echo
Sending email ...
[Pipeline] emailext
Reply | Threaded
Open this post in threaded view
|

Build failed in Jenkins: Maven TLP » maven-surefire » cli #4

Apache Jenkins Server-2
See https://builds.apache.org/job/maven-box/job/maven-surefire/job/cli/4/

Changes:

* fixed NPE with non-threadsafe java.util.Scanner

2 tests failed.
FAILED:  org.apache.maven.surefire.its.jiras.Surefire735ForkFailWithRedirectConsoleOutputIT.vmStartFail

Error Message:
expecting actual value not to be null

Stack Trace:
java.lang.AssertionError: expecting actual value not to be null
        at org.apache.maven.surefire.its.jiras.Surefire735ForkFailWithRedirectConsoleOutputIT.assertJvmCrashed(Surefire735ForkFailWithRedirectConsoleOutputIT.java:72)
        at org.apache.maven.surefire.its.jiras.Surefire735ForkFailWithRedirectConsoleOutputIT.vmStartFail(Surefire735ForkFailWithRedirectConsoleOutputIT.java:44)


FAILED:  org.apache.maven.surefire.its.jiras.Surefire735ForkFailWithRedirectConsoleOutputIT.vmStartFailShouldFailBuildk

Error Message:
expecting actual value not to be null

Stack Trace:
java.lang.AssertionError: expecting actual value not to be null
        at org.apache.maven.surefire.its.jiras.Surefire735ForkFailWithRedirectConsoleOutputIT.assertJvmCrashed(Surefire735ForkFailWithRedirectConsoleOutputIT.java:72)
        at org.apache.maven.surefire.its.jiras.Surefire735ForkFailWithRedirectConsoleOutputIT.vmStartFailShouldFailBuildk(Surefire735ForkFailWithRedirectConsoleOutputIT.java:52)




Build log:
[...truncated 33898 lines...]
[2019-12-02T06:35:23.511Z] [INFO] ------------------------------------------------------------------------
[2019-12-02T06:35:23.511Z] [INFO] Reactor Summary for Apache Maven Surefire 3.0.0-SNAPSHOT:
[2019-12-02T06:35:23.511Z] [INFO]
[2019-12-02T06:35:23.511Z] [INFO] Apache Maven Surefire .............................. SUCCESS [ 54.954 s]
[2019-12-02T06:35:23.511Z] [INFO] SureFire Logger API ................................ SUCCESS [ 20.564 s]
[2019-12-02T06:35:23.511Z] [INFO] SureFire API ....................................... SUCCESS [ 13.427 s]
[2019-12-02T06:35:23.511Z] [INFO] Surefire Extensions API ............................ SUCCESS [  3.471 s]
[2019-12-02T06:35:23.511Z] [INFO] SureFire Booter .................................... SUCCESS [ 14.652 s]
[2019-12-02T06:35:23.511Z] [INFO] Maven Surefire Test-Grouping Support ............... SUCCESS [  9.145 s]
[2019-12-02T06:35:23.511Z] [INFO] SureFire Providers ................................. SUCCESS [  1.185 s]
[2019-12-02T06:35:23.511Z] [INFO] Shared JUnit3 Provider Code ........................ SUCCESS [  4.949 s]
[2019-12-02T06:35:23.511Z] [INFO] Shared Java 5 Provider Base ........................ SUCCESS [  5.912 s]
[2019-12-02T06:35:23.511Z] [INFO] Shared JUnit4 Provider Code ........................ SUCCESS [  7.628 s]
[2019-12-02T06:35:23.511Z] [INFO] Shared JUnit48 Provider Code ....................... SUCCESS [  6.536 s]
[2019-12-02T06:35:23.511Z] [INFO] SureFire JUnit Runner .............................. SUCCESS [  5.820 s]
[2019-12-02T06:35:23.511Z] [INFO] SureFire JUnit4 Runner ............................. SUCCESS [ 14.626 s]
[2019-12-02T06:35:23.511Z] [INFO] Maven Surefire Common .............................. SUCCESS [ 46.789 s]
[2019-12-02T06:35:23.511Z] [INFO] SureFire JUnitCore Runner .......................... SUCCESS [02:22 min]
[2019-12-02T06:35:23.511Z] [INFO] SureFire JUnit Platform Runner ..................... SUCCESS [ 10.915 s]
[2019-12-02T06:35:23.511Z] [INFO] SureFire TestNG Utils .............................. SUCCESS [  6.000 s]
[2019-12-02T06:35:23.511Z] [INFO] SureFire TestNG Runner ............................. SUCCESS [  6.681 s]
[2019-12-02T06:35:23.511Z] [INFO] ShadeFire JUnit3 Provider .......................... SUCCESS [  2.025 s]
[2019-12-02T06:35:23.511Z] [INFO] Surefire Report Parser ............................. SUCCESS [  7.671 s]
[2019-12-02T06:35:23.511Z] [INFO] Maven Surefire Plugin .............................. SUCCESS [ 17.222 s]
[2019-12-02T06:35:23.511Z] [INFO] Maven Failsafe Plugin .............................. SUCCESS [01:40 min]
[2019-12-02T06:35:23.511Z] [INFO] Maven Surefire Report Plugin ....................... SUCCESS [ 16.741 s]
[2019-12-02T06:35:23.511Z] [INFO] Maven Surefire Integration Tests ................... SUCCESS [  01:10 h]
[2019-12-02T06:35:23.511Z] [INFO] Surefire Shared Utils .............................. SUCCESS [  3.856 s]
[2019-12-02T06:35:23.511Z] [INFO] ------------------------------------------------------------------------
[2019-12-02T06:35:23.511Z] [INFO] BUILD SUCCESS
[2019-12-02T06:35:23.511Z] [INFO] ------------------------------------------------------------------------
[2019-12-02T06:35:23.511Z] [INFO] Total time:  01:19 h
[2019-12-02T06:35:23.511Z] [INFO] Finished at: 2019-12-01T22:35:23-08:00
[2019-12-02T06:35:23.511Z] [INFO] ------------------------------------------------------------------------
[Pipeline] }
[Pipeline] // withEnv
[Pipeline] }
[Pipeline] // stage
[Pipeline] fileExists
[Pipeline] zip
[2019-12-02T06:35:23.663Z] Writing zip file of C:\Users\jenkins\AppData\Local\Temp\2\jenkins-maven-box-maven-surefire-cli-4\maven-failsafe-plugin\target\it to C:\Users\jenkins\AppData\Local\Temp\2\jenkins-maven-box-maven-surefire-cli-4\maven-failsafe-plugin--windows-jdk13-maven3.6.x.zip
[2019-12-02T06:35:23.741Z] Zipped 78 entries.
[2019-12-02T06:35:23.741Z] Archiving C:\Users\jenkins\AppData\Local\Temp\2\jenkins-maven-box-maven-surefire-cli-4\maven-failsafe-plugin--windows-jdk13-maven3.6.x.zip
[2019-12-02T06:35:23.742Z] [Fast Archiver] No artifacts from Maven TLP » maven-surefire » cli #2 to compare, so performing full copy of artifacts
[Pipeline] fileExists
[Pipeline] zip
[2019-12-02T06:35:23.829Z] Writing zip file of C:\Users\jenkins\AppData\Local\Temp\2\jenkins-maven-box-maven-surefire-cli-4\surefire-its\target to C:\Users\jenkins\AppData\Local\Temp\2\jenkins-maven-box-maven-surefire-cli-4\surefire-its--windows-jdk13-maven3.6.x.zip
[2019-12-02T06:35:33.961Z] [INFO] Tests run: 5, Failures: 0, Errors: 0, Skipped: 0, Time elapsed: 23.181 s - in org.apache.maven.surefire.its.jiras.Surefire995CategoryInheritanceIT
[2019-12-02T06:35:33.961Z] [INFO]
[2019-12-02T06:35:33.961Z] [INFO] Results:
[2019-12-02T06:35:33.961Z] [INFO]
[2019-12-02T06:35:33.961Z] [WARNING] Tests run: 849, Failures: 0, Errors: 0, Skipped: 143
[2019-12-02T06:35:33.961Z] [INFO]
[2019-12-02T06:35:33.961Z] [INFO]
[2019-12-02T06:35:33.961Z] [INFO] --- maven-checkstyle-plugin:3.0.0:check (checkstyle-check) @ surefire-its ---
[2019-12-02T06:35:33.961Z] [INFO]
[2019-12-02T06:35:33.961Z] [INFO] --- maven-failsafe-plugin:3.0.0-M3:verify (default) @ surefire-its ---
[2019-12-02T06:35:33.961Z] [INFO] Failsafe report directory: C:\Users\jenkins\AppData\Local\Temp\2\jenkins-maven-box-maven-surefire-cli-4@2\surefire-its\target\failsafe-reports
[2019-12-02T06:35:33.961Z] [INFO]
[2019-12-02T06:35:33.961Z] [INFO] --- maven-install-plugin:2.5.2:install (default-install) @ surefire-its ---
[2019-12-02T06:35:33.962Z] [INFO] Skipping artifact installation
[2019-12-02T06:35:33.962Z] [INFO]
[2019-12-02T06:35:33.962Z] [INFO] ----------< org.apache.maven.surefire:surefire-shared-utils >-----------
[2019-12-02T06:35:33.962Z] [INFO] Building Surefire Shared Utils 3.0.0-SNAPSHOT                    [25/25]
[2019-12-02T06:35:33.962Z] [INFO] --------------------------------[ jar ]---------------------------------
[2019-12-02T06:35:33.962Z] [INFO]
[2019-12-02T06:35:33.962Z] [INFO] --- maven-clean-plugin:3.1.0:clean (default-clean) @ surefire-shared-utils ---
[2019-12-02T06:35:33.962Z] [INFO]
[2019-12-02T06:35:33.962Z] [INFO] --- maven-enforcer-plugin:3.0.0-M2:enforce (enforce-maven-version) @ surefire-shared-utils ---
[2019-12-02T06:35:33.962Z] [INFO]
[2019-12-02T06:35:33.962Z] [INFO] --- maven-enforcer-plugin:3.0.0-M2:enforce (enforce-bytecode-version) @ surefire-shared-utils ---
[2019-12-02T06:35:33.962Z] [INFO]
[2019-12-02T06:35:33.962Z] [INFO] --- maven-enforcer-plugin:3.0.0-M2:enforce (ban-known-bad-maven-versions) @ surefire-shared-utils ---
[2019-12-02T06:35:33.962Z] [INFO]
[2019-12-02T06:35:33.962Z] [INFO] --- maven-enforcer-plugin:3.0.0-M2:enforce (enforce-java) @ surefire-shared-utils ---
[2019-12-02T06:35:33.962Z] [INFO]
[2019-12-02T06:35:33.962Z] [INFO] --- maven-enforcer-plugin:3.0.0-M2:enforce (enforce-maven) @ surefire-shared-utils ---
[2019-12-02T06:35:33.962Z] [INFO]
[2019-12-02T06:35:33.962Z] [INFO] --- apache-rat-plugin:0.12:check (rat-check) @ surefire-shared-utils ---
[2019-12-02T06:35:33.962Z] [INFO] Enabled default license matchers.
[2019-12-02T06:35:33.962Z] [INFO] Will parse SCM ignores for exclusions...
[2019-12-02T06:35:33.962Z] [INFO] Finished adding exclusions from SCM ignore files.
[2019-12-02T06:35:33.962Z] [INFO] 61 implicit excludes (use -debug for more details).
[2019-12-02T06:35:33.962Z] [INFO] Exclude: .repository/**
[2019-12-02T06:35:33.962Z] [INFO] Exclude: .maven/spy.log
[2019-12-02T06:35:33.962Z] [INFO] Exclude: dependency-reduced-pom.xml
[2019-12-02T06:35:33.962Z] [INFO] Exclude: .java-version
[2019-12-02T06:35:33.962Z] [INFO] Exclude: Jenkinsfile
[2019-12-02T06:35:33.962Z] [INFO] Exclude: README.md
[2019-12-02T06:35:33.962Z] [INFO] Exclude: .editorconfig
[2019-12-02T06:35:33.962Z] [INFO] Exclude: .gitignore
[2019-12-02T06:35:33.962Z] [INFO] Exclude: .git/**/*
[2019-12-02T06:35:33.962Z] [INFO] Exclude: **/.github/**
[2019-12-02T06:35:33.962Z] [INFO] Exclude: **/.idea
[2019-12-02T06:35:33.962Z] [INFO] Exclude: **/.svn/**/*
[2019-12-02T06:35:33.962Z] [INFO] Exclude: **/*.iml
[2019-12-02T06:35:33.962Z] [INFO] Exclude: **/*.ipr
[2019-12-02T06:35:33.962Z] [INFO] Exclude: **/*.iws
[2019-12-02T06:35:33.962Z] [INFO] Exclude: **/*.versionsBackup
[2019-12-02T06:35:33.962Z] [INFO] Exclude: **/dependency-reduced-pom.xml
[2019-12-02T06:35:33.962Z] [INFO] Exclude: .repository/**
[2019-12-02T06:35:33.962Z] [INFO] Exclude: src/test/resources/**/*
[2019-12-02T06:35:33.962Z] [INFO] Exclude: src/test/resources/**/*.css
[2019-12-02T06:35:33.962Z] [INFO] Exclude: **/*.jj
[2019-12-02T06:35:33.962Z] [INFO] Exclude: src/main/resources/META-INF/services/org.apache.maven.surefire.providerapi.SurefireProvider
[2019-12-02T06:35:33.962Z] [INFO] Exclude: DEPENDENCIES
[2019-12-02T06:35:33.962Z] [INFO] Exclude: .m2/**
[2019-12-02T06:35:33.962Z] [INFO] Exclude: .m2
[2019-12-02T06:35:33.962Z] [INFO] Exclude: .travis.yml
[2019-12-02T06:35:33.962Z] [INFO] 1 resources included (use -debug for more details)
[2019-12-02T06:35:33.962Z] [INFO] Rat check: Summary over all files. Unapproved: 0, unknown: 0, generated: 0, approved: 1 licenses.
[2019-12-02T06:35:33.962Z] [INFO]
[2019-12-02T06:35:33.962Z] [INFO] --- maven-compiler-plugin:3.7.0:compile (compile-generated) @ surefire-shared-utils ---
[2019-12-02T06:35:33.962Z] [INFO] No sources to compile
[2019-12-02T06:35:33.962Z] [INFO]
[2019-12-02T06:35:33.962Z] [INFO] --- maven-remote-resources-plugin:1.5:process (process-resource-bundles) @ surefire-shared-utils ---
[2019-12-02T06:35:33.962Z] [INFO]
[2019-12-02T06:35:33.962Z] [INFO] --- maven-resources-plugin:3.1.0:resources (default-resources) @ surefire-shared-utils ---
[2019-12-02T06:35:33.962Z] [INFO] Using 'UTF-8' encoding to copy filtered resources.
[2019-12-02T06:35:33.962Z] [INFO] skip non existing resourceDirectory C:\Users\jenkins\AppData\Local\Temp\2\jenkins-maven-box-maven-surefire-cli-4@2\surefire-shared-utils\src\main\resources
[2019-12-02T06:35:33.962Z] [INFO] Copying 3 resources
[2019-12-02T06:35:33.962Z] [INFO]
[2019-12-02T06:35:33.962Z] [INFO] --- maven-compiler-plugin:3.7.0:compile (default-compile) @ surefire-shared-utils ---
[2019-12-02T06:35:33.962Z] [INFO] No sources to compile
[2019-12-02T06:35:33.962Z] [INFO]
[2019-12-02T06:35:33.962Z] [INFO] --- animal-sniffer-maven-plugin:1.17:check (signature-check) @ surefire-shared-utils ---
[2019-12-02T06:35:33.962Z] [INFO] Checking unresolved references to org.codehaus.mojo.signature:java17:1.0
[2019-12-02T06:35:33.962Z] [INFO]
[2019-12-02T06:35:33.962Z] [INFO] --- maven-resources-plugin:3.1.0:testResources (default-testResources) @ surefire-shared-utils ---
[2019-12-02T06:35:33.962Z] [INFO] Using 'UTF-8' encoding to copy filtered resources.
[2019-12-02T06:35:33.962Z] [INFO] skip non existing resourceDirectory C:\Users\jenkins\AppData\Local\Temp\2\jenkins-maven-box-maven-surefire-cli-4@2\surefire-shared-utils\src\test\resources
[2019-12-02T06:35:33.962Z] [INFO] Copying 3 resources
[2019-12-02T06:35:33.962Z] [INFO]
[2019-12-02T06:35:33.962Z] [INFO] --- maven-compiler-plugin:3.7.0:testCompile (default-testCompile) @ surefire-shared-utils ---
[2019-12-02T06:35:33.962Z] [INFO] No sources to compile
[2019-12-02T06:35:33.962Z] [INFO]
[2019-12-02T06:35:33.962Z] [INFO] --- maven-surefire-plugin:3.0.0-M3:test (default-test) @ surefire-shared-utils ---
[2019-12-02T06:35:33.962Z] [INFO]
[2019-12-02T06:35:33.962Z] [INFO] --- maven-jar-plugin:3.1.0:jar (default-jar) @ surefire-shared-utils ---
[2019-12-02T06:35:33.962Z] [INFO] Building jar: C:\Users\jenkins\AppData\Local\Temp\2\jenkins-maven-box-maven-surefire-cli-4@2\surefire-shared-utils\target\surefire-shared-utils-3.0.0-SNAPSHOT.jar
[2019-12-02T06:35:33.962Z] [INFO]
[2019-12-02T06:35:33.962Z] [INFO] --- maven-site-plugin:3.8.2:attach-descriptor (attach-descriptor) @ surefire-shared-utils ---
[2019-12-02T06:35:33.962Z] [INFO] Skipping because packaging 'jar' is not pom.
[2019-12-02T06:35:33.962Z] [INFO]
[2019-12-02T06:35:33.963Z] [INFO] --- maven-shade-plugin:3.1.1:shade (default) @ surefire-shared-utils ---
[2019-12-02T06:35:33.963Z] [INFO] Including org.apache.maven.shared:maven-shared-utils:jar:3.1.0 in the shaded jar.
[2019-12-02T06:35:33.963Z] [INFO] Including commons-io:commons-io:jar:2.6 in the shaded jar.
[2019-12-02T06:35:33.963Z] [INFO] Including org.apache.commons:commons-lang3:jar:3.8.1 in the shaded jar.
[2019-12-02T06:35:33.963Z] [INFO] Including org.apache.commons:commons-compress:jar:1.19 in the shaded jar.
[2019-12-02T06:35:33.963Z] [INFO] Including commons-codec:commons-codec:jar:1.11 in the shaded jar.
[2019-12-02T06:35:35.646Z] [INFO] Replacing original artifact with shaded artifact.
[2019-12-02T06:35:35.646Z] [INFO] Replacing C:\Users\jenkins\AppData\Local\Temp\2\jenkins-maven-box-maven-surefire-cli-4@2\surefire-shared-utils\target\surefire-shared-utils-3.0.0-SNAPSHOT.jar with C:\Users\jenkins\AppData\Local\Temp\2\jenkins-maven-box-maven-surefire-cli-4@2\surefire-shared-utils\target\surefire-shared-utils-3.0.0-SNAPSHOT-shaded.jar
[2019-12-02T06:35:35.646Z] [INFO] Dependency-reduced POM written at: C:\Users\jenkins\AppData\Local\Temp\2\jenkins-maven-box-maven-surefire-cli-4@2\surefire-shared-utils\dependency-reduced-pom.xml
[2019-12-02T06:35:35.646Z] [INFO]
[2019-12-02T06:35:35.646Z] [INFO] --- maven-checkstyle-plugin:3.0.0:check (checkstyle-check) @ surefire-shared-utils ---
[2019-12-02T06:35:35.646Z] [INFO]
[2019-12-02T06:35:35.646Z] [INFO] --- maven-install-plugin:2.5.2:install (default-install) @ surefire-shared-utils ---
[2019-12-02T06:35:35.646Z] [INFO] Installing C:\Users\jenkins\AppData\Local\Temp\2\jenkins-maven-box-maven-surefire-cli-4@2\surefire-shared-utils\target\surefire-shared-utils-3.0.0-SNAPSHOT.jar to C:\Users\jenkins\AppData\Local\Temp\2\jenkins-maven-box-maven-surefire-cli-4@2\.m2\org\apache\maven\surefire\surefire-shared-utils\3.0.0-SNAPSHOT\surefire-shared-utils-3.0.0-SNAPSHOT.jar
[2019-12-02T06:35:35.646Z] [INFO] Installing C:\Users\jenkins\AppData\Local\Temp\2\jenkins-maven-box-maven-surefire-cli-4@2\surefire-shared-utils\dependency-reduced-pom.xml to C:\Users\jenkins\AppData\Local\Temp\2\jenkins-maven-box-maven-surefire-cli-4@2\.m2\org\apache\maven\surefire\surefire-shared-utils\3.0.0-SNAPSHOT\surefire-shared-utils-3.0.0-SNAPSHOT.pom
[2019-12-02T06:35:35.646Z] [INFO] ------------------------------------------------------------------------
[2019-12-02T06:35:35.646Z] [INFO] Reactor Summary for Apache Maven Surefire 3.0.0-SNAPSHOT:
[2019-12-02T06:35:35.646Z] [INFO]
[2019-12-02T06:35:35.646Z] [INFO] Apache Maven Surefire .............................. SUCCESS [ 54.514 s]
[2019-12-02T06:35:35.646Z] [INFO] SureFire Logger API ................................ SUCCESS [ 20.552 s]
[2019-12-02T06:35:35.647Z] [INFO] SureFire API ....................................... SUCCESS [ 13.618 s]
[2019-12-02T06:35:35.647Z] [INFO] Surefire Extensions API ............................ SUCCESS [  3.297 s]
[2019-12-02T06:35:35.647Z] [INFO] SureFire Booter .................................... SUCCESS [ 14.598 s]
[2019-12-02T06:35:35.647Z] [INFO] Maven Surefire Test-Grouping Support ............... SUCCESS [  9.069 s]
[2019-12-02T06:35:35.647Z] [INFO] SureFire Providers ................................. SUCCESS [  1.253 s]
[2019-12-02T06:35:35.647Z] [INFO] Shared JUnit3 Provider Code ........................ SUCCESS [  5.249 s]
[2019-12-02T06:35:35.647Z] [INFO] Shared Java 5 Provider Base ........................ SUCCESS [  5.624 s]
[2019-12-02T06:35:35.647Z] [INFO] Shared JUnit4 Provider Code ........................ SUCCESS [  6.576 s]
[2019-12-02T06:35:35.647Z] [INFO] Shared JUnit48 Provider Code ....................... SUCCESS [  6.826 s]
[2019-12-02T06:35:35.647Z] [INFO] SureFire JUnit Runner .............................. SUCCESS [  5.441 s]
[2019-12-02T06:35:35.647Z] [INFO] SureFire JUnit4 Runner ............................. SUCCESS [ 35.417 s]
[2019-12-02T06:35:35.647Z] [INFO] Maven Surefire Common .............................. SUCCESS [ 45.689 s]
[2019-12-02T06:35:35.647Z] [INFO] SureFire JUnitCore Runner .......................... SUCCESS [02:18 min]
[2019-12-02T06:35:35.647Z] [INFO] SureFire JUnit Platform Runner ..................... SUCCESS [ 11.542 s]
[2019-12-02T06:35:35.647Z] [INFO] SureFire TestNG Utils .............................. SUCCESS [  5.061 s]
[2019-12-02T06:35:35.647Z] [INFO] SureFire TestNG Runner ............................. SUCCESS [  5.826 s]
[2019-12-02T06:35:35.647Z] [INFO] ShadeFire JUnit3 Provider .......................... SUCCESS [  2.338 s]
[2019-12-02T06:35:35.647Z] [INFO] Surefire Report Parser ............................. SUCCESS [  8.051 s]
[2019-12-02T06:35:35.647Z] [INFO] Maven Surefire Plugin .............................. SUCCESS [ 14.197 s]
[2019-12-02T06:35:35.647Z] [INFO] Maven Failsafe Plugin .............................. SUCCESS [01:28 min]
[2019-12-02T06:35:35.647Z] [INFO] Maven Surefire Report Plugin ....................... SUCCESS [ 18.941 s]
[2019-12-02T06:35:35.647Z] [INFO] Maven Surefire Integration Tests ................... SUCCESS [  01:10 h]
[2019-12-02T06:35:35.647Z] [INFO] Surefire Shared Utils .............................. SUCCESS [  3.573 s]
[2019-12-02T06:35:35.647Z] [INFO] ------------------------------------------------------------------------
[2019-12-02T06:35:35.647Z] [INFO] BUILD SUCCESS
[2019-12-02T06:35:35.647Z] [INFO] ------------------------------------------------------------------------
[2019-12-02T06:35:35.647Z] [INFO] Total time:  01:19 h
[2019-12-02T06:35:35.647Z] [INFO] Finished at: 2019-12-01T22:35:35-08:00
[2019-12-02T06:35:35.647Z] [INFO] ------------------------------------------------------------------------
[Pipeline] }
[Pipeline] // withEnv
[Pipeline] }
[Pipeline] // stage
[Pipeline] fileExists
[Pipeline] zip
[2019-12-02T06:35:35.827Z] Writing zip file of C:\Users\jenkins\AppData\Local\Temp\2\jenkins-maven-box-maven-surefire-cli-4@2\maven-failsafe-plugin\target\it to C:\Users\jenkins\AppData\Local\Temp\2\jenkins-maven-box-maven-surefire-cli-4@2\maven-failsafe-plugin--windows-jdk11-maven3.6.x.zip
[2019-12-02T06:35:35.917Z] Zipped 78 entries.
[2019-12-02T06:35:35.917Z] Archiving C:\Users\jenkins\AppData\Local\Temp\2\jenkins-maven-box-maven-surefire-cli-4@2\maven-failsafe-plugin--windows-jdk11-maven3.6.x.zip
[2019-12-02T06:35:35.918Z] [Fast Archiver] No artifacts from Maven TLP » maven-surefire » cli #2 to compare, so performing full copy of artifacts
[Pipeline] fileExists
[Pipeline] zip
[2019-12-02T06:35:36.021Z] Writing zip file of C:\Users\jenkins\AppData\Local\Temp\2\jenkins-maven-box-maven-surefire-cli-4@2\surefire-its\target to C:\Users\jenkins\AppData\Local\Temp\2\jenkins-maven-box-maven-surefire-cli-4@2\surefire-its--windows-jdk11-maven3.6.x.zip
[2019-12-02T06:35:41.127Z] Zipped 17120 entries.
[2019-12-02T06:35:41.127Z] Archiving C:\Users\jenkins\AppData\Local\Temp\2\jenkins-maven-box-maven-surefire-cli-4\surefire-its--windows-jdk13-maven3.6.x.zip
[2019-12-02T06:35:41.128Z] [Fast Archiver] No artifacts from Maven TLP » maven-surefire » cli #2 to compare, so performing full copy of artifacts
[Pipeline] archiveArtifacts
[2019-12-02T06:35:42.552Z] Archiving artifacts
[2019-12-02T06:35:42.562Z] [Fast Archiver] No artifacts from Maven TLP » maven-surefire » cli #2 to compare, so performing full copy of artifacts
[Pipeline] cleanWs
[2019-12-02T06:35:43.978Z] [WS-CLEANUP] Deleting project workspace...
[2019-12-02T06:35:43.978Z] [WS-CLEANUP] Deferred wipeout is used...
[2019-12-02T06:35:44.176Z] [WS-CLEANUP] done
[Pipeline] }
[Pipeline] // ws
[Pipeline] }
[Pipeline] // timestamps
[Pipeline] }
[Pipeline] // node
[Pipeline] }
[2019-12-02T06:35:54.018Z] Zipped 17128 entries.
[2019-12-02T06:35:54.018Z] Archiving C:\Users\jenkins\AppData\Local\Temp\2\jenkins-maven-box-maven-surefire-cli-4@2\surefire-its--windows-jdk11-maven3.6.x.zip
[2019-12-02T06:35:54.019Z] [Fast Archiver] No artifacts from Maven TLP » maven-surefire » cli #2 to compare, so performing full copy of artifacts
[Pipeline] archiveArtifacts
[2019-12-02T06:35:55.198Z] Archiving artifacts
[2019-12-02T06:35:55.454Z] [Fast Archiver] No artifacts from Maven TLP » maven-surefire » cli #2 to compare, so performing full copy of artifacts
[Pipeline] cleanWs
[2019-12-02T06:35:57.125Z] [WS-CLEANUP] Deleting project workspace...
[2019-12-02T06:35:57.125Z] [WS-CLEANUP] Deferred wipeout is used...
[2019-12-02T06:35:57.237Z] [WS-CLEANUP] done
[Pipeline] }
[Pipeline] // ws
[Pipeline] }
[Pipeline] // timestamps
[Pipeline] }
[Pipeline] // node
[Pipeline] }
[Pipeline] // parallel
[Pipeline] echo
Build result: FAILURE
[Pipeline] jiraIssueSelector
[Pipeline] echo
The authors of changes [tibordigana].
[Pipeline] echo
Sending email ...
[Pipeline] emailext
Reply | Threaded
Open this post in threaded view
|

Build succeeded in Jenkins: Maven TLP » maven-surefire » cli #5

Apache Jenkins Server-2
See https://builds.apache.org/job/maven-box/job/maven-surefire/job/cli/5/

Changes:

* experimenting with failed tests

All tests passed