Build failed in Jenkins: Maven TLP » maven-surefire » buildfix #3

classic Classic list List threaded Threaded
2 messages Options
Reply | Threaded
Open this post in threaded view
|

Build failed in Jenkins: Maven TLP » maven-surefire » buildfix #3

Apache Jenkins Server-2
See https://builds.apache.org/job/maven-box/job/maven-surefire/job/buildfix/3/

Changes:

* internal unit tests should use
* avoided surefire version 2.12.4 in IT logs
* generated settings.xml should be passed to the constructor of Verifier
* internal unit tests should use
* avoided surefire version 2.12.4 in IT logs
* generated settings.xml should be passed to the constructor of Verifier
* internal unit tests should use
* avoided surefire version 2.12.4 in IT logs
* generated settings.xml should be passed to the constructor of Verifier
* internal unit tests should use
* avoided surefire version 2.12.4 in IT logs
* generated settings.xml should be passed to the constructor of Verifier
* internal unit tests should use
* avoided surefire version 2.12.4 in IT logs
* generated settings.xml should be passed to the constructor of Verifier
* internal unit tests should use
* avoided surefire version 2.12.4 in IT logs
* generated settings.xml should be passed to the constructor of Verifier

2 tests failed.
FAILED:  junit.framework.JUnit4TestCaseFacade.shouldNotDuplicateSystemProperties

Error Message:
null

Stack Trace:
java.lang.ExceptionInInitializerError
        at org.apache.maven.surefire.its.fixture.MavenLauncherTest.shouldNotDuplicateSystemProperties(MavenLauncherTest.java:37)
        at java.base/jdk.internal.reflect.NativeMethodAccessorImpl.invoke0(Native Method)
        at java.base/jdk.internal.reflect.NativeMethodAccessorImpl.invoke(NativeMethodAccessorImpl.java:62)
        at java.base/jdk.internal.reflect.DelegatingMethodAccessorImpl.invoke(DelegatingMethodAccessorImpl.java:43)
        at java.base/java.lang.reflect.Method.invoke(Method.java:564)
        at org.junit.runners.model.FrameworkMethod$1.runReflectiveCall(FrameworkMethod.java:50)
        at org.junit.internal.runners.model.ReflectiveCallable.run(ReflectiveCallable.java:12)
        at org.junit.runners.model.FrameworkMethod.invokeExplosively(FrameworkMethod.java:47)
        at org.junit.internal.runners.statements.InvokeMethod.evaluate(InvokeMethod.java:17)
        at org.junit.runners.ParentRunner.runLeaf(ParentRunner.java:325)
        at org.junit.runners.BlockJUnit4ClassRunner.runChild(BlockJUnit4ClassRunner.java:78)
        at org.junit.runners.BlockJUnit4ClassRunner.runChild(BlockJUnit4ClassRunner.java:57)
        at org.junit.runners.ParentRunner$3.run(ParentRunner.java:290)
        at org.junit.runners.ParentRunner$1.schedule(ParentRunner.java:71)
        at org.junit.runners.ParentRunner.runChildren(ParentRunner.java:288)
        at org.junit.runners.ParentRunner.access$000(ParentRunner.java:58)
        at org.junit.runners.ParentRunner$2.evaluate(ParentRunner.java:268)
        at org.junit.runners.ParentRunner.run(ParentRunner.java:363)
        at org.junit.runners.Suite.runChild(Suite.java:128)
        at org.junit.runners.Suite.runChild(Suite.java:27)
        at org.junit.runners.ParentRunner$3.run(ParentRunner.java:290)
        at org.junit.runners.ParentRunner$1.schedule(ParentRunner.java:71)
        at org.junit.runners.ParentRunner.runChildren(ParentRunner.java:288)
        at org.junit.runners.ParentRunner.access$000(ParentRunner.java:58)
        at org.junit.runners.ParentRunner$2.evaluate(ParentRunner.java:268)
        at org.junit.runners.ParentRunner.run(ParentRunner.java:363)
        at junit.framework.JUnit4TestAdapter.run(JUnit4TestAdapter.java:38)
        at java.base/jdk.internal.reflect.NativeMethodAccessorImpl.invoke0(Native Method)
        at java.base/jdk.internal.reflect.NativeMethodAccessorImpl.invoke(NativeMethodAccessorImpl.java:62)
        at java.base/jdk.internal.reflect.DelegatingMethodAccessorImpl.invoke(DelegatingMethodAccessorImpl.java:43)
        at java.base/java.lang.reflect.Method.invoke(Method.java:564)
        at org.apache.maven.surefire.shadefire.junit.JUnitTestSet.execute(JUnitTestSet.java:95)
        at org.apache.maven.surefire.shadefire.junit.JUnit3Provider.executeTestSet(JUnit3Provider.java:121)
        at org.apache.maven.surefire.shadefire.junit.JUnit3Provider.invoke(JUnit3Provider.java:98)
        at java.base/jdk.internal.reflect.NativeMethodAccessorImpl.invoke0(Native Method)
        at java.base/jdk.internal.reflect.NativeMethodAccessorImpl.invoke(NativeMethodAccessorImpl.java:62)
        at java.base/jdk.internal.reflect.DelegatingMethodAccessorImpl.invoke(DelegatingMethodAccessorImpl.java:43)
        at java.base/java.lang.reflect.Method.invoke(Method.java:564)
        at org.apache.maven.surefire.shadefire.util.ReflectionUtils.invokeMethodWithArray(ReflectionUtils.java:189)
        at org.apache.maven.surefire.shadefire.booter.ProviderFactory$ProviderProxy.invoke(ProviderFactory.java:165)
        at org.apache.maven.surefire.shadefire.booter.ProviderFactory.invokeProvider(ProviderFactory.java:85)
        at org.apache.maven.surefire.shadefire.booter.ForkedBooter.runSuitesInProcess(ForkedBooter.java:103)
        at org.apache.maven.surefire.shadefire.booter.ForkedBooter.main(ForkedBooter.java:74)
Caused by: java.lang.NullPointerException
        at java.base/java.io.File.<init>(File.java:276)
        at org.apache.maven.surefire.its.fixture.MavenLauncher.settingsXmlPath(MavenLauncher.java:470)
        at org.apache.maven.surefire.its.fixture.MavenLauncher.<clinit>(MavenLauncher.java:46)
        ... 43 more
Caused by: java.lang.NullPointerException
        at java.base/java.io.File.<init>(File.java:276)
        at org.apache.maven.surefire.its.fixture.MavenLauncher.settingsXmlPath(MavenLauncher.java:470)
        at org.apache.maven.surefire.its.fixture.MavenLauncher.<clinit>(MavenLauncher.java:46)
        ... 43 more


FAILED:  junit.framework.JUnit4TestCaseFacade.launcherGetsProperMethodName

Error Message:
Could not initialize class org.apache.maven.surefire.its.fixture.MavenLauncher

Stack Trace:
java.lang.NoClassDefFoundError: Could not initialize class org.apache.maven.surefire.its.fixture.MavenLauncher
        at org.apache.maven.surefire.its.fixture.SurefireLauncherTest.launcherGetsProperMethodName(SurefireLauncherTest.java:34)
        at java.base/jdk.internal.reflect.NativeMethodAccessorImpl.invoke0(Native Method)
        at java.base/jdk.internal.reflect.NativeMethodAccessorImpl.invoke(NativeMethodAccessorImpl.java:62)
        at java.base/jdk.internal.reflect.DelegatingMethodAccessorImpl.invoke(DelegatingMethodAccessorImpl.java:43)
        at java.base/java.lang.reflect.Method.invoke(Method.java:564)
        at org.junit.runners.model.FrameworkMethod$1.runReflectiveCall(FrameworkMethod.java:50)
        at org.junit.internal.runners.model.ReflectiveCallable.run(ReflectiveCallable.java:12)
        at org.junit.runners.model.FrameworkMethod.invokeExplosively(FrameworkMethod.java:47)
        at org.junit.internal.runners.statements.InvokeMethod.evaluate(InvokeMethod.java:17)
        at org.junit.runners.ParentRunner.runLeaf(ParentRunner.java:325)
        at org.junit.runners.BlockJUnit4ClassRunner.runChild(BlockJUnit4ClassRunner.java:78)
        at org.junit.runners.BlockJUnit4ClassRunner.runChild(BlockJUnit4ClassRunner.java:57)
        at org.junit.runners.ParentRunner$3.run(ParentRunner.java:290)
        at org.junit.runners.ParentRunner$1.schedule(ParentRunner.java:71)
        at org.junit.runners.ParentRunner.runChildren(ParentRunner.java:288)
        at org.junit.runners.ParentRunner.access$000(ParentRunner.java:58)
        at org.junit.runners.ParentRunner$2.evaluate(ParentRunner.java:268)
        at org.junit.runners.ParentRunner.run(ParentRunner.java:363)
        at org.junit.runners.Suite.runChild(Suite.java:128)
        at org.junit.runners.Suite.runChild(Suite.java:27)
        at org.junit.runners.ParentRunner$3.run(ParentRunner.java:290)
        at org.junit.runners.ParentRunner$1.schedule(ParentRunner.java:71)
        at org.junit.runners.ParentRunner.runChildren(ParentRunner.java:288)
        at org.junit.runners.ParentRunner.access$000(ParentRunner.java:58)
        at org.junit.runners.ParentRunner$2.evaluate(ParentRunner.java:268)
        at org.junit.runners.ParentRunner.run(ParentRunner.java:363)
        at junit.framework.JUnit4TestAdapter.run(JUnit4TestAdapter.java:38)
        at java.base/jdk.internal.reflect.NativeMethodAccessorImpl.invoke0(Native Method)
        at java.base/jdk.internal.reflect.NativeMethodAccessorImpl.invoke(NativeMethodAccessorImpl.java:62)
        at java.base/jdk.internal.reflect.DelegatingMethodAccessorImpl.invoke(DelegatingMethodAccessorImpl.java:43)
        at java.base/java.lang.reflect.Method.invoke(Method.java:564)
        at org.apache.maven.surefire.shadefire.junit.JUnitTestSet.execute(JUnitTestSet.java:95)
        at org.apache.maven.surefire.shadefire.junit.JUnit3Provider.executeTestSet(JUnit3Provider.java:121)
        at org.apache.maven.surefire.shadefire.junit.JUnit3Provider.invoke(JUnit3Provider.java:98)
        at java.base/jdk.internal.reflect.NativeMethodAccessorImpl.invoke0(Native Method)
        at java.base/jdk.internal.reflect.NativeMethodAccessorImpl.invoke(NativeMethodAccessorImpl.java:62)
        at java.base/jdk.internal.reflect.DelegatingMethodAccessorImpl.invoke(DelegatingMethodAccessorImpl.java:43)
        at java.base/java.lang.reflect.Method.invoke(Method.java:564)
        at org.apache.maven.surefire.shadefire.util.ReflectionUtils.invokeMethodWithArray(ReflectionUtils.java:189)
        at org.apache.maven.surefire.shadefire.booter.ProviderFactory$ProviderProxy.invoke(ProviderFactory.java:165)
        at org.apache.maven.surefire.shadefire.booter.ProviderFactory.invokeProvider(ProviderFactory.java:85)
        at org.apache.maven.surefire.shadefire.booter.ForkedBooter.runSuitesInProcess(ForkedBooter.java:103)
        at org.apache.maven.surefire.shadefire.booter.ForkedBooter.main(ForkedBooter.java:74)




Build log:
[...truncated 15.12 MB...]
[windows-jdk7-maven3.5.x] at org.apache.maven.surefire.its.fixture.MavenLauncherTest.shouldNotDuplicateSystemProperties(MavenLauncherTest.java:37)
[windows-jdk7-maven3.5.x] at sun.reflect.NativeMethodAccessorImpl.invoke0(Native Method)
[windows-jdk7-maven3.5.x] at sun.reflect.NativeMethodAccessorImpl.invoke(NativeMethodAccessorImpl.java:57)
[windows-jdk7-maven3.5.x] at sun.reflect.DelegatingMethodAccessorImpl.invoke(DelegatingMethodAccessorImpl.java:43)
[windows-jdk7-maven3.5.x] at java.lang.reflect.Method.invoke(Method.java:606)
[windows-jdk7-maven3.5.x] at org.junit.runners.model.FrameworkMethod$1.runReflectiveCall(FrameworkMethod.java:50)
[windows-jdk7-maven3.5.x] at org.junit.internal.runners.model.ReflectiveCallable.run(ReflectiveCallable.java:12)
[windows-jdk7-maven3.5.x] at org.junit.runners.model.FrameworkMethod.invokeExplosively(FrameworkMethod.java:47)
[windows-jdk7-maven3.5.x] at org.junit.internal.runners.statements.InvokeMethod.evaluate(InvokeMethod.java:17)
[windows-jdk7-maven3.5.x] at org.junit.runners.ParentRunner.runLeaf(ParentRunner.java:325)
[windows-jdk7-maven3.5.x] at org.junit.runners.BlockJUnit4ClassRunner.runChild(BlockJUnit4ClassRunner.java:78)
[windows-jdk7-maven3.5.x] at org.junit.runners.BlockJUnit4ClassRunner.runChild(BlockJUnit4ClassRunner.java:57)
[windows-jdk7-maven3.5.x] at org.junit.runners.ParentRunner$3.run(ParentRunner.java:290)
[windows-jdk7-maven3.5.x] at org.junit.runners.ParentRunner$1.schedule(ParentRunner.java:71)
[windows-jdk7-maven3.5.x] at org.junit.runners.ParentRunner.runChildren(ParentRunner.java:288)
[windows-jdk7-maven3.5.x] at org.junit.runners.ParentRunner.access$000(ParentRunner.java:58)
[windows-jdk7-maven3.5.x] at org.junit.runners.ParentRunner$2.evaluate(ParentRunner.java:268)
[windows-jdk7-maven3.5.x] at org.junit.runners.ParentRunner.run(ParentRunner.java:363)
[windows-jdk7-maven3.5.x] at org.junit.runners.Suite.runChild(Suite.java:128)
[windows-jdk7-maven3.5.x] at org.junit.runners.Suite.runChild(Suite.java:27)
[windows-jdk7-maven3.5.x] at org.junit.runners.ParentRunner$3.run(ParentRunner.java:290)
[windows-jdk7-maven3.5.x] at org.junit.runners.ParentRunner$1.schedule(ParentRunner.java:71)
[windows-jdk7-maven3.5.x] at org.junit.runners.ParentRunner.runChildren(ParentRunner.java:288)
[windows-jdk7-maven3.5.x] at org.junit.runners.ParentRunner.access$000(ParentRunner.java:58)
[windows-jdk7-maven3.5.x] at org.junit.runners.ParentRunner$2.evaluate(ParentRunner.java:268)
[windows-jdk7-maven3.5.x] at org.junit.runners.ParentRunner.run(ParentRunner.java:363)
[windows-jdk7-maven3.5.x] at junit.framework.JUnit4TestAdapter.run(JUnit4TestAdapter.java:38)
[windows-jdk7-maven3.5.x] at sun.reflect.NativeMethodAccessorImpl.invoke0(Native Method)
[windows-jdk7-maven3.5.x] at sun.reflect.NativeMethodAccessorImpl.invoke(NativeMethodAccessorImpl.java:57)
[windows-jdk7-maven3.5.x] at sun.reflect.DelegatingMethodAccessorImpl.invoke(DelegatingMethodAccessorImpl.java:43)
[windows-jdk7-maven3.5.x] at java.lang.reflect.Method.invoke(Method.java:606)
[windows-jdk7-maven3.5.x] at org.apache.maven.surefire.shadefire.junit.JUnitTestSet.execute(JUnitTestSet.java:95)
[windows-jdk7-maven3.5.x] at org.apache.maven.surefire.shadefire.junit.JUnit3Provider.executeTestSet(JUnit3Provider.java:121)
[windows-jdk7-maven3.5.x] at org.apache.maven.surefire.shadefire.junit.JUnit3Provider.invoke(JUnit3Provider.java:98)
[windows-jdk7-maven3.5.x] at sun.reflect.NativeMethodAccessorImpl.invoke0(Native Method)
[windows-jdk7-maven3.5.x] at sun.reflect.NativeMethodAccessorImpl.invoke(NativeMethodAccessorImpl.java:57)
[windows-jdk7-maven3.5.x] at sun.reflect.DelegatingMethodAccessorImpl.invoke(DelegatingMethodAccessorImpl.java:43)
[windows-jdk7-maven3.5.x] at java.lang.reflect.Method.invoke(Method.java:606)
[windows-jdk7-maven3.5.x] at org.apache.maven.surefire.shadefire.util.ReflectionUtils.invokeMethodWithArray(ReflectionUtils.java:189)
[windows-jdk7-maven3.5.x] at org.apache.maven.surefire.shadefire.booter.ProviderFactory$ProviderProxy.invoke(ProviderFactory.java:165)
[windows-jdk7-maven3.5.x] at org.apache.maven.surefire.shadefire.booter.ProviderFactory.invokeProvider(ProviderFactory.java:85)
[windows-jdk7-maven3.5.x] at org.apache.maven.surefire.shadefire.booter.ForkedBooter.runSuitesInProcess(ForkedBooter.java:103)
[windows-jdk7-maven3.5.x] at org.apache.maven.surefire.shadefire.booter.ForkedBooter.main(ForkedBooter.java:74)
[windows-jdk7-maven3.5.x] Caused by: java.lang.NullPointerException
[windows-jdk7-maven3.5.x] at java.io.File.<init>(File.java:277)
[windows-jdk7-maven3.5.x] at org.apache.maven.surefire.its.fixture.MavenLauncher.settingsXmlPath(MavenLauncher.java:470)
[windows-jdk7-maven3.5.x] at org.apache.maven.surefire.its.fixture.MavenLauncher.<clinit>(MavenLauncher.java:46)
[windows-jdk7-maven3.5.x] ... 43 more
[windows-jdk7-maven3.5.x] Caused by: java.lang.NullPointerException
[windows-jdk7-maven3.5.x] at java.io.File.<init>(File.java:277)
[windows-jdk7-maven3.5.x] at org.apache.maven.surefire.its.fixture.MavenLauncher.settingsXmlPath(MavenLauncher.java:470)
[windows-jdk7-maven3.5.x] at org.apache.maven.surefire.its.fixture.MavenLauncher.<clinit>(MavenLauncher.java:46)
[windows-jdk7-maven3.5.x] ... 43 more
[windows-jdk7-maven3.5.x]
[windows-jdk7-maven3.5.x] launcherGetsProperMethodName(org.apache.maven.surefire.its.fixture.SurefireLauncherTest)  Time elapsed: 0.001 sec  <<< ERROR!
[windows-jdk7-maven3.5.x] java.lang.NoClassDefFoundError: Could not initialize class org.apache.maven.surefire.its.fixture.MavenLauncher
[windows-jdk7-maven3.5.x] at org.apache.maven.surefire.its.fixture.SurefireLauncherTest.launcherGetsProperMethodName(SurefireLauncherTest.java:34)
[windows-jdk7-maven3.5.x] at sun.reflect.NativeMethodAccessorImpl.invoke0(Native Method)
[windows-jdk7-maven3.5.x] at sun.reflect.NativeMethodAccessorImpl.invoke(NativeMethodAccessorImpl.java:57)
[windows-jdk7-maven3.5.x] at sun.reflect.DelegatingMethodAccessorImpl.invoke(DelegatingMethodAccessorImpl.java:43)
[windows-jdk7-maven3.5.x] at java.lang.reflect.Method.invoke(Method.java:606)
[windows-jdk7-maven3.5.x] at org.junit.runners.model.FrameworkMethod$1.runReflectiveCall(FrameworkMethod.java:50)
[windows-jdk7-maven3.5.x] at org.junit.internal.runners.model.ReflectiveCallable.run(ReflectiveCallable.java:12)
[windows-jdk7-maven3.5.x] at org.junit.runners.model.FrameworkMethod.invokeExplosively(FrameworkMethod.java:47)
[windows-jdk7-maven3.5.x] at org.junit.internal.runners.statements.InvokeMethod.evaluate(InvokeMethod.java:17)
[windows-jdk7-maven3.5.x] at org.junit.runners.ParentRunner.runLeaf(ParentRunner.java:325)
[windows-jdk7-maven3.5.x] at org.junit.runners.BlockJUnit4ClassRunner.runChild(BlockJUnit4ClassRunner.java:78)
[windows-jdk7-maven3.5.x] at org.junit.runners.BlockJUnit4ClassRunner.runChild(BlockJUnit4ClassRunner.java:57)
[windows-jdk7-maven3.5.x] at org.junit.runners.ParentRunner$3.run(ParentRunner.java:290)
[windows-jdk7-maven3.5.x] at org.junit.runners.ParentRunner$1.schedule(ParentRunner.java:71)
[windows-jdk7-maven3.5.x] at org.junit.runners.ParentRunner.runChildren(ParentRunner.java:288)
[windows-jdk7-maven3.5.x] at org.junit.runners.ParentRunner.access$000(ParentRunner.java:58)
[windows-jdk7-maven3.5.x] at org.junit.runners.ParentRunner$2.evaluate(ParentRunner.java:268)
[windows-jdk7-maven3.5.x] at org.junit.runners.ParentRunner.run(ParentRunner.java:363)
[windows-jdk7-maven3.5.x] at org.junit.runners.Suite.runChild(Suite.java:128)
[windows-jdk7-maven3.5.x] at org.junit.runners.Suite.runChild(Suite.java:27)
[windows-jdk7-maven3.5.x] at org.junit.runners.ParentRunner$3.run(ParentRunner.java:290)
[windows-jdk7-maven3.5.x] at org.junit.runners.ParentRunner$1.schedule(ParentRunner.java:71)
[windows-jdk7-maven3.5.x] at org.junit.runners.ParentRunner.runChildren(ParentRunner.java:288)
[windows-jdk7-maven3.5.x] at org.junit.runners.ParentRunner.access$000(ParentRunner.java:58)
[windows-jdk7-maven3.5.x] at org.junit.runners.ParentRunner$2.evaluate(ParentRunner.java:268)
[windows-jdk7-maven3.5.x] at org.junit.runners.ParentRunner.run(ParentRunner.java:363)
[windows-jdk7-maven3.5.x] at junit.framework.JUnit4TestAdapter.run(JUnit4TestAdapter.java:38)
[windows-jdk7-maven3.5.x] at sun.reflect.NativeMethodAccessorImpl.invoke0(Native Method)
[windows-jdk7-maven3.5.x] at sun.reflect.NativeMethodAccessorImpl.invoke(NativeMethodAccessorImpl.java:57)
[windows-jdk7-maven3.5.x] at sun.reflect.DelegatingMethodAccessorImpl.invoke(DelegatingMethodAccessorImpl.java:43)
[windows-jdk7-maven3.5.x] at java.lang.reflect.Method.invoke(Method.java:606)
[windows-jdk7-maven3.5.x] at org.apache.maven.surefire.shadefire.junit.JUnitTestSet.execute(JUnitTestSet.java:95)
[windows-jdk7-maven3.5.x] at org.apache.maven.surefire.shadefire.junit.JUnit3Provider.executeTestSet(JUnit3Provider.java:121)
[windows-jdk7-maven3.5.x] at org.apache.maven.surefire.shadefire.junit.JUnit3Provider.invoke(JUnit3Provider.java:98)
[windows-jdk7-maven3.5.x] at sun.reflect.NativeMethodAccessorImpl.invoke0(Native Method)
[windows-jdk7-maven3.5.x] at sun.reflect.NativeMethodAccessorImpl.invoke(NativeMethodAccessorImpl.java:57)
[windows-jdk7-maven3.5.x] at sun.reflect.DelegatingMethodAccessorImpl.invoke(DelegatingMethodAccessorImpl.java:43)
[windows-jdk7-maven3.5.x] at java.lang.reflect.Method.invoke(Method.java:606)
[windows-jdk7-maven3.5.x] at org.apache.maven.surefire.shadefire.util.ReflectionUtils.invokeMethodWithArray(ReflectionUtils.java:189)
[windows-jdk7-maven3.5.x] at org.apache.maven.surefire.shadefire.booter.ProviderFactory$ProviderProxy.invoke(ProviderFactory.java:165)
[windows-jdk7-maven3.5.x] at org.apache.maven.surefire.shadefire.booter.ProviderFactory.invokeProvider(ProviderFactory.java:85)
[windows-jdk7-maven3.5.x] at org.apache.maven.surefire.shadefire.booter.ForkedBooter.runSuitesInProcess(ForkedBooter.java:103)
[windows-jdk7-maven3.5.x] at org.apache.maven.surefire.shadefire.booter.ForkedBooter.main(ForkedBooter.java:74)
[windows-jdk7-maven3.5.x]
[windows-jdk7-maven3.5.x]
[windows-jdk7-maven3.5.x] Results :
[windows-jdk7-maven3.5.x]
[windows-jdk7-maven3.5.x] Tests in error:
[windows-jdk7-maven3.5.x]   shouldNotDuplicateSystemProperties(org.apache.maven.surefire.its.fixture.MavenLauncherTest)
[windows-jdk7-maven3.5.x]   launcherGetsProperMethodName(org.apache.maven.surefire.its.fixture.SurefireLauncherTest): Could not initialize class org.apache.maven.surefire.its.fixture.MavenLauncher
[windows-jdk7-maven3.5.x]
[windows-jdk7-maven3.5.x] Tests run: 2, Failures: 0, Errors: 2, Skipped: 0
[windows-jdk7-maven3.5.x]
[windows-jdk7-maven3.5.x] [INFO] ------------------------------------------------------------------------
[windows-jdk7-maven3.5.x] [INFO] Reactor Summary:
[windows-jdk7-maven3.5.x] [INFO]
[windows-jdk7-maven3.5.x] [INFO] Apache Maven Surefire .............................. SUCCESS [ 36.368 s]
[windows-jdk7-maven3.5.x] [INFO] SureFire Logger API ................................ SUCCESS [  8.294 s]
[windows-jdk7-maven3.5.x] [INFO] SureFire API ....................................... SUCCESS [ 15.266 s]
[windows-jdk7-maven3.5.x] [INFO] ShadeFire JUnit3 Provider .......................... SUCCESS [  1.867 s]
[windows-jdk7-maven3.5.x] [INFO] SureFire Booter .................................... SUCCESS [ 15.040 s]
[windows-jdk7-maven3.5.x] [INFO] Maven Surefire Test-Grouping Support ............... SUCCESS [  8.710 s]
[windows-jdk7-maven3.5.x] [INFO] SureFire Providers ................................. SUCCESS [  1.464 s]
[windows-jdk7-maven3.5.x] [INFO] Shared JUnit3 Provider Code ........................ SUCCESS [  4.684 s]
[windows-jdk7-maven3.5.x] [INFO] Shared Java 5 Provider Base ........................ SUCCESS [  5.918 s]
[windows-jdk7-maven3.5.x] [INFO] Shared JUnit4 Provider Code ........................ SUCCESS [  6.186 s]
[windows-jdk7-maven3.5.x] [INFO] Shared JUnit48 Provider Code ....................... SUCCESS [  6.772 s]
[windows-jdk7-maven3.5.x] [INFO] SureFire JUnit Runner .............................. SUCCESS [  5.399 s]
[windows-jdk7-maven3.5.x] [INFO] SureFire JUnit4 Runner ............................. SUCCESS [  5.790 s]
[windows-jdk7-maven3.5.x] [INFO] Maven Surefire Common .............................. SUCCESS [ 33.294 s]
[windows-jdk7-maven3.5.x] [INFO] SureFire JUnitCore Runner .......................... SUCCESS [02:16 min]
[windows-jdk7-maven3.5.x] [INFO] SureFire JUnit Platform Runner ..................... SUCCESS [  9.519 s]
[windows-jdk7-maven3.5.x] [INFO] SureFire TestNG Utils .............................. SUCCESS [  5.850 s]
[windows-jdk7-maven3.5.x] [INFO] SureFire TestNG Runner ............................. SUCCESS [  6.435 s]
[windows-jdk7-maven3.5.x] [INFO] Surefire Report Parser ............................. SUCCESS [  6.797 s]
[windows-jdk7-maven3.5.x] [INFO] Maven Surefire Plugin .............................. SUCCESS [ 13.617 s]
[windows-jdk7-maven3.5.x] [INFO] Maven Failsafe Plugin .............................. SUCCESS [01:32 min]
[windows-jdk7-maven3.5.x] [INFO] Maven Surefire Report Plugin ....................... SUCCESS [ 17.812 s]
[windows-jdk7-maven3.5.x] [INFO] Maven Surefire Integration Tests ................... FAILURE [ 25.504 s]
[windows-jdk7-maven3.5.x] [INFO] ------------------------------------------------------------------------
[windows-jdk7-maven3.5.x] [INFO] BUILD FAILURE
[windows-jdk7-maven3.5.x] [INFO] ------------------------------------------------------------------------
[windows-jdk7-maven3.5.x] [INFO] Total time: 07:51 min
[windows-jdk7-maven3.5.x] [INFO] Finished at: 2018-11-03T23:17:22-07:00
[windows-jdk7-maven3.5.x] [INFO] Final Memory: 52M/173M
[windows-jdk7-maven3.5.x] [INFO] ------------------------------------------------------------------------
[windows-jdk7-maven3.5.x] [ERROR] Failed to execute goal org.apache.maven.plugins:maven-surefire-plugin:2.12.4:test (default-test) on project surefire-its: There are test failures.
[windows-jdk7-maven3.5.x] [ERROR]
[windows-jdk7-maven3.5.x] [ERROR] Please refer to F:\jenkins\jenkins-slave\workspace\box_maven-surefire_buildfix-2YF32ZKQCHGNFXQRDDTWVZ7SNH24TIULHNPEEYX5TSMYSM7X5D3Q\surefire-its\target\surefire-reports for the individual test results.
[windows-jdk7-maven3.5.x] [ERROR] -> [Help 1]
[windows-jdk7-maven3.5.x] org.apache.maven.lifecycle.LifecycleExecutionException: Failed to execute goal org.apache.maven.plugins:maven-surefire-plugin:2.12.4:test (default-test) on project surefire-its: There are test failures.
[windows-jdk7-maven3.5.x]
[windows-jdk7-maven3.5.x] Please refer to F:\jenkins\jenkins-slave\workspace\box_maven-surefire_buildfix-2YF32ZKQCHGNFXQRDDTWVZ7SNH24TIULHNPEEYX5TSMYSM7X5D3Q\surefire-its\target\surefire-reports for the individual test results.
[windows-jdk7-maven3.5.x]     at org.apache.maven.lifecycle.internal.MojoExecutor.execute (MojoExecutor.java:213)
[windows-jdk7-maven3.5.x]     at org.apache.maven.lifecycle.internal.MojoExecutor.execute (MojoExecutor.java:154)
[windows-jdk7-maven3.5.x]     at org.apache.maven.lifecycle.internal.MojoExecutor.execute (MojoExecutor.java:146)
[windows-jdk7-maven3.5.x]     at org.apache.maven.lifecycle.internal.LifecycleModuleBuilder.buildProject (LifecycleModuleBuilder.java:117)
[windows-jdk7-maven3.5.x]     at org.apache.maven.lifecycle.internal.LifecycleModuleBuilder.buildProject (LifecycleModuleBuilder.java:81)
[windows-jdk7-maven3.5.x]     at org.apache.maven.lifecycle.internal.builder.singlethreaded.SingleThreadedBuilder.build (SingleThreadedBuilder.java:51)
[windows-jdk7-maven3.5.x]     at org.apache.maven.lifecycle.internal.LifecycleStarter.execute (LifecycleStarter.java:128)
[windows-jdk7-maven3.5.x]     at org.apache.maven.DefaultMaven.doExecute (DefaultMaven.java:309)
[windows-jdk7-maven3.5.x]     at org.apache.maven.DefaultMaven.doExecute (DefaultMaven.java:194)
[windows-jdk7-maven3.5.x]     at org.apache.maven.DefaultMaven.execute (DefaultMaven.java:107)
[windows-jdk7-maven3.5.x]     at org.apache.maven.cli.MavenCli.execute (MavenCli.java:955)
[windows-jdk7-maven3.5.x]     at org.apache.maven.cli.MavenCli.doMain (MavenCli.java:290)
[windows-jdk7-maven3.5.x]     at org.apache.maven.cli.MavenCli.main (MavenCli.java:194)
[windows-jdk7-maven3.5.x]     at sun.reflect.NativeMethodAccessorImpl.invoke0 (Native Method)
[windows-jdk7-maven3.5.x]     at sun.reflect.NativeMethodAccessorImpl.invoke (NativeMethodAccessorImpl.java:62)
[windows-jdk7-maven3.5.x]     at sun.reflect.DelegatingMethodAccessorImpl.invoke (DelegatingMethodAccessorImpl.java:43)
[windows-jdk7-maven3.5.x]     at java.lang.reflect.Method.invoke (Method.java:498)
[windows-jdk7-maven3.5.x]     at org.codehaus.plexus.classworlds.launcher.Launcher.launchEnhanced (Launcher.java:289)
[windows-jdk7-maven3.5.x]     at org.codehaus.plexus.classworlds.launcher.Launcher.launch (Launcher.java:229)
[windows-jdk7-maven3.5.x]     at org.codehaus.plexus.classworlds.launcher.Launcher.mainWithExitCode (Launcher.java:415)
[windows-jdk7-maven3.5.x]     at org.codehaus.plexus.classworlds.launcher.Launcher.main (Launcher.java:356)
[windows-jdk7-maven3.5.x] Caused by: org.apache.maven.plugin.MojoFailureException: There are test failures.
[windows-jdk7-maven3.5.x]
[windows-jdk7-maven3.5.x] Please refer to F:\jenkins\jenkins-slave\workspace\box_maven-surefire_buildfix-2YF32ZKQCHGNFXQRDDTWVZ7SNH24TIULHNPEEYX5TSMYSM7X5D3Q\surefire-its\target\surefire-reports for the individual test results.
[windows-jdk7-maven3.5.x]     at org.apache.maven.plugin.surefire.SurefireHelper.reportExecution (SurefireHelper.java:83)
[windows-jdk7-maven3.5.x]     at org.apache.maven.plugin.surefire.SurefirePlugin.writeSummary (SurefirePlugin.java:176)
[windows-jdk7-maven3.5.x]     at org.apache.maven.plugin.surefire.SurefirePlugin.handleSummary (SurefirePlugin.java:150)
[windows-jdk7-maven3.5.x]     at org.apache.maven.plugin.surefire.AbstractSurefireMojo.executeAfterPreconditionsChecked (AbstractSurefireMojo.java:650)
[windows-jdk7-maven3.5.x]     at org.apache.maven.plugin.surefire.AbstractSurefireMojo.execute (AbstractSurefireMojo.java:586)
[windows-jdk7-maven3.5.x]     at org.apache.maven.plugin.DefaultBuildPluginManager.executeMojo (DefaultBuildPluginManager.java:134)
[windows-jdk7-maven3.5.x]     at org.apache.maven.lifecycle.internal.MojoExecutor.execute (MojoExecutor.java:208)
[windows-jdk7-maven3.5.x]     at org.apache.maven.lifecycle.internal.MojoExecutor.execute (MojoExecutor.java:154)
[windows-jdk7-maven3.5.x]     at org.apache.maven.lifecycle.internal.MojoExecutor.execute (MojoExecutor.java:146)
[windows-jdk7-maven3.5.x]     at org.apache.maven.lifecycle.internal.LifecycleModuleBuilder.buildProject (LifecycleModuleBuilder.java:117)
[windows-jdk7-maven3.5.x]     at org.apache.maven.lifecycle.internal.LifecycleModuleBuilder.buildProject (LifecycleModuleBuilder.java:81)
[windows-jdk7-maven3.5.x]     at org.apache.maven.lifecycle.internal.builder.singlethreaded.SingleThreadedBuilder.build (SingleThreadedBuilder.java:51)
[windows-jdk7-maven3.5.x]     at org.apache.maven.lifecycle.internal.LifecycleStarter.execute (LifecycleStarter.java:128)
[windows-jdk7-maven3.5.x]     at org.apache.maven.DefaultMaven.doExecute (DefaultMaven.java:309)
[windows-jdk7-maven3.5.x]     at org.apache.maven.DefaultMaven.doExecute (DefaultMaven.java:194)
[windows-jdk7-maven3.5.x]     at org.apache.maven.DefaultMaven.execute (DefaultMaven.java:107)
[windows-jdk7-maven3.5.x]     at org.apache.maven.cli.MavenCli.execute (MavenCli.java:955)
[windows-jdk7-maven3.5.x]     at org.apache.maven.cli.MavenCli.doMain (MavenCli.java:290)
[windows-jdk7-maven3.5.x]     at org.apache.maven.cli.MavenCli.main (MavenCli.java:194)
[windows-jdk7-maven3.5.x]     at sun.reflect.NativeMethodAccessorImpl.invoke0 (Native Method)
[windows-jdk7-maven3.5.x]     at sun.reflect.NativeMethodAccessorImpl.invoke (NativeMethodAccessorImpl.java:62)
[windows-jdk7-maven3.5.x]     at sun.reflect.DelegatingMethodAccessorImpl.invoke (DelegatingMethodAccessorImpl.java:43)
[windows-jdk7-maven3.5.x]     at java.lang.reflect.Method.invoke (Method.java:498)
[windows-jdk7-maven3.5.x]     at org.codehaus.plexus.classworlds.launcher.Launcher.launchEnhanced (Launcher.java:289)
[windows-jdk7-maven3.5.x]     at org.codehaus.plexus.classworlds.launcher.Launcher.launch (Launcher.java:229)
[windows-jdk7-maven3.5.x]     at org.codehaus.plexus.classworlds.launcher.Launcher.mainWithExitCode (Launcher.java:415)
[windows-jdk7-maven3.5.x]     at org.codehaus.plexus.classworlds.launcher.Launcher.main (Launcher.java:356)
[windows-jdk7-maven3.5.x] [ERROR]
[windows-jdk7-maven3.5.x] [ERROR] Re-run Maven using the -X switch to enable full debug logging.
[windows-jdk7-maven3.5.x] [ERROR]
[windows-jdk7-maven3.5.x] [ERROR] For more information about the errors and possible solutions, please read the following articles:
[windows-jdk7-maven3.5.x] [ERROR] [Help 1] http://cwiki.apache.org/confluence/display/MAVEN/MojoFailureException
[windows-jdk7-maven3.5.x] [ERROR]
[windows-jdk7-maven3.5.x] [ERROR] After correcting the problems, you can resume the build with the command
[windows-jdk7-maven3.5.x] [ERROR]   mvn <goals> -rf :surefire-its
[Pipeline] [windows-jdk7-maven3.5.x] }
[Pipeline] [windows-jdk7-maven3.5.x] // withEnv
[Pipeline] [windows-jdk7-maven3.5.x] }
[Pipeline] [windows-jdk7-maven3.5.x] // stage
[Pipeline] [windows-jdk7-maven3.5.x] stage
[Pipeline] [windows-jdk7-maven3.5.x] { (reporting windows-jdk7-maven3.5.x)
[Pipeline] [windows-jdk7-maven3.5.x] fileExists
[Pipeline] [windows-jdk7-maven3.5.x] zip
[windows-jdk7-maven3.5.x] Writing zip file of f:\jenkins\jenkins-slave\workspace\box_maven-surefire_buildfix-2YF32ZKQCHGNFXQRDDTWVZ7SNH24TIULHNPEEYX5TSMYSM7X5D3Q\maven-failsafe-plugin\target\it to f:\jenkins\jenkins-slave\workspace\box_maven-surefire_buildfix-2YF32ZKQCHGNFXQRDDTWVZ7SNH24TIULHNPEEYX5TSMYSM7X5D3Q\maven-failsafe-plugin--windows-jdk7-maven3.5.x.zip
[windows-jdk7-maven3.5.x] Zipped 83 entries.
[windows-jdk7-maven3.5.x] Archiving f:\jenkins\jenkins-slave\workspace\box_maven-surefire_buildfix-2YF32ZKQCHGNFXQRDDTWVZ7SNH24TIULHNPEEYX5TSMYSM7X5D3Q\maven-failsafe-plugin--windows-jdk7-maven3.5.x.zip
[Pipeline] [windows-jdk7-maven3.5.x] fileExists
[Pipeline] [windows-jdk7-maven3.5.x] zip
[windows-jdk7-maven3.5.x] Writing zip file of f:\jenkins\jenkins-slave\workspace\box_maven-surefire_buildfix-2YF32ZKQCHGNFXQRDDTWVZ7SNH24TIULHNPEEYX5TSMYSM7X5D3Q\surefire-its\target to f:\jenkins\jenkins-slave\workspace\box_maven-surefire_buildfix-2YF32ZKQCHGNFXQRDDTWVZ7SNH24TIULHNPEEYX5TSMYSM7X5D3Q\surefire-its--windows-jdk7-maven3.5.x.zip
[windows-jdk7-maven3.5.x] Zipped 1837 entries.
[windows-jdk7-maven3.5.x] Archiving f:\jenkins\jenkins-slave\workspace\box_maven-surefire_buildfix-2YF32ZKQCHGNFXQRDDTWVZ7SNH24TIULHNPEEYX5TSMYSM7X5D3Q\surefire-its--windows-jdk7-maven3.5.x.zip
[Pipeline] [windows-jdk7-maven3.5.x] archiveArtifacts
[windows-jdk7-maven3.5.x] Archiving artifacts
[Pipeline] [windows-jdk7-maven3.5.x] }
[Pipeline] [windows-jdk7-maven3.5.x] // stage
[Pipeline] [windows-jdk7-maven3.5.x] stage
[Pipeline] [windows-jdk7-maven3.5.x] { (cleanup windows-jdk7-maven3.5.x)
[Pipeline] [windows-jdk7-maven3.5.x] cleanWs
[windows-jdk7-maven3.5.x] [WS-CLEANUP] Deleting project workspace...[WS-CLEANUP] done
[Pipeline] [windows-jdk7-maven3.5.x] }
[Pipeline] [windows-jdk7-maven3.5.x] // stage
[Pipeline] [windows-jdk7-maven3.5.x] }
[Pipeline] [windows-jdk7-maven3.5.x] // timestamps
[Pipeline] [windows-jdk7-maven3.5.x] }
[Pipeline] [windows-jdk7-maven3.5.x] // node
[Pipeline] [windows-jdk7-maven3.5.x] }
[windows-jdk7-maven3.5.x] Failed in branch windows-jdk7-maven3.5.x
[Pipeline] // parallel
[Pipeline] echo
hudson.AbortException: hudson.AbortException: script returned exit code 1
[Pipeline] stage
[Pipeline] { (notifications)
[Pipeline] echo
Build result: FAILURE
[Pipeline] jiraIssueSelector
[Pipeline] emailext
Reply | Threaded
Open this post in threaded view
|

Build succeeded in Jenkins: Maven TLP » maven-surefire » buildfix #4

Apache Jenkins Server-2
See https://builds.apache.org/job/maven-box/job/maven-surefire/job/buildfix/4/

Changes:

* fix for unit test SurefireLauncherTest
* fix for unit test SurefireLauncherTest
* fix for unit test SurefireLauncherTest
* fix for unit test SurefireLauncherTest
* fix for unit test SurefireLauncherTest
* fix for unit test SurefireLauncherTest

All tests passed