Build failed in Jenkins: Maven TLP » maven-surefire » SUREFIRE-1788 #6

classic Classic list List threaded Threaded
1 message Options
Reply | Threaded
Open this post in threaded view
|

Build failed in Jenkins: Maven TLP » maven-surefire » SUREFIRE-1788 #6

Apache Jenkins Server-2
See https://builds.apache.org/job/maven-box/job/maven-surefire/job/SUREFIRE-1788/6/

Changes:

* other ITs should not be so sensitive to TestNG and Mockito Reflection

All tests passed

Build log:
[...truncated 29835 lines...]
[2020-05-12T13:21:17.254Z] [INFO] Running org.apache.maven.surefire.its.jiras.Surefire772BothReportsIT
[2020-05-12T13:21:20.285Z] Zipped 18694 entries.
[2020-05-12T13:21:20.285Z] Archiving C:\Users\jenkins\AppData\Local\Temp\2\jenkins-maven-box-maven-surefire-SUREFIRE-1788-6@2\surefire-its--windows-jdk14-maven3.6.x.zip
[2020-05-12T13:21:20.286Z] [Fast Archiver] No artifacts from Maven TLP » maven-surefire » SUREFIRE-1788 #2 to compare, so performing full copy of artifacts
[Pipeline] archiveArtifacts
[2020-05-12T13:21:22.350Z] Archiving artifacts
[2020-05-12T13:21:22.361Z] [Fast Archiver] No artifacts from Maven TLP » maven-surefire » SUREFIRE-1788 #2 to compare, so performing full copy of artifacts
[2020-05-12T13:21:24.294Z] Zipped 18713 entries.
[2020-05-12T13:21:24.294Z] Archiving C:\Users\jenkins\AppData\Local\Temp\2\jenkins-maven-box-maven-surefire-SUREFIRE-1788-6\surefire-its--windows-jdk11-maven3.6.x.zip
[2020-05-12T13:21:24.295Z] [Fast Archiver] No artifacts from Maven TLP » maven-surefire » SUREFIRE-1788 #2 to compare, so performing full copy of artifacts
[Pipeline] cleanWs
[2020-05-12T13:21:24.467Z] [WS-CLEANUP] Deleting project workspace...
[2020-05-12T13:21:24.467Z] [WS-CLEANUP] Deferred wipeout is used...
[2020-05-12T13:21:24.585Z] [WS-CLEANUP] done
[Pipeline] }
[Pipeline] // ws
[Pipeline] }
[Pipeline] // timestamps
[Pipeline] }
[Pipeline] // node
[Pipeline] }
[Pipeline] archiveArtifacts
[2020-05-12T13:21:26.499Z] Archiving artifacts
[2020-05-12T13:21:26.527Z] [Fast Archiver] No artifacts from Maven TLP » maven-surefire » SUREFIRE-1788 #2 to compare, so performing full copy of artifacts
[Pipeline] cleanWs
[2020-05-12T13:21:28.522Z] [WS-CLEANUP] Deleting project workspace...
[2020-05-12T13:21:28.522Z] [WS-CLEANUP] Deferred wipeout is used...
[2020-05-12T13:21:28.702Z] [WS-CLEANUP] done
[Pipeline] }
[Pipeline] // ws
[Pipeline] }
[Pipeline] // timestamps
[Pipeline] }
[Pipeline] // node
[Pipeline] }
[2020-05-12T13:21:30.378Z] [INFO] Tests run: 3, Failures: 0, Errors: 0, Skipped: 0, Time elapsed: 13.346 s - in org.apache.maven.surefire.its.jiras.Surefire772BothReportsIT
[2020-05-12T13:21:30.378Z] [INFO] Running org.apache.maven.surefire.its.jiras.Surefire772NoFailsafeReportsIT
[2020-05-12T13:21:48.527Z] [INFO] Tests run: 4, Failures: 0, Errors: 0, Skipped: 0, Time elapsed: 17.565 s - in org.apache.maven.surefire.its.jiras.Surefire772NoFailsafeReportsIT
[2020-05-12T13:21:48.527Z] [INFO] Running org.apache.maven.surefire.its.jiras.Surefire772NoSurefireReportsIT
[2020-05-12T13:22:06.661Z] [INFO] Tests run: 4, Failures: 0, Errors: 0, Skipped: 0, Time elapsed: 17.863 s - in org.apache.maven.surefire.its.jiras.Surefire772NoSurefireReportsIT
[2020-05-12T13:22:06.661Z] [INFO] Running org.apache.maven.surefire.its.jiras.Surefire772SpecifiedReportsIT
[2020-05-12T13:22:19.854Z] [INFO] Tests run: 3, Failures: 0, Errors: 0, Skipped: 0, Time elapsed: 13.571 s - in org.apache.maven.surefire.its.jiras.Surefire772SpecifiedReportsIT
[2020-05-12T13:22:19.854Z] [INFO] Running org.apache.maven.surefire.its.jiras.Surefire801ForkModeNoneClassLoaderIT
[2020-05-12T13:22:24.071Z] [INFO] Tests run: 1, Failures: 0, Errors: 0, Skipped: 0, Time elapsed: 5.854 s - in org.apache.maven.surefire.its.jiras.Surefire801ForkModeNoneClassLoaderIT
[2020-05-12T13:22:24.071Z] [INFO] Running org.apache.maven.surefire.its.jiras.Surefire803MultiFailsafeExecsIT
[2020-05-12T13:22:49.714Z] [INFO] Tests run: 2, Failures: 0, Errors: 0, Skipped: 0, Time elapsed: 24.97 s - in org.apache.maven.surefire.its.jiras.Surefire803MultiFailsafeExecsIT
[2020-05-12T13:22:49.714Z] [INFO] Running org.apache.maven.surefire.its.jiras.Surefire806SpecifiedTestControlsIT
[2020-05-12T13:22:56.292Z] [WARNING] Tests run: 3, Failures: 0, Errors: 0, Skipped: 2, Time elapsed: 6.369 s - in org.apache.maven.surefire.its.jiras.Surefire806SpecifiedTestControlsIT
[2020-05-12T13:22:56.292Z] [INFO] Running org.apache.maven.surefire.its.jiras.Surefire809GroupExpressionsIT
[2020-05-12T13:23:43.656Z] [INFO] Tests run: 6, Failures: 0, Errors: 0, Skipped: 0, Time elapsed: 42.059 s - in org.apache.maven.surefire.its.jiras.Surefire809GroupExpressionsIT
[2020-05-12T13:23:43.656Z] [INFO] Running org.apache.maven.surefire.its.jiras.Surefire812Log4JClassLoaderIT
[2020-05-12T13:23:45.132Z] [INFO] Tests run: 1, Failures: 0, Errors: 0, Skipped: 0, Time elapsed: 7.061 s - in org.apache.maven.surefire.its.jiras.Surefire812Log4JClassLoaderIT
[2020-05-12T13:23:45.132Z] [INFO] Running org.apache.maven.surefire.its.jiras.Surefire817SystemExitIT
[2020-05-12T13:23:52.966Z] [INFO] Tests run: 1, Failures: 0, Errors: 0, Skipped: 0, Time elapsed: 8.023 s - in org.apache.maven.surefire.its.jiras.Surefire817SystemExitIT
[2020-05-12T13:23:52.966Z] [INFO] Running org.apache.maven.surefire.its.jiras.Surefire818NpeIgnoresTestsIT
[2020-05-12T13:24:02.324Z] [INFO] Tests run: 1, Failures: 0, Errors: 0, Skipped: 0, Time elapsed: 8.278 s - in org.apache.maven.surefire.its.jiras.Surefire818NpeIgnoresTestsIT
[2020-05-12T13:24:02.324Z] [INFO] Running org.apache.maven.surefire.its.jiras.Surefire828EmptyGroupExprIT
[2020-05-12T13:24:31.578Z] [INFO] Tests run: 4, Failures: 0, Errors: 0, Skipped: 0, Time elapsed: 29.382 s - in org.apache.maven.surefire.its.jiras.Surefire828EmptyGroupExprIT
[2020-05-12T13:24:31.578Z] [INFO] Running org.apache.maven.surefire.its.jiras.Surefire832ProviderSelectionIT
[2020-05-12T13:24:38.082Z] [INFO] Tests run: 1, Failures: 0, Errors: 0, Skipped: 0, Time elapsed: 7.221 s - in org.apache.maven.surefire.its.jiras.Surefire832ProviderSelectionIT
[2020-05-12T13:24:38.082Z] [INFO] Running org.apache.maven.surefire.its.jiras.Surefire839TestWithoutCategoriesIT
[2020-05-12T13:24:53.743Z] [INFO] Tests run: 2, Failures: 0, Errors: 0, Skipped: 0, Time elapsed: 15.129 s - in org.apache.maven.surefire.its.jiras.Surefire839TestWithoutCategoriesIT
[2020-05-12T13:24:53.743Z] [INFO] Running org.apache.maven.surefire.its.jiras.Surefire847AdditionalFailureIT
[2020-05-12T13:25:03.115Z] [INFO] Tests run: 1, Failures: 0, Errors: 0, Skipped: 0, Time elapsed: 9.015 s - in org.apache.maven.surefire.its.jiras.Surefire847AdditionalFailureIT
[2020-05-12T13:25:03.115Z] [INFO] Running org.apache.maven.surefire.its.jiras.Surefire855AllowFailsafeUseArtifactFileIT
[2020-05-12T13:25:59.821Z] [INFO] Tests run: 4, Failures: 0, Errors: 0, Skipped: 0, Time elapsed: 55.699 s - in org.apache.maven.surefire.its.jiras.Surefire855AllowFailsafeUseArtifactFileIT
[2020-05-12T13:25:59.821Z] [INFO] Running org.apache.maven.surefire.its.jiras.Surefire901MIssingResultfileWhenNoTestsIT
[2020-05-12T13:26:04.001Z] [INFO] Tests run: 1, Failures: 0, Errors: 0, Skipped: 0, Time elapsed: 6.207 s - in org.apache.maven.surefire.its.jiras.Surefire901MIssingResultfileWhenNoTestsIT
[2020-05-12T13:26:04.001Z] [INFO] Running org.apache.maven.surefire.its.jiras.Surefire907PerThreadWithoutThreadCountIT
[2020-05-12T13:26:09.296Z] [INFO] Tests run: 1, Failures: 0, Errors: 0, Skipped: 0, Time elapsed: 5.75 s - in org.apache.maven.surefire.its.jiras.Surefire907PerThreadWithoutThreadCountIT
[2020-05-12T13:26:09.296Z] [INFO] Running org.apache.maven.surefire.its.jiras.Surefire920TestFailureIgnoreWithTimeoutIT
[2020-05-12T13:26:27.429Z] [INFO] Tests run: 2, Failures: 0, Errors: 0, Skipped: 0, Time elapsed: 16.773 s - in org.apache.maven.surefire.its.jiras.Surefire920TestFailureIgnoreWithTimeoutIT
[2020-05-12T13:26:27.429Z] [INFO] Running org.apache.maven.surefire.its.jiras.Surefire926FailureWith2ProvidersIT
[2020-05-12T13:26:32.694Z] [INFO] Tests run: 1, Failures: 0, Errors: 0, Skipped: 0, Time elapsed: 6.093 s - in org.apache.maven.surefire.its.jiras.Surefire926FailureWith2ProvidersIT
[2020-05-12T13:26:32.694Z] [INFO] Running org.apache.maven.surefire.its.jiras.Surefire930TestNgSuiteXmlIT
[2020-05-12T13:26:40.557Z] [INFO] Tests run: 1, Failures: 0, Errors: 0, Skipped: 0, Time elapsed: 8.275 s - in org.apache.maven.surefire.its.jiras.Surefire930TestNgSuiteXmlIT
[2020-05-12T13:26:40.557Z] [INFO] Running org.apache.maven.surefire.its.jiras.Surefire943ReportContentIT
[2020-05-12T13:27:14.856Z] [INFO] Tests run: 2, Failures: 0, Errors: 0, Skipped: 0, Time elapsed: 30.814 s - in org.apache.maven.surefire.its.jiras.Surefire943ReportContentIT
[2020-05-12T13:27:14.856Z] [INFO] Running org.apache.maven.surefire.its.jiras.Surefire946KillMainProcessInReusableForkIT
[2020-05-12T13:29:25.439Z] [INFO] Tests run: 6, Failures: 0, Errors: 0, Skipped: 0, Time elapsed: 123.564 s - in org.apache.maven.surefire.its.jiras.Surefire946KillMainProcessInReusableForkIT
[2020-05-12T13:29:25.439Z] [INFO] Running org.apache.maven.surefire.its.jiras.Surefire972BizarreNoClassDefIT
[2020-05-12T13:29:25.439Z] [INFO] Tests run: 1, Failures: 0, Errors: 0, Skipped: 0, Time elapsed: 9.162 s - in org.apache.maven.surefire.its.jiras.Surefire972BizarreNoClassDefIT
[2020-05-12T13:29:25.439Z] [INFO] Running org.apache.maven.surefire.its.jiras.Surefire975DefaultVMEncodingIT
[2020-05-12T13:29:31.911Z] [INFO] Tests run: 1, Failures: 0, Errors: 0, Skipped: 0, Time elapsed: 7.057 s - in org.apache.maven.surefire.its.jiras.Surefire975DefaultVMEncodingIT
[2020-05-12T13:29:31.911Z] [INFO] Running org.apache.maven.surefire.its.jiras.Surefire979WrongClassLoaderIT
[2020-05-12T13:29:40.493Z] [INFO] Tests run: 1, Failures: 0, Errors: 0, Skipped: 0, Time elapsed: 7.427 s - in org.apache.maven.surefire.its.jiras.Surefire979WrongClassLoaderIT
[2020-05-12T13:29:40.493Z] [INFO] Running org.apache.maven.surefire.its.jiras.Surefire985ParameterizedRunnerAndCategoriesIT
[2020-05-12T13:29:46.962Z] [INFO] Tests run: 1, Failures: 0, Errors: 0, Skipped: 0, Time elapsed: 8.267 s - in org.apache.maven.surefire.its.jiras.Surefire985ParameterizedRunnerAndCategoriesIT
[2020-05-12T13:29:46.962Z] [INFO] Running org.apache.maven.surefire.its.jiras.Surefire995CategoryInheritanceIT
[2020-05-12T13:30:42.765Z] [INFO] Tests run: 7, Failures: 0, Errors: 0, Skipped: 0, Time elapsed: 48.592 s - in org.apache.maven.surefire.its.jiras.Surefire995CategoryInheritanceIT
[2020-05-12T13:30:42.765Z] [INFO]
[2020-05-12T13:30:42.765Z] [INFO] Results:
[2020-05-12T13:30:42.765Z] [INFO]
[2020-05-12T13:30:42.765Z] [ERROR] Errors:
[2020-05-12T13:30:42.765Z] [ERROR]   CheckTestNgVersionsIT.test512:126->runTestNgTest:180->runTestNgTest:208 » SurefireVerifier
[2020-05-12T13:30:42.765Z] [ERROR]   CheckTestNgVersionsIT.test513:132->runTestNgTest:180->runTestNgTest:208 » SurefireVerifier
[2020-05-12T13:30:42.765Z] [ERROR]   CheckTestNgVersionsIT.test5131:138->runTestNgTest:180->runTestNgTest:208 » SurefireVerifier
[2020-05-12T13:30:42.765Z] [ERROR]   CheckTestNgVersionsIT.test514:144->runTestNgTest:180->runTestNgTest:208 » SurefireVerifier
[2020-05-12T13:30:42.765Z] [ERROR]   CheckTestNgVersionsIT.test5141:150->runTestNgTest:180->runTestNgTest:208 » SurefireVerifier
[2020-05-12T13:30:42.765Z] [ERROR]   CheckTestNgVersionsIT.test5142:156->runTestNgTest:180->runTestNgTest:208 » SurefireVerifier
[2020-05-12T13:30:42.765Z] [INFO]
[2020-05-12T13:30:42.765Z] [ERROR] Tests run: 946, Failures: 0, Errors: 6, Skipped: 137
[2020-05-12T13:30:42.765Z] [INFO]
[2020-05-12T13:30:42.765Z] [INFO]
[2020-05-12T13:30:42.765Z] [INFO] --- maven-checkstyle-plugin:3.0.0:check (checkstyle-check) @ surefire-its ---
[2020-05-12T13:30:42.765Z] [INFO]
[2020-05-12T13:30:42.765Z] [INFO] --- maven-failsafe-plugin:3.0.0-M4:verify (default) @ surefire-its ---
[2020-05-12T13:30:42.765Z] [INFO] Failsafe report directory: /home/jenkins/jenkins-slave/workspace/box_maven-surefire_SUREFIRE-1788@2/surefire-its/target/failsafe-reports
[2020-05-12T13:30:42.765Z] [INFO] ------------------------------------------------------------------------
[2020-05-12T13:30:42.765Z] [INFO] Reactor Summary for Apache Maven Surefire 3.0.0-SNAPSHOT:
[2020-05-12T13:30:42.765Z] [INFO]
[2020-05-12T13:30:42.765Z] [INFO] Apache Maven Surefire .............................. SUCCESS [ 16.715 s]
[2020-05-12T13:30:42.765Z] [INFO] SureFire Logger API ................................ SUCCESS [ 10.486 s]
[2020-05-12T13:30:42.765Z] [INFO] SureFire API ....................................... SUCCESS [ 16.419 s]
[2020-05-12T13:30:42.765Z] [INFO] Surefire Extensions API ............................ SUCCESS [  6.333 s]
[2020-05-12T13:30:42.765Z] [INFO] Surefire Extensions SPI ............................ SUCCESS [  2.392 s]
[2020-05-12T13:30:42.765Z] [INFO] SureFire Booter .................................... SUCCESS [ 20.192 s]
[2020-05-12T13:30:42.765Z] [INFO] Maven Surefire Test-Grouping Support ............... SUCCESS [  6.484 s]
[2020-05-12T13:30:42.765Z] [INFO] SureFire Providers ................................. SUCCESS [  1.145 s]
[2020-05-12T13:30:42.765Z] [INFO] Shared JUnit3 Provider Code ........................ SUCCESS [  4.654 s]
[2020-05-12T13:30:42.765Z] [INFO] Shared Java 5 Provider Base ........................ SUCCESS [  5.406 s]
[2020-05-12T13:30:42.765Z] [INFO] Shared JUnit4 Provider Code ........................ SUCCESS [  5.948 s]
[2020-05-12T13:30:42.765Z] [INFO] Shared JUnit48 Provider Code ....................... SUCCESS [  9.246 s]
[2020-05-12T13:30:42.765Z] [INFO] SureFire JUnit Runner .............................. SUCCESS [  4.958 s]
[2020-05-12T13:30:42.765Z] [INFO] SureFire JUnit4 Runner ............................. SUCCESS [  4.861 s]
[2020-05-12T13:30:42.765Z] [INFO] Maven Surefire Common .............................. SUCCESS [01:00 min]
[2020-05-12T13:30:42.765Z] [INFO] SureFire JUnitCore Runner .......................... SUCCESS [02:20 min]
[2020-05-12T13:30:42.765Z] [INFO] SureFire JUnit Platform Runner ..................... SUCCESS [ 11.827 s]
[2020-05-12T13:30:42.765Z] [INFO] SureFire TestNG Utils .............................. SUCCESS [  4.616 s]
[2020-05-12T13:30:42.765Z] [INFO] SureFire TestNG Runner ............................. SUCCESS [  7.130 s]
[2020-05-12T13:30:42.765Z] [INFO] ShadeFire JUnit3 Provider .......................... SUCCESS [  2.910 s]
[2020-05-12T13:30:42.765Z] [INFO] Surefire Report Parser ............................. SUCCESS [  6.312 s]
[2020-05-12T13:30:42.765Z] [INFO] Maven Surefire Plugin .............................. SUCCESS [ 10.567 s]
[2020-05-12T13:30:42.765Z] [INFO] Maven Failsafe Plugin .............................. SUCCESS [01:05 min]
[2020-05-12T13:30:42.765Z] [INFO] Maven Surefire Report Plugin ....................... SUCCESS [ 16.259 s]
[2020-05-12T13:30:42.765Z] [INFO] Maven Surefire Integration Tests ................... FAILURE [  01:42 h]
[2020-05-12T13:30:42.765Z] [INFO] Surefire Shared Utils .............................. SKIPPED
[2020-05-12T13:30:42.765Z] [INFO] ------------------------------------------------------------------------
[2020-05-12T13:30:42.765Z] [INFO] BUILD FAILURE
[2020-05-12T13:30:42.765Z] [INFO] ------------------------------------------------------------------------
[2020-05-12T13:30:42.765Z] [INFO] Total time:  01:49 h
[2020-05-12T13:30:42.766Z] [INFO] Finished at: 2020-05-12T13:30:37Z
[2020-05-12T13:30:42.766Z] [INFO] ------------------------------------------------------------------------
[2020-05-12T13:30:42.766Z] [ERROR] Failed to execute goal org.apache.maven.plugins:maven-failsafe-plugin:3.0.0-M4:verify (default) on project surefire-its: There are test failures.
[2020-05-12T13:30:42.766Z] [ERROR]
[2020-05-12T13:30:42.766Z] [ERROR] Please refer to /home/jenkins/jenkins-slave/workspace/box_maven-surefire_SUREFIRE-1788@2/surefire-its/target/failsafe-reports for the individual test results.
[2020-05-12T13:30:42.766Z] [ERROR] Please refer to dump files (if any exist) [date].dump, [date]-jvmRun[N].dump and [date].dumpstream.
[2020-05-12T13:30:42.766Z] [ERROR] -> [Help 1]
[2020-05-12T13:30:42.766Z] org.apache.maven.lifecycle.LifecycleExecutionException: Failed to execute goal org.apache.maven.plugins:maven-failsafe-plugin:3.0.0-M4:verify (default) on project surefire-its: There are test failures.
[2020-05-12T13:30:42.766Z]
[2020-05-12T13:30:42.766Z] Please refer to /home/jenkins/jenkins-slave/workspace/box_maven-surefire_SUREFIRE-1788@2/surefire-its/target/failsafe-reports for the individual test results.
[2020-05-12T13:30:42.766Z] Please refer to dump files (if any exist) [date].dump, [date]-jvmRun[N].dump and [date].dumpstream.
[2020-05-12T13:30:42.766Z]     at org.apache.maven.lifecycle.internal.MojoExecutor.execute (MojoExecutor.java:215)
[2020-05-12T13:30:42.766Z]     at org.apache.maven.lifecycle.internal.MojoExecutor.execute (MojoExecutor.java:156)
[2020-05-12T13:30:42.766Z]     at org.apache.maven.lifecycle.internal.MojoExecutor.execute (MojoExecutor.java:148)
[2020-05-12T13:30:42.766Z]     at org.apache.maven.lifecycle.internal.LifecycleModuleBuilder.buildProject (LifecycleModuleBuilder.java:117)
[2020-05-12T13:30:42.766Z]     at org.apache.maven.lifecycle.internal.LifecycleModuleBuilder.buildProject (LifecycleModuleBuilder.java:81)
[2020-05-12T13:30:42.766Z]     at org.apache.maven.lifecycle.internal.builder.singlethreaded.SingleThreadedBuilder.build (SingleThreadedBuilder.java:56)
[2020-05-12T13:30:42.766Z]     at org.apache.maven.lifecycle.internal.LifecycleStarter.execute (LifecycleStarter.java:128)
[2020-05-12T13:30:42.766Z]     at org.apache.maven.DefaultMaven.doExecute (DefaultMaven.java:305)
[2020-05-12T13:30:42.766Z]     at org.apache.maven.DefaultMaven.doExecute (DefaultMaven.java:192)
[2020-05-12T13:30:42.766Z]     at org.apache.maven.DefaultMaven.execute (DefaultMaven.java:105)
[2020-05-12T13:30:42.766Z]     at org.apache.maven.cli.MavenCli.execute (MavenCli.java:957)
[2020-05-12T13:30:42.766Z]     at org.apache.maven.cli.MavenCli.doMain (MavenCli.java:289)
[2020-05-12T13:30:42.766Z]     at org.apache.maven.cli.MavenCli.main (MavenCli.java:193)
[2020-05-12T13:30:42.766Z]     at sun.reflect.NativeMethodAccessorImpl.invoke0 (Native Method)
[2020-05-12T13:30:42.766Z]     at sun.reflect.NativeMethodAccessorImpl.invoke (NativeMethodAccessorImpl.java:62)
[2020-05-12T13:30:42.766Z]     at sun.reflect.DelegatingMethodAccessorImpl.invoke (DelegatingMethodAccessorImpl.java:43)
[2020-05-12T13:30:42.766Z]     at java.lang.reflect.Method.invoke (Method.java:498)
[2020-05-12T13:30:42.766Z]     at org.codehaus.plexus.classworlds.launcher.Launcher.launchEnhanced (Launcher.java:282)
[2020-05-12T13:30:42.766Z]     at org.codehaus.plexus.classworlds.launcher.Launcher.launch (Launcher.java:225)
[2020-05-12T13:30:42.766Z]     at org.codehaus.plexus.classworlds.launcher.Launcher.mainWithExitCode (Launcher.java:406)
[2020-05-12T13:30:42.766Z]     at org.codehaus.plexus.classworlds.launcher.Launcher.main (Launcher.java:347)
[2020-05-12T13:30:42.766Z] Caused by: org.apache.maven.plugin.MojoFailureException: There are test failures.
[2020-05-12T13:30:42.766Z]
[2020-05-12T13:30:42.766Z] Please refer to /home/jenkins/jenkins-slave/workspace/box_maven-surefire_SUREFIRE-1788@2/surefire-its/target/failsafe-reports for the individual test results.
[2020-05-12T13:30:42.766Z] Please refer to dump files (if any exist) [date].dump, [date]-jvmRun[N].dump and [date].dumpstream.
[2020-05-12T13:30:42.766Z]     at org.apache.maven.plugin.surefire.SurefireHelper.throwException (SurefireHelper.java:271)
[2020-05-12T13:30:42.766Z]     at org.apache.maven.plugin.surefire.SurefireHelper.reportExecution (SurefireHelper.java:159)
[2020-05-12T13:30:42.766Z]     at org.apache.maven.plugin.failsafe.VerifyMojo.execute (VerifyMojo.java:192)
[2020-05-12T13:30:42.766Z]     at org.apache.maven.plugin.DefaultBuildPluginManager.executeMojo (DefaultBuildPluginManager.java:137)
[2020-05-12T13:30:42.766Z]     at org.apache.maven.lifecycle.internal.MojoExecutor.execute (MojoExecutor.java:210)
[2020-05-12T13:30:42.766Z]     at org.apache.maven.lifecycle.internal.MojoExecutor.execute (MojoExecutor.java:156)
[2020-05-12T13:30:42.766Z]     at org.apache.maven.lifecycle.internal.MojoExecutor.execute (MojoExecutor.java:148)
[2020-05-12T13:30:42.766Z]     at org.apache.maven.lifecycle.internal.LifecycleModuleBuilder.buildProject (LifecycleModuleBuilder.java:117)
[2020-05-12T13:30:42.766Z]     at org.apache.maven.lifecycle.internal.LifecycleModuleBuilder.buildProject (LifecycleModuleBuilder.java:81)
[2020-05-12T13:30:42.766Z]     at org.apache.maven.lifecycle.internal.builder.singlethreaded.SingleThreadedBuilder.build (SingleThreadedBuilder.java:56)
[2020-05-12T13:30:42.766Z]     at org.apache.maven.lifecycle.internal.LifecycleStarter.execute (LifecycleStarter.java:128)
[2020-05-12T13:30:42.766Z]     at org.apache.maven.DefaultMaven.doExecute (DefaultMaven.java:305)
[2020-05-12T13:30:42.766Z]     at org.apache.maven.DefaultMaven.doExecute (DefaultMaven.java:192)
[2020-05-12T13:30:42.766Z]     at org.apache.maven.DefaultMaven.execute (DefaultMaven.java:105)
[2020-05-12T13:30:42.766Z]     at org.apache.maven.cli.MavenCli.execute (MavenCli.java:957)
[2020-05-12T13:30:42.767Z]     at org.apache.maven.cli.MavenCli.doMain (MavenCli.java:289)
[2020-05-12T13:30:42.767Z]     at org.apache.maven.cli.MavenCli.main (MavenCli.java:193)
[2020-05-12T13:30:42.767Z]     at sun.reflect.NativeMethodAccessorImpl.invoke0 (Native Method)
[2020-05-12T13:30:42.767Z]     at sun.reflect.NativeMethodAccessorImpl.invoke (NativeMethodAccessorImpl.java:62)
[2020-05-12T13:30:42.767Z]     at sun.reflect.DelegatingMethodAccessorImpl.invoke (DelegatingMethodAccessorImpl.java:43)
[2020-05-12T13:30:42.767Z]     at java.lang.reflect.Method.invoke (Method.java:498)
[2020-05-12T13:30:42.767Z]     at org.codehaus.plexus.classworlds.launcher.Launcher.launchEnhanced (Launcher.java:282)
[2020-05-12T13:30:42.767Z]     at org.codehaus.plexus.classworlds.launcher.Launcher.launch (Launcher.java:225)
[2020-05-12T13:30:42.767Z]     at org.codehaus.plexus.classworlds.launcher.Launcher.mainWithExitCode (Launcher.java:406)
[2020-05-12T13:30:42.767Z]     at org.codehaus.plexus.classworlds.launcher.Launcher.main (Launcher.java:347)
[2020-05-12T13:30:42.767Z] [ERROR]
[2020-05-12T13:30:42.767Z] [ERROR] Re-run Maven using the -X switch to enable full debug logging.
[2020-05-12T13:30:42.767Z] [ERROR]
[2020-05-12T13:30:42.767Z] [ERROR] For more information about the errors and possible solutions, please read the following articles:
[2020-05-12T13:30:42.767Z] [ERROR] [Help 1] http://cwiki.apache.org/confluence/display/MAVEN/MojoFailureException
[2020-05-12T13:30:42.767Z] [ERROR]
[2020-05-12T13:30:42.767Z] [ERROR] After correcting the problems, you can resume the build with the command
[2020-05-12T13:30:42.767Z] [ERROR]   mvn <args> -rf :surefire-its
[Pipeline] }
[Pipeline] // withEnv
[Pipeline] }
[Pipeline] // stage
[Pipeline] fileExists
[Pipeline] zip
[2020-05-12T13:30:43.893Z] Writing zip file of /home/jenkins/jenkins-slave/workspace/box_maven-surefire_SUREFIRE-1788@2/maven-failsafe-plugin/target/it to /home/jenkins/jenkins-slave/workspace/box_maven-surefire_SUREFIRE-1788@2/maven-failsafe-plugin--linux-jdk11-maven3.6.x.zip
[2020-05-12T13:30:44.079Z] Zipped 78 entries.
[2020-05-12T13:30:44.079Z] Archiving /home/jenkins/jenkins-slave/workspace/box_maven-surefire_SUREFIRE-1788@2/maven-failsafe-plugin--linux-jdk11-maven3.6.x.zip
[2020-05-12T13:30:44.080Z] [Fast Archiver] No artifacts from Maven TLP » maven-surefire » SUREFIRE-1788 #2 to compare, so performing full copy of artifacts
[Pipeline] fileExists
[Pipeline] zip
[2020-05-12T13:30:45.045Z] Writing zip file of /home/jenkins/jenkins-slave/workspace/box_maven-surefire_SUREFIRE-1788@2/surefire-its/target to /home/jenkins/jenkins-slave/workspace/box_maven-surefire_SUREFIRE-1788@2/surefire-its--linux-jdk11-maven3.6.x.zip
[2020-05-12T13:31:07.070Z] Zipped 20014 entries.
[2020-05-12T13:31:07.071Z] Archiving /home/jenkins/jenkins-slave/workspace/box_maven-surefire_SUREFIRE-1788@2/surefire-its--linux-jdk11-maven3.6.x.zip
[2020-05-12T13:31:07.071Z] [Fast Archiver] No artifacts from Maven TLP » maven-surefire » SUREFIRE-1788 #2 to compare, so performing full copy of artifacts
[Pipeline] archiveArtifacts
[2020-05-12T13:31:13.031Z] Archiving artifacts
[2020-05-12T13:31:13.189Z] [Fast Archiver] No artifacts from Maven TLP » maven-surefire » SUREFIRE-1788 #2 to compare, so performing full copy of artifacts
[Pipeline] cleanWs
[2020-05-12T13:31:18.659Z] [WS-CLEANUP] Deleting project workspace...
[2020-05-12T13:31:18.659Z] [WS-CLEANUP] Deferred wipeout is used...
[2020-05-12T13:31:18.975Z] [WS-CLEANUP] done
[Pipeline] }
[Pipeline] // ws
[Pipeline] }
[Pipeline] // timestamps
[Pipeline] }
[Pipeline] // node
[Pipeline] }
[Pipeline] // parallel
[Pipeline] echo
Build result: FAILURE
[Pipeline] jiraIssueSelector
[Pipeline] echo
The authors of changes [tibordigana].
[Pipeline] echo
Sending email ...
[Pipeline] emailext