Build failed in Jenkins: Maven TLP » maven-surefire » SUREFIRE-1733 #10

classic Classic list List threaded Threaded
1 message Options
Reply | Threaded
Open this post in threaded view
|

Build failed in Jenkins: Maven TLP » maven-surefire » SUREFIRE-1733 #10

Apache Jenkins Server-2
See https://builds.apache.org/job/maven-box/job/maven-surefire/job/SUREFIRE-1733/10/

Changes:

* impl jvm args

46 tests failed.
FAILED:  org.apache.maven.surefire.its.JUnitPlatformEnginesIT.testJupiterEngine[1.0.3]

Error Message:
org.apache.maven.it.VerificationException: Error in execution: [ERROR] WARNING: Unknown module: org.junit.platform.commons specified to --add-opens

Stack Trace:
org.apache.maven.surefire.its.fixture.SurefireVerifierException: org.apache.maven.it.VerificationException: Error in execution: [ERROR] WARNING: Unknown module: org.junit.platform.commons specified to --add-opens
        at org.apache.maven.surefire.its.JUnitPlatformEnginesIT.testJupiterEngine(JUnitPlatformEnginesIT.java:175)
Caused by: org.apache.maven.it.VerificationException: Error in execution: [ERROR] WARNING: Unknown module: org.junit.platform.commons specified to --add-opens
        at org.apache.maven.surefire.its.JUnitPlatformEnginesIT.testJupiterEngine(JUnitPlatformEnginesIT.java:175)


FAILED:  org.apache.maven.surefire.its.JUnitPlatformEnginesIT.testJupiterEngineWithDisplayNames[1.0.3]

Error Message:
org.apache.maven.it.VerificationException: Error in execution: [ERROR] WARNING: Unknown module: org.junit.platform.commons specified to --add-opens

Stack Trace:
org.apache.maven.surefire.its.fixture.SurefireVerifierException: org.apache.maven.it.VerificationException: Error in execution: [ERROR] WARNING: Unknown module: org.junit.platform.commons specified to --add-opens
        at org.apache.maven.surefire.its.JUnitPlatformEnginesIT.testJupiterEngineWithDisplayNames(JUnitPlatformEnginesIT.java:350)
Caused by: org.apache.maven.it.VerificationException: Error in execution: [ERROR] WARNING: Unknown module: org.junit.platform.commons specified to --add-opens
        at org.apache.maven.surefire.its.JUnitPlatformEnginesIT.testJupiterEngineWithDisplayNames(JUnitPlatformEnginesIT.java:350)


FAILED:  org.apache.maven.surefire.its.JUnitPlatformEnginesIT.platform[1.0.3]

Error Message:
org.apache.maven.it.VerificationException: Error in execution: [ERROR] WARNING: Unknown module: org.junit.platform.commons specified to --add-opens

Stack Trace:
org.apache.maven.surefire.its.fixture.SurefireVerifierException: org.apache.maven.it.VerificationException: Error in execution: [ERROR] WARNING: Unknown module: org.junit.platform.commons specified to --add-opens
        at org.apache.maven.surefire.its.JUnitPlatformEnginesIT.platform(JUnitPlatformEnginesIT.java:110)
Caused by: org.apache.maven.it.VerificationException: Error in execution: [ERROR] WARNING: Unknown module: org.junit.platform.commons specified to --add-opens
        at org.apache.maven.surefire.its.JUnitPlatformEnginesIT.platform(JUnitPlatformEnginesIT.java:110)


FAILED:  org.apache.maven.surefire.its.JUnitPlatformEnginesIT.testTags[1.1.1]

Error Message:
org.apache.maven.it.VerificationException: Error in execution: [ERROR] WARNING: Unknown module: org.junit.platform.commons specified to --add-opens

Stack Trace:
org.apache.maven.surefire.its.fixture.SurefireVerifierException: org.apache.maven.it.VerificationException: Error in execution: [ERROR] WARNING: Unknown module: org.junit.platform.commons specified to --add-opens
        at org.apache.maven.surefire.its.JUnitPlatformEnginesIT.testTags(JUnitPlatformEnginesIT.java:401)
Caused by: org.apache.maven.it.VerificationException: Error in execution: [ERROR] WARNING: Unknown module: org.junit.platform.commons specified to --add-opens
        at org.apache.maven.surefire.its.JUnitPlatformEnginesIT.testTags(JUnitPlatformEnginesIT.java:401)


FAILED:  org.apache.maven.surefire.its.JUnitPlatformEnginesIT.testJupiterEngine[1.1.1]

Error Message:
org.apache.maven.it.VerificationException: Error in execution: [ERROR] WARNING: Unknown module: org.junit.platform.commons specified to --add-opens

Stack Trace:
org.apache.maven.surefire.its.fixture.SurefireVerifierException: org.apache.maven.it.VerificationException: Error in execution: [ERROR] WARNING: Unknown module: org.junit.platform.commons specified to --add-opens
        at org.apache.maven.surefire.its.JUnitPlatformEnginesIT.testJupiterEngine(JUnitPlatformEnginesIT.java:175)
Caused by: org.apache.maven.it.VerificationException: Error in execution: [ERROR] WARNING: Unknown module: org.junit.platform.commons specified to --add-opens
        at org.apache.maven.surefire.its.JUnitPlatformEnginesIT.testJupiterEngine(JUnitPlatformEnginesIT.java:175)


FAILED:  org.apache.maven.surefire.its.JUnitPlatformEnginesIT.testJupiterEngineWithDisplayNames[1.1.1]

Error Message:
org.apache.maven.it.VerificationException: Error in execution: [ERROR] WARNING: Unknown module: org.junit.platform.commons specified to --add-opens

Stack Trace:
org.apache.maven.surefire.its.fixture.SurefireVerifierException: org.apache.maven.it.VerificationException: Error in execution: [ERROR] WARNING: Unknown module: org.junit.platform.commons specified to --add-opens
        at org.apache.maven.surefire.its.JUnitPlatformEnginesIT.testJupiterEngineWithDisplayNames(JUnitPlatformEnginesIT.java:350)
Caused by: org.apache.maven.it.VerificationException: Error in execution: [ERROR] WARNING: Unknown module: org.junit.platform.commons specified to --add-opens
        at org.apache.maven.surefire.its.JUnitPlatformEnginesIT.testJupiterEngineWithDisplayNames(JUnitPlatformEnginesIT.java:350)


FAILED:  org.apache.maven.surefire.its.JUnitPlatformEnginesIT.platform[1.1.1]

Error Message:
org.apache.maven.it.VerificationException: Error in execution: [ERROR] WARNING: Unknown module: org.junit.platform.commons specified to --add-opens

Stack Trace:
org.apache.maven.surefire.its.fixture.SurefireVerifierException: org.apache.maven.it.VerificationException: Error in execution: [ERROR] WARNING: Unknown module: org.junit.platform.commons specified to --add-opens
        at org.apache.maven.surefire.its.JUnitPlatformEnginesIT.platform(JUnitPlatformEnginesIT.java:110)
Caused by: org.apache.maven.it.VerificationException: Error in execution: [ERROR] WARNING: Unknown module: org.junit.platform.commons specified to --add-opens
        at org.apache.maven.surefire.its.JUnitPlatformEnginesIT.platform(JUnitPlatformEnginesIT.java:110)


FAILED:  org.apache.maven.surefire.its.JUnitPlatformEnginesIT.testTags[1.2.0]

Error Message:
org.apache.maven.it.VerificationException: Error in execution: [ERROR] WARNING: Unknown module: org.junit.platform.commons specified to --add-opens

Stack Trace:
org.apache.maven.surefire.its.fixture.SurefireVerifierException: org.apache.maven.it.VerificationException: Error in execution: [ERROR] WARNING: Unknown module: org.junit.platform.commons specified to --add-opens
        at org.apache.maven.surefire.its.JUnitPlatformEnginesIT.testTags(JUnitPlatformEnginesIT.java:401)
Caused by: org.apache.maven.it.VerificationException: Error in execution: [ERROR] WARNING: Unknown module: org.junit.platform.commons specified to --add-opens
        at org.apache.maven.surefire.its.JUnitPlatformEnginesIT.testTags(JUnitPlatformEnginesIT.java:401)


FAILED:  org.apache.maven.surefire.its.JUnitPlatformEnginesIT.testJupiterEngine[1.2.0]

Error Message:
org.apache.maven.it.VerificationException: Error in execution: [ERROR] WARNING: Unknown module: org.junit.platform.commons specified to --add-opens

Stack Trace:
org.apache.maven.surefire.its.fixture.SurefireVerifierException: org.apache.maven.it.VerificationException: Error in execution: [ERROR] WARNING: Unknown module: org.junit.platform.commons specified to --add-opens
        at org.apache.maven.surefire.its.JUnitPlatformEnginesIT.testJupiterEngine(JUnitPlatformEnginesIT.java:175)
Caused by: org.apache.maven.it.VerificationException: Error in execution: [ERROR] WARNING: Unknown module: org.junit.platform.commons specified to --add-opens
        at org.apache.maven.surefire.its.JUnitPlatformEnginesIT.testJupiterEngine(JUnitPlatformEnginesIT.java:175)


FAILED:  org.apache.maven.surefire.its.JUnitPlatformEnginesIT.testJupiterEngineWithDisplayNames[1.2.0]

Error Message:
org.apache.maven.it.VerificationException: Error in execution: [ERROR] WARNING: Unknown module: org.junit.platform.commons specified to --add-opens

Stack Trace:
org.apache.maven.surefire.its.fixture.SurefireVerifierException: org.apache.maven.it.VerificationException: Error in execution: [ERROR] WARNING: Unknown module: org.junit.platform.commons specified to --add-opens
        at org.apache.maven.surefire.its.JUnitPlatformEnginesIT.testJupiterEngineWithDisplayNames(JUnitPlatformEnginesIT.java:350)
Caused by: org.apache.maven.it.VerificationException: Error in execution: [ERROR] WARNING: Unknown module: org.junit.platform.commons specified to --add-opens
        at org.apache.maven.surefire.its.JUnitPlatformEnginesIT.testJupiterEngineWithDisplayNames(JUnitPlatformEnginesIT.java:350)


FAILED:  org.apache.maven.surefire.its.JUnitPlatformEnginesIT.platform[1.2.0]

Error Message:
org.apache.maven.it.VerificationException: Error in execution: [ERROR] WARNING: Unknown module: org.junit.platform.commons specified to --add-opens

Stack Trace:
org.apache.maven.surefire.its.fixture.SurefireVerifierException: org.apache.maven.it.VerificationException: Error in execution: [ERROR] WARNING: Unknown module: org.junit.platform.commons specified to --add-opens
        at org.apache.maven.surefire.its.JUnitPlatformEnginesIT.platform(JUnitPlatformEnginesIT.java:110)
Caused by: org.apache.maven.it.VerificationException: Error in execution: [ERROR] WARNING: Unknown module: org.junit.platform.commons specified to --add-opens
        at org.apache.maven.surefire.its.JUnitPlatformEnginesIT.platform(JUnitPlatformEnginesIT.java:110)


FAILED:  org.apache.maven.surefire.its.JUnitPlatformEnginesIT.testTags[1.3.2]

Error Message:
org.apache.maven.it.VerificationException: Error in execution: [ERROR] WARNING: Unknown module: org.junit.platform.commons specified to --add-opens

Stack Trace:
org.apache.maven.surefire.its.fixture.SurefireVerifierException: org.apache.maven.it.VerificationException: Error in execution: [ERROR] WARNING: Unknown module: org.junit.platform.commons specified to --add-opens
        at org.apache.maven.surefire.its.JUnitPlatformEnginesIT.testTags(JUnitPlatformEnginesIT.java:401)
Caused by: org.apache.maven.it.VerificationException: Error in execution: [ERROR] WARNING: Unknown module: org.junit.platform.commons specified to --add-opens
        at org.apache.maven.surefire.its.JUnitPlatformEnginesIT.testTags(JUnitPlatformEnginesIT.java:401)


FAILED:  org.apache.maven.surefire.its.JUnitPlatformEnginesIT.testJupiterEngine[1.3.2]

Error Message:
org.apache.maven.it.VerificationException: Error in execution: [ERROR] WARNING: Unknown module: org.junit.platform.commons specified to --add-opens

Stack Trace:
org.apache.maven.surefire.its.fixture.SurefireVerifierException: org.apache.maven.it.VerificationException: Error in execution: [ERROR] WARNING: Unknown module: org.junit.platform.commons specified to --add-opens
        at org.apache.maven.surefire.its.JUnitPlatformEnginesIT.testJupiterEngine(JUnitPlatformEnginesIT.java:175)
Caused by: org.apache.maven.it.VerificationException: Error in execution: [ERROR] WARNING: Unknown module: org.junit.platform.commons specified to --add-opens
        at org.apache.maven.surefire.its.JUnitPlatformEnginesIT.testJupiterEngine(JUnitPlatformEnginesIT.java:175)


FAILED:  org.apache.maven.surefire.its.JUnitPlatformEnginesIT.testJupiterEngineWithDisplayNames[1.3.2]

Error Message:
org.apache.maven.it.VerificationException: Error in execution: [ERROR] WARNING: Unknown module: org.junit.platform.commons specified to --add-opens

Stack Trace:
org.apache.maven.surefire.its.fixture.SurefireVerifierException: org.apache.maven.it.VerificationException: Error in execution: [ERROR] WARNING: Unknown module: org.junit.platform.commons specified to --add-opens
        at org.apache.maven.surefire.its.JUnitPlatformEnginesIT.testJupiterEngineWithDisplayNames(JUnitPlatformEnginesIT.java:350)
Caused by: org.apache.maven.it.VerificationException: Error in execution: [ERROR] WARNING: Unknown module: org.junit.platform.commons specified to --add-opens
        at org.apache.maven.surefire.its.JUnitPlatformEnginesIT.testJupiterEngineWithDisplayNames(JUnitPlatformEnginesIT.java:350)


FAILED:  org.apache.maven.surefire.its.JUnitPlatformEnginesIT.platform[1.3.2]

Error Message:
org.apache.maven.it.VerificationException: Error in execution: [ERROR] WARNING: Unknown module: org.junit.platform.commons specified to --add-opens

Stack Trace:
org.apache.maven.surefire.its.fixture.SurefireVerifierException: org.apache.maven.it.VerificationException: Error in execution: [ERROR] WARNING: Unknown module: org.junit.platform.commons specified to --add-opens
        at org.apache.maven.surefire.its.JUnitPlatformEnginesIT.platform(JUnitPlatformEnginesIT.java:110)
Caused by: org.apache.maven.it.VerificationException: Error in execution: [ERROR] WARNING: Unknown module: org.junit.platform.commons specified to --add-opens
        at org.apache.maven.surefire.its.JUnitPlatformEnginesIT.platform(JUnitPlatformEnginesIT.java:110)


FAILED:  org.apache.maven.surefire.its.JUnitPlatformEnginesIT.testTags[1.4.2]

Error Message:
org.apache.maven.it.VerificationException: Error in execution: [ERROR] WARNING: Unknown module: org.junit.platform.commons specified to --add-opens

Stack Trace:
org.apache.maven.surefire.its.fixture.SurefireVerifierException: org.apache.maven.it.VerificationException: Error in execution: [ERROR] WARNING: Unknown module: org.junit.platform.commons specified to --add-opens
        at org.apache.maven.surefire.its.JUnitPlatformEnginesIT.testTags(JUnitPlatformEnginesIT.java:401)
Caused by: org.apache.maven.it.VerificationException: Error in execution: [ERROR] WARNING: Unknown module: org.junit.platform.commons specified to --add-opens
        at org.apache.maven.surefire.its.JUnitPlatformEnginesIT.testTags(JUnitPlatformEnginesIT.java:401)


FAILED:  org.apache.maven.surefire.its.JUnitPlatformEnginesIT.testJupiterEngine[1.4.2]

Error Message:
org.apache.maven.it.VerificationException: Error in execution: [ERROR] WARNING: Unknown module: org.junit.platform.commons specified to --add-opens

Stack Trace:
org.apache.maven.surefire.its.fixture.SurefireVerifierException: org.apache.maven.it.VerificationException: Error in execution: [ERROR] WARNING: Unknown module: org.junit.platform.commons specified to --add-opens
        at org.apache.maven.surefire.its.JUnitPlatformEnginesIT.testJupiterEngine(JUnitPlatformEnginesIT.java:175)
Caused by: org.apache.maven.it.VerificationException: Error in execution: [ERROR] WARNING: Unknown module: org.junit.platform.commons specified to --add-opens
        at org.apache.maven.surefire.its.JUnitPlatformEnginesIT.testJupiterEngine(JUnitPlatformEnginesIT.java:175)


FAILED:  org.apache.maven.surefire.its.JUnitPlatformEnginesIT.testJupiterEngineWithDisplayNames[1.4.2]

Error Message:
org.apache.maven.it.VerificationException: Error in execution: [ERROR] WARNING: Unknown module: org.junit.platform.commons specified to --add-opens

Stack Trace:
org.apache.maven.surefire.its.fixture.SurefireVerifierException: org.apache.maven.it.VerificationException: Error in execution: [ERROR] WARNING: Unknown module: org.junit.platform.commons specified to --add-opens
        at org.apache.maven.surefire.its.JUnitPlatformEnginesIT.testJupiterEngineWithDisplayNames(JUnitPlatformEnginesIT.java:350)
Caused by: org.apache.maven.it.VerificationException: Error in execution: [ERROR] WARNING: Unknown module: org.junit.platform.commons specified to --add-opens
        at org.apache.maven.surefire.its.JUnitPlatformEnginesIT.testJupiterEngineWithDisplayNames(JUnitPlatformEnginesIT.java:350)


FAILED:  org.apache.maven.surefire.its.JUnitPlatformEnginesIT.platform[1.4.2]

Error Message:
org.apache.maven.it.VerificationException: Error in execution: [ERROR] WARNING: Unknown module: org.junit.platform.commons specified to --add-opens

Stack Trace:
org.apache.maven.surefire.its.fixture.SurefireVerifierException: org.apache.maven.it.VerificationException: Error in execution: [ERROR] WARNING: Unknown module: org.junit.platform.commons specified to --add-opens
        at org.apache.maven.surefire.its.JUnitPlatformEnginesIT.platform(JUnitPlatformEnginesIT.java:110)
Caused by: org.apache.maven.it.VerificationException: Error in execution: [ERROR] WARNING: Unknown module: org.junit.platform.commons specified to --add-opens
        at org.apache.maven.surefire.its.JUnitPlatformEnginesIT.platform(JUnitPlatformEnginesIT.java:110)


FAILED:  org.apache.maven.surefire.its.JUnitPlatformEnginesIT.testTags[1.5.2]

Error Message:
org.apache.maven.it.VerificationException: Error in execution: [ERROR] WARNING: Unknown module: org.junit.platform.commons specified to --add-opens

Stack Trace:
org.apache.maven.surefire.its.fixture.SurefireVerifierException: org.apache.maven.it.VerificationException: Error in execution: [ERROR] WARNING: Unknown module: org.junit.platform.commons specified to --add-opens
        at org.apache.maven.surefire.its.JUnitPlatformEnginesIT.testTags(JUnitPlatformEnginesIT.java:401)
Caused by: org.apache.maven.it.VerificationException: Error in execution: [ERROR] WARNING: Unknown module: org.junit.platform.commons specified to --add-opens
        at org.apache.maven.surefire.its.JUnitPlatformEnginesIT.testTags(JUnitPlatformEnginesIT.java:401)


FAILED:  org.apache.maven.surefire.its.JUnitPlatformEnginesIT.testJupiterEngine[1.5.2]

Error Message:
org.apache.maven.it.VerificationException: Error in execution: [ERROR] WARNING: Unknown module: org.junit.platform.commons specified to --add-opens

Stack Trace:
org.apache.maven.surefire.its.fixture.SurefireVerifierException: org.apache.maven.it.VerificationException: Error in execution: [ERROR] WARNING: Unknown module: org.junit.platform.commons specified to --add-opens
        at org.apache.maven.surefire.its.JUnitPlatformEnginesIT.testJupiterEngine(JUnitPlatformEnginesIT.java:175)
Caused by: org.apache.maven.it.VerificationException: Error in execution: [ERROR] WARNING: Unknown module: org.junit.platform.commons specified to --add-opens
        at org.apache.maven.surefire.its.JUnitPlatformEnginesIT.testJupiterEngine(JUnitPlatformEnginesIT.java:175)


FAILED:  org.apache.maven.surefire.its.JUnitPlatformEnginesIT.testJupiterEngineWithDisplayNames[1.5.2]

Error Message:
org.apache.maven.it.VerificationException: Error in execution: [ERROR] WARNING: Unknown module: org.junit.platform.commons specified to --add-opens

Stack Trace:
org.apache.maven.surefire.its.fixture.SurefireVerifierException: org.apache.maven.it.VerificationException: Error in execution: [ERROR] WARNING: Unknown module: org.junit.platform.commons specified to --add-opens
        at org.apache.maven.surefire.its.JUnitPlatformEnginesIT.testJupiterEngineWithDisplayNames(JUnitPlatformEnginesIT.java:350)
Caused by: org.apache.maven.it.VerificationException: Error in execution: [ERROR] WARNING: Unknown module: org.junit.platform.commons specified to --add-opens
        at org.apache.maven.surefire.its.JUnitPlatformEnginesIT.testJupiterEngineWithDisplayNames(JUnitPlatformEnginesIT.java:350)


FAILED:  org.apache.maven.surefire.its.JUnitPlatformEnginesIT.platform[1.5.2]

Error Message:
org.apache.maven.it.VerificationException: Error in execution: [ERROR] WARNING: Unknown module: org.junit.platform.commons specified to --add-opens

Stack Trace:
org.apache.maven.surefire.its.fixture.SurefireVerifierException: org.apache.maven.it.VerificationException: Error in execution: [ERROR] WARNING: Unknown module: org.junit.platform.commons specified to --add-opens
        at org.apache.maven.surefire.its.JUnitPlatformEnginesIT.platform(JUnitPlatformEnginesIT.java:110)
Caused by: org.apache.maven.it.VerificationException: Error in execution: [ERROR] WARNING: Unknown module: org.junit.platform.commons specified to --add-opens
        at org.apache.maven.surefire.its.JUnitPlatformEnginesIT.platform(JUnitPlatformEnginesIT.java:110)


FAILED:  org.apache.maven.surefire.its.JUnitPlatformEnginesIT.testTags[1.6.2]

Error Message:
org.apache.maven.it.VerificationException: Error in execution: [ERROR] WARNING: Unknown module: org.junit.platform.commons specified to --add-opens

Stack Trace:
org.apache.maven.surefire.its.fixture.SurefireVerifierException: org.apache.maven.it.VerificationException: Error in execution: [ERROR] WARNING: Unknown module: org.junit.platform.commons specified to --add-opens
        at org.apache.maven.surefire.its.JUnitPlatformEnginesIT.testTags(JUnitPlatformEnginesIT.java:401)
Caused by: org.apache.maven.it.VerificationException: Error in execution: [ERROR] WARNING: Unknown module: org.junit.platform.commons specified to --add-opens
        at org.apache.maven.surefire.its.JUnitPlatformEnginesIT.testTags(JUnitPlatformEnginesIT.java:401)


FAILED:  org.apache.maven.surefire.its.JUnitPlatformEnginesIT.testJupiterEngine[1.6.2]

Error Message:
org.apache.maven.it.VerificationException: Error in execution: [ERROR] WARNING: Unknown module: org.junit.platform.commons specified to --add-opens

Stack Trace:
org.apache.maven.surefire.its.fixture.SurefireVerifierException: org.apache.maven.it.VerificationException: Error in execution: [ERROR] WARNING: Unknown module: org.junit.platform.commons specified to --add-opens
        at org.apache.maven.surefire.its.JUnitPlatformEnginesIT.testJupiterEngine(JUnitPlatformEnginesIT.java:175)
Caused by: org.apache.maven.it.VerificationException: Error in execution: [ERROR] WARNING: Unknown module: org.junit.platform.commons specified to --add-opens
        at org.apache.maven.surefire.its.JUnitPlatformEnginesIT.testJupiterEngine(JUnitPlatformEnginesIT.java:175)


FAILED:  org.apache.maven.surefire.its.JUnitPlatformEnginesIT.testJupiterEngineWithDisplayNames[1.6.2]

Error Message:
org.apache.maven.it.VerificationException: Error in execution: [ERROR] WARNING: Unknown module: org.junit.platform.commons specified to --add-opens

Stack Trace:
org.apache.maven.surefire.its.fixture.SurefireVerifierException: org.apache.maven.it.VerificationException: Error in execution: [ERROR] WARNING: Unknown module: org.junit.platform.commons specified to --add-opens
        at org.apache.maven.surefire.its.JUnitPlatformEnginesIT.testJupiterEngineWithDisplayNames(JUnitPlatformEnginesIT.java:350)
Caused by: org.apache.maven.it.VerificationException: Error in execution: [ERROR] WARNING: Unknown module: org.junit.platform.commons specified to --add-opens
        at org.apache.maven.surefire.its.JUnitPlatformEnginesIT.testJupiterEngineWithDisplayNames(JUnitPlatformEnginesIT.java:350)


FAILED:  org.apache.maven.surefire.its.JUnitPlatformEnginesIT.platform[1.6.2]

Error Message:
org.apache.maven.it.VerificationException: Error in execution: [ERROR] WARNING: Unknown module: org.junit.platform.commons specified to --add-opens

Stack Trace:
org.apache.maven.surefire.its.fixture.SurefireVerifierException: org.apache.maven.it.VerificationException: Error in execution: [ERROR] WARNING: Unknown module: org.junit.platform.commons specified to --add-opens
        at org.apache.maven.surefire.its.JUnitPlatformEnginesIT.platform(JUnitPlatformEnginesIT.java:110)
Caused by: org.apache.maven.it.VerificationException: Error in execution: [ERROR] WARNING: Unknown module: org.junit.platform.commons specified to --add-opens
        at org.apache.maven.surefire.its.JUnitPlatformEnginesIT.platform(JUnitPlatformEnginesIT.java:110)


FAILED:  org.apache.maven.surefire.its.JUnitPlatformStreamCorruptionIT.warningIsNotEmitted

Error Message:
org.apache.maven.it.VerificationException: Error in execution: [ERROR] WARNING: Unknown module: org.junit.platform.commons specified to --add-opens

Stack Trace:
org.apache.maven.surefire.its.fixture.SurefireVerifierException: org.apache.maven.it.VerificationException: Error in execution: [ERROR] WARNING: Unknown module: org.junit.platform.commons specified to --add-opens
        at org.apache.maven.surefire.its.JUnitPlatformStreamCorruptionIT.warningIsNotEmitted(JUnitPlatformStreamCorruptionIT.java:52)
Caused by: org.apache.maven.it.VerificationException: Error in execution: [ERROR] WARNING: Unknown module: org.junit.platform.commons specified to --add-opens
        at org.apache.maven.surefire.its.JUnitPlatformStreamCorruptionIT.warningIsNotEmitted(JUnitPlatformStreamCorruptionIT.java:52)


FAILED:  org.apache.maven.surefire.its.RunOrderIT.testHourlyJUnit5

Error Message:
org.apache.maven.it.VerificationException: Error in execution: [ERROR] WARNING: Unknown module: org.junit.platform.commons specified to --add-opens

Stack Trace:
org.apache.maven.surefire.its.fixture.SurefireVerifierException: org.apache.maven.it.VerificationException: Error in execution: [ERROR] WARNING: Unknown module: org.junit.platform.commons specified to --add-opens
        at org.apache.maven.surefire.its.RunOrderIT.executeWithRunOrder(RunOrderIT.java:149)
        at org.apache.maven.surefire.its.RunOrderIT.testHourlyJUnit5(RunOrderIT.java:103)
Caused by: org.apache.maven.it.VerificationException: Error in execution: [ERROR] WARNING: Unknown module: org.junit.platform.commons specified to --add-opens
        at org.apache.maven.surefire.its.RunOrderIT.executeWithRunOrder(RunOrderIT.java:149)
        at org.apache.maven.surefire.its.RunOrderIT.testHourlyJUnit5(RunOrderIT.java:103)


FAILED:  org.apache.maven.surefire.its.RunOrderIT.testReverseAlphabeticalJUnit5

Error Message:
org.apache.maven.it.VerificationException: Error in execution: [ERROR] WARNING: Unknown module: org.junit.platform.commons specified to --add-opens

Stack Trace:
org.apache.maven.surefire.its.fixture.SurefireVerifierException: org.apache.maven.it.VerificationException: Error in execution: [ERROR] WARNING: Unknown module: org.junit.platform.commons specified to --add-opens
        at org.apache.maven.surefire.its.RunOrderIT.executeWithRunOrder(RunOrderIT.java:149)
        at org.apache.maven.surefire.its.RunOrderIT.testReverseAlphabeticalJUnit5(RunOrderIT.java:76)
Caused by: org.apache.maven.it.VerificationException: Error in execution: [ERROR] WARNING: Unknown module: org.junit.platform.commons specified to --add-opens
        at org.apache.maven.surefire.its.RunOrderIT.executeWithRunOrder(RunOrderIT.java:149)
        at org.apache.maven.surefire.its.RunOrderIT.testReverseAlphabeticalJUnit5(RunOrderIT.java:76)


FAILED:  org.apache.maven.surefire.its.RunOrderIT.testAlphabeticalJUnit5

Error Message:
org.apache.maven.it.VerificationException: Error in execution: [ERROR] WARNING: Unknown module: org.junit.platform.commons specified to --add-opens

Stack Trace:
org.apache.maven.surefire.its.fixture.SurefireVerifierException: org.apache.maven.it.VerificationException: Error in execution: [ERROR] WARNING: Unknown module: org.junit.platform.commons specified to --add-opens
        at org.apache.maven.surefire.its.RunOrderIT.executeWithRunOrder(RunOrderIT.java:149)
        at org.apache.maven.surefire.its.RunOrderIT.testAlphabeticalJUnit5(RunOrderIT.java:59)
Caused by: org.apache.maven.it.VerificationException: Error in execution: [ERROR] WARNING: Unknown module: org.junit.platform.commons specified to --add-opens
        at org.apache.maven.surefire.its.RunOrderIT.executeWithRunOrder(RunOrderIT.java:149)
        at org.apache.maven.surefire.its.RunOrderIT.testAlphabeticalJUnit5(RunOrderIT.java:59)


FAILED:  org.apache.maven.surefire.its.RunOrderParallelForksIT.testHourlyJUnit5

Error Message:
org.apache.maven.it.VerificationException: Error in execution: [ERROR] WARNING: Unknown module: org.junit.platform.commons specified to --add-opens

Stack Trace:
org.apache.maven.surefire.its.fixture.SurefireVerifierException: org.apache.maven.it.VerificationException: Error in execution: [ERROR] WARNING: Unknown module: org.junit.platform.commons specified to --add-opens
Caused by: org.apache.maven.it.VerificationException: Error in execution: [ERROR] WARNING: Unknown module: org.junit.platform.commons specified to --add-opens


FAILED:  org.apache.maven.surefire.its.RunOrderParallelForksIT.testReverseAlphabeticalJUnit5

Error Message:
org.apache.maven.it.VerificationException: Error in execution: [ERROR] WARNING: Unknown module: org.junit.platform.commons specified to --add-opens

Stack Trace:
org.apache.maven.surefire.its.fixture.SurefireVerifierException: org.apache.maven.it.VerificationException: Error in execution: [ERROR] WARNING: Unknown module: org.junit.platform.commons specified to --add-opens
Caused by: org.apache.maven.it.VerificationException: Error in execution: [ERROR] WARNING: Unknown module: org.junit.platform.commons specified to --add-opens


FAILED:  org.apache.maven.surefire.its.RunOrderParallelForksIT.testAlphabeticalJUnit5

Error Message:
org.apache.maven.it.VerificationException: Error in execution: [ERROR] WARNING: Unknown module: org.junit.platform.commons specified to --add-opens

Stack Trace:
org.apache.maven.surefire.its.fixture.SurefireVerifierException: org.apache.maven.it.VerificationException: Error in execution: [ERROR] WARNING: Unknown module: org.junit.platform.commons specified to --add-opens
Caused by: org.apache.maven.it.VerificationException: Error in execution: [ERROR] WARNING: Unknown module: org.junit.platform.commons specified to --add-opens


FAILED:  org.apache.maven.surefire.its.jiras.Surefire1534ReuseForksFalseWithJavaModuleIT.testExecuteWithReuseForksFalseWithJavaModule

Error Message:
org.apache.maven.it.VerificationException: Error in execution: [ERROR] WARNING: Unknown module: org.junit.platform.commons specified to --add-opens

Stack Trace:
org.apache.maven.surefire.its.fixture.SurefireVerifierException: org.apache.maven.it.VerificationException: Error in execution: [ERROR] WARNING: Unknown module: org.junit.platform.commons specified to --add-opens
        at org.apache.maven.surefire.its.jiras.Surefire1534ReuseForksFalseWithJavaModuleIT.testExecuteWithReuseForksFalseWithJavaModule(Surefire1534ReuseForksFalseWithJavaModuleIT.java:49)
Caused by: org.apache.maven.it.VerificationException: Error in execution: [ERROR] WARNING: Unknown module: org.junit.platform.commons specified to --add-opens
        at org.apache.maven.surefire.its.jiras.Surefire1534ReuseForksFalseWithJavaModuleIT.testExecuteWithReuseForksFalseWithJavaModule(Surefire1534ReuseForksFalseWithJavaModuleIT.java:49)


FAILED:  org.apache.maven.surefire.its.jiras.Surefire1534ReuseForksFalseWithJavaModuleIT.testExecuteWithReuseForksFalseWithJavaModuleWithFilter

Error Message:
org.apache.maven.it.VerificationException: Error in execution: [ERROR] WARNING: Unknown module: org.junit.platform.commons specified to --add-opens

Stack Trace:
org.apache.maven.surefire.its.fixture.SurefireVerifierException: org.apache.maven.it.VerificationException: Error in execution: [ERROR] WARNING: Unknown module: org.junit.platform.commons specified to --add-opens
        at org.apache.maven.surefire.its.jiras.Surefire1534ReuseForksFalseWithJavaModuleIT.testExecuteWithReuseForksFalseWithJavaModuleWithFilter(Surefire1534ReuseForksFalseWithJavaModuleIT.java:70)
Caused by: org.apache.maven.it.VerificationException: Error in execution: [ERROR] WARNING: Unknown module: org.junit.platform.commons specified to --add-opens
        at org.apache.maven.surefire.its.jiras.Surefire1534ReuseForksFalseWithJavaModuleIT.testExecuteWithReuseForksFalseWithJavaModuleWithFilter(Surefire1534ReuseForksFalseWithJavaModuleIT.java:70)


FAILED:  org.apache.maven.surefire.its.jiras.Surefire1570ModularFailsafeIT.shouldRunWithJupiterApi

Error Message:
org.apache.maven.it.VerificationException: Error in execution: [ERROR] WARNING: Unknown module: org.junit.platform.commons specified to --add-opens

Stack Trace:
org.apache.maven.surefire.its.fixture.SurefireVerifierException: org.apache.maven.it.VerificationException: Error in execution: [ERROR] WARNING: Unknown module: org.junit.platform.commons specified to --add-opens
        at org.apache.maven.surefire.its.jiras.Surefire1570ModularFailsafeIT.shouldRunWithJupiterApi(Surefire1570ModularFailsafeIT.java:50)
Caused by: org.apache.maven.it.VerificationException: Error in execution: [ERROR] WARNING: Unknown module: org.junit.platform.commons specified to --add-opens
        at org.apache.maven.surefire.its.jiras.Surefire1570ModularFailsafeIT.shouldRunWithJupiterApi(Surefire1570ModularFailsafeIT.java:50)


FAILED:  org.apache.maven.surefire.its.jiras.Surefire1585IT.shouldRunWithJupiterApi

Error Message:
org.apache.maven.it.VerificationException: Error in execution: [ERROR] WARNING: Unknown module: org.junit.platform.commons specified to --add-opens

Stack Trace:
org.apache.maven.surefire.its.fixture.SurefireVerifierException: org.apache.maven.it.VerificationException: Error in execution: [ERROR] WARNING: Unknown module: org.junit.platform.commons specified to --add-opens
        at org.apache.maven.surefire.its.jiras.Surefire1585IT.shouldRunWithJupiterApi(Surefire1585IT.java:47)
Caused by: org.apache.maven.it.VerificationException: Error in execution: [ERROR] WARNING: Unknown module: org.junit.platform.commons specified to --add-opens
        at org.apache.maven.surefire.its.jiras.Surefire1585IT.shouldRunWithJupiterApi(Surefire1585IT.java:47)


FAILED:  org.apache.maven.surefire.its.jiras.Surefire1585IT.shouldRunWithVintage

Error Message:
org.apache.maven.it.VerificationException: Error in execution: [ERROR] WARNING: Unknown module: org.junit.platform.commons specified to --add-opens

Stack Trace:
org.apache.maven.surefire.its.fixture.SurefireVerifierException: org.apache.maven.it.VerificationException: Error in execution: [ERROR] WARNING: Unknown module: org.junit.platform.commons specified to --add-opens
        at org.apache.maven.surefire.its.jiras.Surefire1585IT.shouldRunWithVintage(Surefire1585IT.java:56)
Caused by: org.apache.maven.it.VerificationException: Error in execution: [ERROR] WARNING: Unknown module: org.junit.platform.commons specified to --add-opens
        at org.apache.maven.surefire.its.jiras.Surefire1585IT.shouldRunWithVintage(Surefire1585IT.java:56)


FAILED:  org.apache.maven.surefire.its.jiras.Surefire1787JUnit5IT.apiAndEngine

Error Message:
org.apache.maven.it.VerificationException: Error in execution: [ERROR] WARNING: Unknown module: org.junit.platform.commons specified to --add-opens

Stack Trace:
org.apache.maven.surefire.its.fixture.SurefireVerifierException: org.apache.maven.it.VerificationException: Error in execution: [ERROR] WARNING: Unknown module: org.junit.platform.commons specified to --add-opens
        at org.apache.maven.surefire.its.jiras.Surefire1787JUnit5IT.apiAndEngine(Surefire1787JUnit5IT.java:57)
Caused by: org.apache.maven.it.VerificationException: Error in execution: [ERROR] WARNING: Unknown module: org.junit.platform.commons specified to --add-opens
        at org.apache.maven.surefire.its.jiras.Surefire1787JUnit5IT.apiAndEngine(Surefire1787JUnit5IT.java:57)


FAILED:  org.apache.maven.surefire.its.jiras.Surefire1787JUnit5IT.testNgWithJupiterApi

Error Message:
org.apache.maven.it.VerificationException: Error in execution: [ERROR] WARNING: Unknown module: org.junit.platform.commons specified to --add-opens

Stack Trace:
org.apache.maven.surefire.its.fixture.SurefireVerifierException: org.apache.maven.it.VerificationException: Error in execution: [ERROR] WARNING: Unknown module: org.junit.platform.commons specified to --add-opens
        at org.apache.maven.surefire.its.jiras.Surefire1787JUnit5IT.testNgWithJupiterApi(Surefire1787JUnit5IT.java:99)
Caused by: org.apache.maven.it.VerificationException: Error in execution: [ERROR] WARNING: Unknown module: org.junit.platform.commons specified to --add-opens
        at org.apache.maven.surefire.its.jiras.Surefire1787JUnit5IT.testNgWithJupiterApi(Surefire1787JUnit5IT.java:99)


FAILED:  org.apache.maven.surefire.its.jiras.Surefire1787JUnit5IT.bothEngines

Error Message:
org.apache.maven.it.VerificationException: Error in execution: [ERROR] WARNING: Unknown module: org.junit.platform.commons specified to --add-opens

Stack Trace:
org.apache.maven.surefire.its.fixture.SurefireVerifierException: org.apache.maven.it.VerificationException: Error in execution: [ERROR] WARNING: Unknown module: org.junit.platform.commons specified to --add-opens
        at org.apache.maven.surefire.its.jiras.Surefire1787JUnit5IT.bothEngines(Surefire1787JUnit5IT.java:46)
Caused by: org.apache.maven.it.VerificationException: Error in execution: [ERROR] WARNING: Unknown module: org.junit.platform.commons specified to --add-opens
        at org.apache.maven.surefire.its.jiras.Surefire1787JUnit5IT.bothEngines(Surefire1787JUnit5IT.java:46)


FAILED:  org.apache.maven.surefire.its.jiras.Surefire1787JUnit5IT.selectJUnit4

Error Message:
org.apache.maven.it.VerificationException: Error in execution: [ERROR] WARNING: Unknown module: org.junit.platform.commons specified to --add-opens

Stack Trace:
org.apache.maven.surefire.its.fixture.SurefireVerifierException: org.apache.maven.it.VerificationException: Error in execution: [ERROR] WARNING: Unknown module: org.junit.platform.commons specified to --add-opens
        at org.apache.maven.surefire.its.jiras.Surefire1787JUnit5IT.selectJUnit4(Surefire1787JUnit5IT.java:79)
Caused by: org.apache.maven.it.VerificationException: Error in execution: [ERROR] WARNING: Unknown module: org.junit.platform.commons specified to --add-opens
        at org.apache.maven.surefire.its.jiras.Surefire1787JUnit5IT.selectJUnit4(Surefire1787JUnit5IT.java:79)


FAILED:  org.apache.maven.surefire.its.jiras.Surefire1787JUnit5IT.selectJUnit5

Error Message:
org.apache.maven.it.VerificationException: Error in execution: [ERROR] WARNING: Unknown module: org.junit.platform.commons specified to --add-opens

Stack Trace:
org.apache.maven.surefire.its.fixture.SurefireVerifierException: org.apache.maven.it.VerificationException: Error in execution: [ERROR] WARNING: Unknown module: org.junit.platform.commons specified to --add-opens
        at org.apache.maven.surefire.its.jiras.Surefire1787JUnit5IT.selectJUnit5(Surefire1787JUnit5IT.java:89)
Caused by: org.apache.maven.it.VerificationException: Error in execution: [ERROR] WARNING: Unknown module: org.junit.platform.commons specified to --add-opens
        at org.apache.maven.surefire.its.jiras.Surefire1787JUnit5IT.selectJUnit5(Surefire1787JUnit5IT.java:89)


FAILED:  org.apache.maven.surefire.its.jiras.Surefire1787JUnit5IT.testNgWithJupiterEngine

Error Message:
org.apache.maven.it.VerificationException: Error in execution: [ERROR] WARNING: Unknown module: org.junit.platform.commons specified to --add-opens

Stack Trace:
org.apache.maven.surefire.its.fixture.SurefireVerifierException: org.apache.maven.it.VerificationException: Error in execution: [ERROR] WARNING: Unknown module: org.junit.platform.commons specified to --add-opens
        at org.apache.maven.surefire.its.jiras.Surefire1787JUnit5IT.testNgWithJupiterEngine(Surefire1787JUnit5IT.java:110)
Caused by: org.apache.maven.it.VerificationException: Error in execution: [ERROR] WARNING: Unknown module: org.junit.platform.commons specified to --add-opens
        at org.apache.maven.surefire.its.jiras.Surefire1787JUnit5IT.testNgWithJupiterEngine(Surefire1787JUnit5IT.java:110)


FAILED:  org.apache.maven.surefire.its.jiras.Surefire1787JUnit5IT.bothApis

Error Message:
org.apache.maven.it.VerificationException: Error in execution: [ERROR] WARNING: Unknown module: org.junit.platform.commons specified to --add-opens

Stack Trace:
org.apache.maven.surefire.its.fixture.SurefireVerifierException: org.apache.maven.it.VerificationException: Error in execution: [ERROR] WARNING: Unknown module: org.junit.platform.commons specified to --add-opens
        at org.apache.maven.surefire.its.jiras.Surefire1787JUnit5IT.bothApis(Surefire1787JUnit5IT.java:68)
Caused by: org.apache.maven.it.VerificationException: Error in execution: [ERROR] WARNING: Unknown module: org.junit.platform.commons specified to --add-opens
        at org.apache.maven.surefire.its.jiras.Surefire1787JUnit5IT.bothApis(Surefire1787JUnit5IT.java:68)




Build log:
[...truncated 138407 lines...]
[Pipeline] // stage
[Pipeline] fileExists
[Pipeline] zip
[2020-05-23T01:47:53.849Z] Writing zip file of C:\Windows\system32\config\systemprofile\AppData\Local\Temp\jenkins-maven-box-maven-surefire-SUREFIRE-1733-10\maven-failsafe-plugin\target\it to C:\Windows\system32\config\systemprofile\AppData\Local\Temp\jenkins-maven-box-maven-surefire-SUREFIRE-1733-10\maven-failsafe-plugin--windows-jdk15-maven3.6.x.zip
[2020-05-23T01:47:54.170Z] Zipped 78 entries.
[2020-05-23T01:47:54.170Z] Archiving C:\Windows\system32\config\systemprofile\AppData\Local\Temp\jenkins-maven-box-maven-surefire-SUREFIRE-1733-10\maven-failsafe-plugin--windows-jdk15-maven3.6.x.zip
[2020-05-23T01:47:54.172Z] [Fast Archiver] No artifacts from Maven TLP » maven-surefire » SUREFIRE-1733 #9 to compare, so performing full copy of artifacts
[2020-05-23T01:47:54.316Z] [INFO] Tests run: 6, Failures: 0, Errors: 0, Skipped: 0, Time elapsed: 116.865 s - in org.apache.maven.surefire.its.jiras.Surefire946KillMainProcessInReusableForkIT
[2020-05-23T01:47:54.316Z] [INFO] Running org.apache.maven.surefire.its.jiras.Surefire972BizarreNoClassDefIT
[2020-05-23T01:47:54.316Z] [INFO] Tests run: 1, Failures: 0, Errors: 0, Skipped: 0, Time elapsed: 9.357 s - in org.apache.maven.surefire.its.jiras.Surefire972BizarreNoClassDefIT
[2020-05-23T01:47:54.316Z] [INFO] Running org.apache.maven.surefire.its.jiras.Surefire975DefaultVMEncodingIT
[Pipeline] fileExists
[Pipeline] zip
[2020-05-23T01:47:54.429Z] Writing zip file of C:\Windows\system32\config\systemprofile\AppData\Local\Temp\jenkins-maven-box-maven-surefire-SUREFIRE-1733-10\surefire-its\target to C:\Windows\system32\config\systemprofile\AppData\Local\Temp\jenkins-maven-box-maven-surefire-SUREFIRE-1733-10\surefire-its--windows-jdk15-maven3.6.x.zip
[2020-05-23T01:47:55.758Z] [INFO] Tests run: 1, Failures: 0, Errors: 0, Skipped: 0, Time elapsed: 6.017 s - in org.apache.maven.surefire.its.jiras.Surefire975DefaultVMEncodingIT
[2020-05-23T01:47:55.758Z] [INFO] Running org.apache.maven.surefire.its.jiras.Surefire979WrongClassLoaderIT
[Pipeline] cleanWs
[2020-05-23T01:48:01.038Z] [WS-CLEANUP] Deleting project workspace...
[2020-05-23T01:48:01.039Z] [WS-CLEANUP] Deferred wipeout is used...
[2020-05-23T01:48:01.168Z] [WS-CLEANUP] done
[Pipeline] }
[Pipeline] // ws
[Pipeline] }
[Pipeline] // timestamps
[Pipeline] }
[Pipeline] // node
[Pipeline] }
[2020-05-23T01:48:02.441Z] [INFO] Tests run: 1, Failures: 0, Errors: 0, Skipped: 0, Time elapsed: 6.334 s - in org.apache.maven.surefire.its.jiras.Surefire979WrongClassLoaderIT
[2020-05-23T01:48:02.441Z] [INFO] Running org.apache.maven.surefire.its.jiras.Surefire985ParameterizedRunnerAndCategoriesIT
[2020-05-23T01:48:07.838Z] [INFO] Tests run: 1, Failures: 0, Errors: 0, Skipped: 0, Time elapsed: 5.748 s - in org.apache.maven.surefire.its.jiras.Surefire985ParameterizedRunnerAndCategoriesIT
[2020-05-23T01:48:07.838Z] [INFO] Running org.apache.maven.surefire.its.jiras.Surefire995CategoryInheritanceIT
[2020-05-23T01:48:54.863Z] [INFO] Tests run: 7, Failures: 0, Errors: 0, Skipped: 0, Time elapsed: 42.165 s - in org.apache.maven.surefire.its.jiras.Surefire995CategoryInheritanceIT
[2020-05-23T01:48:54.863Z] [INFO]
[2020-05-23T01:48:54.863Z] [INFO] Results:
[2020-05-23T01:48:54.863Z] [INFO]
[2020-05-23T01:48:54.863Z] [ERROR] Errors:
[2020-05-23T01:48:54.863Z] [ERROR]   JUnitPlatformEnginesIT.platform:110 » SurefireVerifier org.apache.maven.it.Ver...
[2020-05-23T01:48:54.863Z] [ERROR]   JUnitPlatformEnginesIT.platform:110 » SurefireVerifier org.apache.maven.it.Ver...
[2020-05-23T01:48:54.863Z] [ERROR]   JUnitPlatformEnginesIT.platform:110 » SurefireVerifier org.apache.maven.it.Ver...
[2020-05-23T01:48:54.863Z] [ERROR]   JUnitPlatformEnginesIT.platform:110 » SurefireVerifier org.apache.maven.it.Ver...
[2020-05-23T01:48:54.863Z] [ERROR]   JUnitPlatformEnginesIT.platform:110 » SurefireVerifier org.apache.maven.it.Ver...
[2020-05-23T01:48:54.863Z] [ERROR]   JUnitPlatformEnginesIT.platform:110 » SurefireVerifier org.apache.maven.it.Ver...
[2020-05-23T01:48:54.863Z] [ERROR]   JUnitPlatformEnginesIT.platform:110 » SurefireVerifier org.apache.maven.it.Ver...
[2020-05-23T01:48:54.863Z] [ERROR]   JUnitPlatformEnginesIT.testJupiterEngineWithDisplayNames:350 » SurefireVerifier
[2020-05-23T01:48:54.863Z] [ERROR]   JUnitPlatformEnginesIT.testJupiterEngineWithDisplayNames:350 » SurefireVerifier
[2020-05-23T01:48:54.863Z] [ERROR]   JUnitPlatformEnginesIT.testJupiterEngineWithDisplayNames:350 » SurefireVerifier
[2020-05-23T01:48:54.863Z] [ERROR]   JUnitPlatformEnginesIT.testJupiterEngineWithDisplayNames:350 » SurefireVerifier
[2020-05-23T01:48:54.863Z] [ERROR]   JUnitPlatformEnginesIT.testJupiterEngineWithDisplayNames:350 » SurefireVerifier
[2020-05-23T01:48:54.863Z] [ERROR]   JUnitPlatformEnginesIT.testJupiterEngineWithDisplayNames:350 » SurefireVerifier
[2020-05-23T01:48:54.863Z] [ERROR]   JUnitPlatformEnginesIT.testJupiterEngineWithDisplayNames:350 » SurefireVerifier
[2020-05-23T01:48:54.863Z] [ERROR]   JUnitPlatformEnginesIT.testJupiterEngine:175 » SurefireVerifier org.apache.mav...
[2020-05-23T01:48:54.863Z] [ERROR]   JUnitPlatformEnginesIT.testJupiterEngine:175 » SurefireVerifier org.apache.mav...
[2020-05-23T01:48:54.863Z] [ERROR]   JUnitPlatformEnginesIT.testJupiterEngine:175 » SurefireVerifier org.apache.mav...
[2020-05-23T01:48:54.863Z] [ERROR]   JUnitPlatformEnginesIT.testJupiterEngine:175 » SurefireVerifier org.apache.mav...
[2020-05-23T01:48:54.863Z] [ERROR]   JUnitPlatformEnginesIT.testJupiterEngine:175 » SurefireVerifier org.apache.mav...
[2020-05-23T01:48:54.863Z] [ERROR]   JUnitPlatformEnginesIT.testJupiterEngine:175 » SurefireVerifier org.apache.mav...
[2020-05-23T01:48:54.863Z] [ERROR]   JUnitPlatformEnginesIT.testJupiterEngine:175 » SurefireVerifier org.apache.mav...
[2020-05-23T01:48:54.863Z] [ERROR]   JUnitPlatformEnginesIT.testTags:401 » SurefireVerifier org.apache.maven.it.Ver...
[2020-05-23T01:48:54.863Z] [ERROR]   JUnitPlatformEnginesIT.testTags:401 » SurefireVerifier org.apache.maven.it.Ver...
[2020-05-23T01:48:54.863Z] [ERROR]   JUnitPlatformEnginesIT.testTags:401 » SurefireVerifier org.apache.maven.it.Ver...
[2020-05-23T01:48:54.863Z] [ERROR]   JUnitPlatformEnginesIT.testTags:401 » SurefireVerifier org.apache.maven.it.Ver...
[2020-05-23T01:48:54.863Z] [ERROR]   JUnitPlatformEnginesIT.testTags:401 » SurefireVerifier org.apache.maven.it.Ver...
[2020-05-23T01:48:54.863Z] [ERROR]   JUnitPlatformEnginesIT.testTags:401 » SurefireVerifier org.apache.maven.it.Ver...
[2020-05-23T01:48:54.863Z] [ERROR]   JUnitPlatformStreamCorruptionIT.warningIsNotEmitted:52 » SurefireVerifier org....
[2020-05-23T01:48:54.863Z] [ERROR]   RunOrderIT.testAlphabeticalJUnit5:59->executeWithRunOrder:149 » SurefireVerifier
[2020-05-23T01:48:54.863Z] [ERROR]   RunOrderIT.testHourlyJUnit5:103->executeWithRunOrder:149 » SurefireVerifier or...
[2020-05-23T01:48:54.863Z] [ERROR]   RunOrderIT.testReverseAlphabeticalJUnit5:76->executeWithRunOrder:149 » SurefireVerifier
[2020-05-23T01:48:54.863Z] [ERROR]   RunOrderParallelForksIT>RunOrderIT.testAlphabeticalJUnit5:59->RunOrderIT.executeWithRunOrder:149 » SurefireVerifier
[2020-05-23T01:48:54.863Z] [ERROR]   RunOrderParallelForksIT>RunOrderIT.testHourlyJUnit5:103->RunOrderIT.executeWithRunOrder:149 » SurefireVerifier
[2020-05-23T01:48:54.863Z] [ERROR]   RunOrderParallelForksIT>RunOrderIT.testReverseAlphabeticalJUnit5:76->RunOrderIT.executeWithRunOrder:149 » SurefireVerifier
[2020-05-23T01:48:54.863Z] [ERROR]   SpockIT.test:41 » SurefireVerifier org.apache.maven.it.VerificationException: ...
[2020-05-23T01:48:54.863Z] [ERROR]   Surefire1534ReuseForksFalseWithJavaModuleIT.testExecuteWithReuseForksFalseWithJavaModule:49 » SurefireVerifier
[2020-05-23T01:48:54.864Z] [ERROR]   Surefire1534ReuseForksFalseWithJavaModuleIT.testExecuteWithReuseForksFalseWithJavaModuleWithFilter:70 » SurefireVerifier
[2020-05-23T01:48:54.864Z] [ERROR]   Surefire1570ModularFailsafeIT.shouldRunWithJupiterApi:50 » SurefireVerifier or...
[2020-05-23T01:48:54.864Z] [ERROR]   Surefire1585IT.shouldRunWithJupiterApi:47 » SurefireVerifier org.apache.maven....
[2020-05-23T01:48:54.864Z] [ERROR]   Surefire1585IT.shouldRunWithVintage:56 » SurefireVerifier org.apache.maven.it....
[2020-05-23T01:48:54.864Z] [ERROR]   Surefire1787JUnit5IT.apiAndEngine:57 » SurefireVerifier org.apache.maven.it.Ve...
[2020-05-23T01:48:54.864Z] [ERROR]   Surefire1787JUnit5IT.bothApis:68 » SurefireVerifier org.apache.maven.it.Verifi...
[2020-05-23T01:48:54.864Z] [ERROR]   Surefire1787JUnit5IT.bothEngines:46 » SurefireVerifier org.apache.maven.it.Ver...
[2020-05-23T01:48:54.864Z] [ERROR]   Surefire1787JUnit5IT.selectJUnit4:79 » SurefireVerifier org.apache.maven.it.Ve...
[2020-05-23T01:48:54.864Z] [ERROR]   Surefire1787JUnit5IT.selectJUnit5:89 » SurefireVerifier org.apache.maven.it.Ve...
[2020-05-23T01:48:54.864Z] [ERROR]   Surefire1787JUnit5IT.testNgWithJupiterApi:99 » SurefireVerifier org.apache.mav...
[2020-05-23T01:48:54.864Z] [ERROR]   Surefire1787JUnit5IT.testNgWithJupiterEngine:110 » SurefireVerifier org.apache...
[2020-05-23T01:48:54.864Z] [INFO]
[2020-05-23T01:48:54.864Z] [ERROR] Tests run: 957, Failures: 0, Errors: 47, Skipped: 137
[2020-05-23T01:48:54.864Z] [INFO]
[2020-05-23T01:48:54.864Z] [INFO]
[2020-05-23T01:48:54.864Z] [INFO] --- maven-checkstyle-plugin:3.0.0:check (checkstyle-check) @ surefire-its ---
[2020-05-23T01:48:54.864Z] [INFO]
[2020-05-23T01:48:54.864Z] [INFO] --- maven-failsafe-plugin:3.0.0-M4:verify (default) @ surefire-its ---
[2020-05-23T01:48:54.864Z] [INFO] Failsafe report directory: C:\Users\jenkins\AppData\Local\Temp\2\jenkins-maven-box-maven-surefire-SUREFIRE-1733-10\surefire-its\target\failsafe-reports
[2020-05-23T01:48:54.864Z] [INFO] ------------------------------------------------------------------------
[2020-05-23T01:48:54.864Z] [INFO] Reactor Summary for Apache Maven Surefire 3.0.0-SNAPSHOT:
[2020-05-23T01:48:54.864Z] [INFO]
[2020-05-23T01:48:54.864Z] [INFO] Apache Maven Surefire .............................. SUCCESS [ 45.585 s]
[2020-05-23T01:48:54.864Z] [INFO] SureFire Logger API ................................ SUCCESS [ 17.706 s]
[2020-05-23T01:48:54.864Z] [INFO] SureFire API ....................................... SUCCESS [ 20.473 s]
[2020-05-23T01:48:54.864Z] [INFO] Surefire Extensions API ............................ SUCCESS [  5.939 s]
[2020-05-23T01:48:54.864Z] [INFO] Surefire Extensions SPI ............................ SUCCESS [  2.081 s]
[2020-05-23T01:48:54.864Z] [INFO] SureFire Booter .................................... SUCCESS [ 20.914 s]
[2020-05-23T01:48:54.864Z] [INFO] Maven Surefire Test-Grouping Support ............... SUCCESS [  8.542 s]
[2020-05-23T01:48:54.864Z] [INFO] SureFire Providers ................................. SUCCESS [  0.909 s]
[2020-05-23T01:48:54.864Z] [INFO] Shared JUnit3 Provider Code ........................ SUCCESS [  3.854 s]
[2020-05-23T01:48:54.864Z] [INFO] Shared Java 5 Provider Base ........................ SUCCESS [  5.138 s]
[2020-05-23T01:48:54.864Z] [INFO] Shared JUnit4 Provider Code ........................ SUCCESS [  5.448 s]
[2020-05-23T01:48:54.864Z] [INFO] Shared JUnit48 Provider Code ....................... SUCCESS [  8.790 s]
[2020-05-23T01:48:54.864Z] [INFO] SureFire JUnit Runner .............................. SUCCESS [  4.354 s]
[2020-05-23T01:48:54.864Z] [INFO] SureFire JUnit4 Runner ............................. SUCCESS [  4.346 s]
[2020-05-23T01:48:54.864Z] [INFO] Maven Surefire Common .............................. SUCCESS [ 52.592 s]
[2020-05-23T01:48:54.864Z] [INFO] SureFire JUnitCore Runner .......................... SUCCESS [02:20 min]
[2020-05-23T01:48:54.864Z] [INFO] SureFire JUnit Platform Runner ..................... SUCCESS [ 11.478 s]
[2020-05-23T01:48:54.864Z] [INFO] SureFire TestNG Utils .............................. SUCCESS [  4.702 s]
[2020-05-23T01:48:54.864Z] [INFO] SureFire TestNG Runner ............................. SUCCESS [  7.177 s]
[2020-05-23T01:48:54.864Z] [INFO] ShadeFire JUnit3 Provider .......................... SUCCESS [  2.158 s]
[2020-05-23T01:48:54.864Z] [INFO] Surefire Report Parser ............................. SUCCESS [  6.490 s]
[2020-05-23T01:48:54.864Z] [INFO] Maven Surefire Plugin .............................. SUCCESS [ 12.123 s]
[2020-05-23T01:48:54.864Z] [INFO] Maven Failsafe Plugin .............................. SUCCESS [01:17 min]
[2020-05-23T01:48:54.864Z] [INFO] Maven Surefire Report Plugin ....................... SUCCESS [ 17.743 s]
[2020-05-23T01:48:54.864Z] [INFO] Maven Surefire Integration Tests ................... FAILURE [  01:37 h]
[2020-05-23T01:48:54.864Z] [INFO] Surefire Shared Utils .............................. SKIPPED
[2020-05-23T01:48:54.864Z] [INFO] ------------------------------------------------------------------------
[2020-05-23T01:48:54.864Z] [INFO] BUILD FAILURE
[2020-05-23T01:48:54.864Z] [INFO] ------------------------------------------------------------------------
[2020-05-23T01:48:54.864Z] [INFO] Total time:  01:45 h
[2020-05-23T01:48:54.864Z] [INFO] Finished at: 2020-05-22T18:48:51-07:00
[2020-05-23T01:48:54.864Z] [INFO] ------------------------------------------------------------------------
[2020-05-23T01:48:54.864Z] [ERROR] Failed to execute goal org.apache.maven.plugins:maven-failsafe-plugin:3.0.0-M4:verify (default) on project surefire-its: There are test failures.
[2020-05-23T01:48:54.864Z] [ERROR]
[2020-05-23T01:48:54.864Z] [ERROR] Please refer to C:\Users\jenkins\AppData\Local\Temp\2\jenkins-maven-box-maven-surefire-SUREFIRE-1733-10\surefire-its\target\failsafe-reports for the individual test results.
[2020-05-23T01:48:54.865Z] [ERROR] Please refer to dump files (if any exist) [date].dump, [date]-jvmRun[N].dump and [date].dumpstream.
[2020-05-23T01:48:54.865Z] [ERROR] -> [Help 1]
[2020-05-23T01:48:54.865Z] org.apache.maven.lifecycle.LifecycleExecutionException: Failed to execute goal org.apache.maven.plugins:maven-failsafe-plugin:3.0.0-M4:verify (default) on project surefire-its: There are test failures.
[2020-05-23T01:48:54.865Z]
[2020-05-23T01:48:54.865Z] Please refer to C:\Users\jenkins\AppData\Local\Temp\2\jenkins-maven-box-maven-surefire-SUREFIRE-1733-10\surefire-its\target\failsafe-reports for the individual test results.
[2020-05-23T01:48:54.865Z] Please refer to dump files (if any exist) [date].dump, [date]-jvmRun[N].dump and [date].dumpstream.
[2020-05-23T01:48:54.865Z]     at org.apache.maven.lifecycle.internal.MojoExecutor.execute (MojoExecutor.java:215)
[2020-05-23T01:48:54.865Z]     at org.apache.maven.lifecycle.internal.MojoExecutor.execute (MojoExecutor.java:156)
[2020-05-23T01:48:54.865Z]     at org.apache.maven.lifecycle.internal.MojoExecutor.execute (MojoExecutor.java:148)
[2020-05-23T01:48:54.865Z]     at org.apache.maven.lifecycle.internal.LifecycleModuleBuilder.buildProject (LifecycleModuleBuilder.java:117)
[2020-05-23T01:48:54.865Z]     at org.apache.maven.lifecycle.internal.LifecycleModuleBuilder.buildProject (LifecycleModuleBuilder.java:81)
[2020-05-23T01:48:54.865Z]     at org.apache.maven.lifecycle.internal.builder.singlethreaded.SingleThreadedBuilder.build (SingleThreadedBuilder.java:56)
[2020-05-23T01:48:54.865Z]     at org.apache.maven.lifecycle.internal.LifecycleStarter.execute (LifecycleStarter.java:128)
[2020-05-23T01:48:54.865Z]     at org.apache.maven.DefaultMaven.doExecute (DefaultMaven.java:305)
[2020-05-23T01:48:54.865Z]     at org.apache.maven.DefaultMaven.doExecute (DefaultMaven.java:192)
[2020-05-23T01:48:54.865Z]     at org.apache.maven.DefaultMaven.execute (DefaultMaven.java:105)
[2020-05-23T01:48:54.865Z]     at org.apache.maven.cli.MavenCli.execute (MavenCli.java:956)
[2020-05-23T01:48:54.865Z]     at org.apache.maven.cli.MavenCli.doMain (MavenCli.java:288)
[2020-05-23T01:48:54.865Z]     at org.apache.maven.cli.MavenCli.main (MavenCli.java:192)
[2020-05-23T01:48:54.865Z]     at sun.reflect.NativeMethodAccessorImpl.invoke0 (Native Method)
[2020-05-23T01:48:54.865Z]     at sun.reflect.NativeMethodAccessorImpl.invoke (NativeMethodAccessorImpl.java:62)
[2020-05-23T01:48:54.865Z]     at sun.reflect.DelegatingMethodAccessorImpl.invoke (DelegatingMethodAccessorImpl.java:43)
[2020-05-23T01:48:54.865Z]     at java.lang.reflect.Method.invoke (Method.java:498)
[2020-05-23T01:48:54.865Z]     at org.codehaus.plexus.classworlds.launcher.Launcher.launchEnhanced (Launcher.java:282)
[2020-05-23T01:48:54.865Z]     at org.codehaus.plexus.classworlds.launcher.Launcher.launch (Launcher.java:225)
[2020-05-23T01:48:54.865Z]     at org.codehaus.plexus.classworlds.launcher.Launcher.mainWithExitCode (Launcher.java:406)
[2020-05-23T01:48:54.865Z]     at org.codehaus.plexus.classworlds.launcher.Launcher.main (Launcher.java:347)
[2020-05-23T01:48:54.865Z] Caused by: org.apache.maven.plugin.MojoFailureException: There are test failures.
[2020-05-23T01:48:54.865Z]
[2020-05-23T01:48:54.865Z] Please refer to C:\Users\jenkins\AppData\Local\Temp\2\jenkins-maven-box-maven-surefire-SUREFIRE-1733-10\surefire-its\target\failsafe-reports for the individual test results.
[2020-05-23T01:48:54.865Z] Please refer to dump files (if any exist) [date].dump, [date]-jvmRun[N].dump and [date].dumpstream.
[2020-05-23T01:48:54.865Z]     at org.apache.maven.plugin.surefire.SurefireHelper.throwException (SurefireHelper.java:271)
[2020-05-23T01:48:54.865Z]     at org.apache.maven.plugin.surefire.SurefireHelper.reportExecution (SurefireHelper.java:159)
[2020-05-23T01:48:54.865Z]     at org.apache.maven.plugin.failsafe.VerifyMojo.execute (VerifyMojo.java:192)
[2020-05-23T01:48:54.865Z]     at org.apache.maven.plugin.DefaultBuildPluginManager.executeMojo (DefaultBuildPluginManager.java:137)
[2020-05-23T01:48:54.865Z]     at org.apache.maven.lifecycle.internal.MojoExecutor.execute (MojoExecutor.java:210)
[2020-05-23T01:48:54.865Z]     at org.apache.maven.lifecycle.internal.MojoExecutor.execute (MojoExecutor.java:156)
[2020-05-23T01:48:54.865Z]     at org.apache.maven.lifecycle.internal.MojoExecutor.execute (MojoExecutor.java:148)
[2020-05-23T01:48:54.865Z]     at org.apache.maven.lifecycle.internal.LifecycleModuleBuilder.buildProject (LifecycleModuleBuilder.java:117)
[2020-05-23T01:48:54.865Z]     at org.apache.maven.lifecycle.internal.LifecycleModuleBuilder.buildProject (LifecycleModuleBuilder.java:81)
[2020-05-23T01:48:54.865Z]     at org.apache.maven.lifecycle.internal.builder.singlethreaded.SingleThreadedBuilder.build (SingleThreadedBuilder.java:56)
[2020-05-23T01:48:54.865Z]     at org.apache.maven.lifecycle.internal.LifecycleStarter.execute (LifecycleStarter.java:128)
[2020-05-23T01:48:54.865Z]     at org.apache.maven.DefaultMaven.doExecute (DefaultMaven.java:305)
[2020-05-23T01:48:54.865Z]     at org.apache.maven.DefaultMaven.doExecute (DefaultMaven.java:192)
[2020-05-23T01:48:54.866Z]     at org.apache.maven.DefaultMaven.execute (DefaultMaven.java:105)
[2020-05-23T01:48:54.866Z]     at org.apache.maven.cli.MavenCli.execute (MavenCli.java:956)
[2020-05-23T01:48:54.866Z]     at org.apache.maven.cli.MavenCli.doMain (MavenCli.java:288)
[2020-05-23T01:48:54.866Z]     at org.apache.maven.cli.MavenCli.main (MavenCli.java:192)
[2020-05-23T01:48:54.866Z]     at sun.reflect.NativeMethodAccessorImpl.invoke0 (Native Method)
[2020-05-23T01:48:54.866Z]     at sun.reflect.NativeMethodAccessorImpl.invoke (NativeMethodAccessorImpl.java:62)
[2020-05-23T01:48:54.866Z]     at sun.reflect.DelegatingMethodAccessorImpl.invoke (DelegatingMethodAccessorImpl.java:43)
[2020-05-23T01:48:54.866Z]     at java.lang.reflect.Method.invoke (Method.java:498)
[2020-05-23T01:48:54.866Z]     at org.codehaus.plexus.classworlds.launcher.Launcher.launchEnhanced (Launcher.java:282)
[2020-05-23T01:48:54.866Z]     at org.codehaus.plexus.classworlds.launcher.Launcher.launch (Launcher.java:225)
[2020-05-23T01:48:54.866Z]     at org.codehaus.plexus.classworlds.launcher.Launcher.mainWithExitCode (Launcher.java:406)
[2020-05-23T01:48:54.866Z]     at org.codehaus.plexus.classworlds.launcher.Launcher.main (Launcher.java:347)
[2020-05-23T01:48:54.866Z] [ERROR]
[2020-05-23T01:48:54.866Z] [ERROR] Re-run Maven using the -X switch to enable full debug logging.
[2020-05-23T01:48:54.866Z] [ERROR]
[2020-05-23T01:48:54.866Z] [ERROR] For more information about the errors and possible solutions, please read the following articles:
[2020-05-23T01:48:54.866Z] [ERROR] [Help 1] http://cwiki.apache.org/confluence/display/MAVEN/MojoFailureException
[2020-05-23T01:48:54.866Z] [ERROR]
[2020-05-23T01:48:54.866Z] [ERROR] After correcting the problems, you can resume the build with the command
[2020-05-23T01:48:54.866Z] [ERROR]   mvn <args> -rf :surefire-its
[Pipeline] }
[Pipeline] // withEnv
[Pipeline] }
[Pipeline] // stage
[Pipeline] fileExists
[Pipeline] zip
[2020-05-23T01:48:55.033Z] Writing zip file of C:\Users\jenkins\AppData\Local\Temp\2\jenkins-maven-box-maven-surefire-SUREFIRE-1733-10\maven-failsafe-plugin\target\it to C:\Users\jenkins\AppData\Local\Temp\2\jenkins-maven-box-maven-surefire-SUREFIRE-1733-10\maven-failsafe-plugin--windows-jdk14-maven3.6.x.zip
[2020-05-23T01:48:55.344Z] Zipped 78 entries.
[2020-05-23T01:48:55.345Z] Archiving C:\Users\jenkins\AppData\Local\Temp\2\jenkins-maven-box-maven-surefire-SUREFIRE-1733-10\maven-failsafe-plugin--windows-jdk14-maven3.6.x.zip
[2020-05-23T01:48:55.345Z] [Fast Archiver] No artifacts from Maven TLP » maven-surefire » SUREFIRE-1733 #9 to compare, so performing full copy of artifacts
[Pipeline] fileExists
[Pipeline] zip
[2020-05-23T01:48:55.429Z] Writing zip file of C:\Users\jenkins\AppData\Local\Temp\2\jenkins-maven-box-maven-surefire-SUREFIRE-1733-10\surefire-its\target to C:\Users\jenkins\AppData\Local\Temp\2\jenkins-maven-box-maven-surefire-SUREFIRE-1733-10\surefire-its--windows-jdk14-maven3.6.x.zip
[2020-05-23T01:49:46.944Z] Zipped 18997 entries.
[2020-05-23T01:49:46.944Z] Archiving C:\Windows\system32\config\systemprofile\AppData\Local\Temp\jenkins-maven-box-maven-surefire-SUREFIRE-1733-10\surefire-its--windows-jdk15-maven3.6.x.zip
[2020-05-23T01:49:46.945Z] [Fast Archiver] No artifacts from Maven TLP » maven-surefire » SUREFIRE-1733 #9 to compare, so performing full copy of artifacts
[Pipeline] archiveArtifacts
[2020-05-23T01:50:09.746Z] Archiving artifacts
[2020-05-23T01:50:09.828Z] [Fast Archiver] No artifacts from Maven TLP » maven-surefire » SUREFIRE-1733 #9 to compare, so performing full copy of artifacts
[Pipeline] cleanWs
[2020-05-23T01:50:29.237Z] [WS-CLEANUP] Deleting project workspace...
[2020-05-23T01:50:29.237Z] [WS-CLEANUP] Deferred wipeout is used...
[2020-05-23T01:50:29.355Z] [WS-CLEANUP] done
[Pipeline] }
[Pipeline] // ws
[Pipeline] }
[Pipeline] // timestamps
[Pipeline] }
[Pipeline] // node
[Pipeline] }
[2020-05-23T01:50:44.792Z] Zipped 19041 entries.
[2020-05-23T01:50:44.792Z] Archiving C:\Users\jenkins\AppData\Local\Temp\2\jenkins-maven-box-maven-surefire-SUREFIRE-1733-10\surefire-its--windows-jdk14-maven3.6.x.zip
[2020-05-23T01:50:44.793Z] [Fast Archiver] No artifacts from Maven TLP » maven-surefire » SUREFIRE-1733 #9 to compare, so performing full copy of artifacts
[Pipeline] archiveArtifacts
[2020-05-23T01:51:04.735Z] Archiving artifacts
[2020-05-23T01:51:04.755Z] [Fast Archiver] No artifacts from Maven TLP » maven-surefire » SUREFIRE-1733 #9 to compare, so performing full copy of artifacts
[Pipeline] cleanWs
[2020-05-23T01:51:25.547Z] [WS-CLEANUP] Deleting project workspace...
[2020-05-23T01:51:25.547Z] [WS-CLEANUP] Deferred wipeout is used...
[2020-05-23T01:51:25.658Z] [WS-CLEANUP] done
[Pipeline] }
[Pipeline] // ws
[Pipeline] }
[Pipeline] // timestamps
[Pipeline] }
[Pipeline] // node
[Pipeline] }
[Pipeline] // parallel
[Pipeline] echo
Build result: FAILURE
[Pipeline] jiraIssueSelector
[Pipeline] echo
The authors of changes [tibordigana].
[Pipeline] echo
Sending email ...
[Pipeline] emailext