Build failed in Jenkins: Maven TLP » maven-surefire » SUREFIRE-1679 #1

classic Classic list List threaded Threaded
2 messages Options
Reply | Threaded
Open this post in threaded view
|

Build failed in Jenkins: Maven TLP » maven-surefire » SUREFIRE-1679 #1

Apache Jenkins Server-2
See https://builds.apache.org/job/maven-box/job/maven-surefire/job/SUREFIRE-1679/1/

No changes.

All tests passed

Build log:
[...truncated 38664 lines...]
[2019-08-14T09:05:20.821Z] [INFO] Maven Surefire Integration Tests ................... SKIPPED
[2019-08-14T09:05:20.821Z] [INFO] ------------------------------------------------------------------------
[2019-08-14T09:05:20.821Z] [INFO] BUILD FAILURE
[2019-08-14T09:05:20.821Z] [INFO] ------------------------------------------------------------------------
[2019-08-14T09:05:20.821Z] [INFO] Total time:  04:41 min
[2019-08-14T09:05:20.821Z] [INFO] Finished at: 2019-08-14T02:05:20-07:00
[2019-08-14T09:05:20.821Z] [INFO] ------------------------------------------------------------------------
[2019-08-14T09:05:20.821Z] [ERROR] Failed to execute goal org.apache.maven.plugins:maven-checkstyle-plugin:3.0.0:check (checkstyle-check) on project maven-surefire-common: You have 1 Checkstyle violation. -> [Help 1]
[2019-08-14T09:05:20.821Z] org.apache.maven.lifecycle.LifecycleExecutionException: Failed to execute goal org.apache.maven.plugins:maven-checkstyle-plugin:3.0.0:check (checkstyle-check) on project maven-surefire-common: You have 1 Checkstyle violation.
[2019-08-14T09:05:20.821Z]     at org.apache.maven.lifecycle.internal.MojoExecutor.execute (MojoExecutor.java:215)
[2019-08-14T09:05:20.821Z]     at org.apache.maven.lifecycle.internal.MojoExecutor.execute (MojoExecutor.java:156)
[2019-08-14T09:05:20.821Z]     at org.apache.maven.lifecycle.internal.MojoExecutor.execute (MojoExecutor.java:148)
[2019-08-14T09:05:20.821Z]     at org.apache.maven.lifecycle.internal.LifecycleModuleBuilder.buildProject (LifecycleModuleBuilder.java:117)
[2019-08-14T09:05:20.821Z]     at org.apache.maven.lifecycle.internal.LifecycleModuleBuilder.buildProject (LifecycleModuleBuilder.java:81)
[2019-08-14T09:05:20.821Z]     at org.apache.maven.lifecycle.internal.builder.singlethreaded.SingleThreadedBuilder.build (SingleThreadedBuilder.java:56)
[2019-08-14T09:05:20.821Z]     at org.apache.maven.lifecycle.internal.LifecycleStarter.execute (LifecycleStarter.java:128)
[2019-08-14T09:05:20.821Z]     at org.apache.maven.DefaultMaven.doExecute (DefaultMaven.java:305)
[2019-08-14T09:05:20.821Z]     at org.apache.maven.DefaultMaven.doExecute (DefaultMaven.java:192)
[2019-08-14T09:05:20.821Z]     at org.apache.maven.DefaultMaven.execute (DefaultMaven.java:105)
[2019-08-14T09:05:20.821Z]     at org.apache.maven.cli.MavenCli.execute (MavenCli.java:956)
[2019-08-14T09:05:20.821Z]     at org.apache.maven.cli.MavenCli.doMain (MavenCli.java:288)
[2019-08-14T09:05:20.821Z]     at org.apache.maven.cli.MavenCli.main (MavenCli.java:192)
[2019-08-14T09:05:20.821Z]     at sun.reflect.NativeMethodAccessorImpl.invoke0 (Native Method)
[2019-08-14T09:05:20.821Z]     at sun.reflect.NativeMethodAccessorImpl.invoke (NativeMethodAccessorImpl.java:62)
[2019-08-14T09:05:20.821Z]     at sun.reflect.DelegatingMethodAccessorImpl.invoke (DelegatingMethodAccessorImpl.java:43)
[2019-08-14T09:05:20.821Z]     at java.lang.reflect.Method.invoke (Method.java:498)
[2019-08-14T09:05:20.821Z]     at org.codehaus.plexus.classworlds.launcher.Launcher.launchEnhanced (Launcher.java:289)
[2019-08-14T09:05:20.821Z]     at org.codehaus.plexus.classworlds.launcher.Launcher.launch (Launcher.java:229)
[2019-08-14T09:05:20.821Z]     at org.codehaus.plexus.classworlds.launcher.Launcher.mainWithExitCode (Launcher.java:415)
[2019-08-14T09:05:20.821Z]     at org.codehaus.plexus.classworlds.launcher.Launcher.main (Launcher.java:356)
[2019-08-14T09:05:20.821Z] Caused by: org.apache.maven.plugin.MojoFailureException: You have 1 Checkstyle violation.
[2019-08-14T09:05:20.821Z]     at org.apache.maven.plugins.checkstyle.CheckstyleViolationCheckMojo.execute (CheckstyleViolationCheckMojo.java:576)
[2019-08-14T09:05:20.821Z]     at org.apache.maven.plugin.DefaultBuildPluginManager.executeMojo (DefaultBuildPluginManager.java:137)
[2019-08-14T09:05:20.821Z]     at org.apache.maven.lifecycle.internal.MojoExecutor.execute (MojoExecutor.java:210)
[2019-08-14T09:05:20.821Z]     at org.apache.maven.lifecycle.internal.MojoExecutor.execute (MojoExecutor.java:156)
[2019-08-14T09:05:20.821Z]     at org.apache.maven.lifecycle.internal.MojoExecutor.execute (MojoExecutor.java:148)
[2019-08-14T09:05:20.821Z]     at org.apache.maven.lifecycle.internal.LifecycleModuleBuilder.buildProject (LifecycleModuleBuilder.java:117)
[2019-08-14T09:05:20.821Z]     at org.apache.maven.lifecycle.internal.LifecycleModuleBuilder.buildProject (LifecycleModuleBuilder.java:81)
[2019-08-14T09:05:20.821Z]     at org.apache.maven.lifecycle.internal.builder.singlethreaded.SingleThreadedBuilder.build (SingleThreadedBuilder.java:56)
[2019-08-14T09:05:20.821Z]     at org.apache.maven.lifecycle.internal.LifecycleStarter.execute (LifecycleStarter.java:128)
[2019-08-14T09:05:20.821Z]     at org.apache.maven.DefaultMaven.doExecute (DefaultMaven.java:305)
[2019-08-14T09:05:20.821Z]     at org.apache.maven.DefaultMaven.doExecute (DefaultMaven.java:192)
[2019-08-14T09:05:20.821Z]     at org.apache.maven.DefaultMaven.execute (DefaultMaven.java:105)
[2019-08-14T09:05:20.821Z]     at org.apache.maven.cli.MavenCli.execute (MavenCli.java:956)
[2019-08-14T09:05:20.821Z]     at org.apache.maven.cli.MavenCli.doMain (MavenCli.java:288)
[2019-08-14T09:05:20.821Z]     at org.apache.maven.cli.MavenCli.main (MavenCli.java:192)
[2019-08-14T09:05:20.821Z]     at sun.reflect.NativeMethodAccessorImpl.invoke0 (Native Method)
[2019-08-14T09:05:20.821Z]     at sun.reflect.NativeMethodAccessorImpl.invoke (NativeMethodAccessorImpl.java:62)
[2019-08-14T09:05:20.821Z]     at sun.reflect.DelegatingMethodAccessorImpl.invoke (DelegatingMethodAccessorImpl.java:43)
[2019-08-14T09:05:20.821Z]     at java.lang.reflect.Method.invoke (Method.java:498)
[2019-08-14T09:05:20.821Z]     at org.codehaus.plexus.classworlds.launcher.Launcher.launchEnhanced (Launcher.java:289)
[2019-08-14T09:05:20.821Z]     at org.codehaus.plexus.classworlds.launcher.Launcher.launch (Launcher.java:229)
[2019-08-14T09:05:20.821Z]     at org.codehaus.plexus.classworlds.launcher.Launcher.mainWithExitCode (Launcher.java:415)
[2019-08-14T09:05:20.821Z]     at org.codehaus.plexus.classworlds.launcher.Launcher.main (Launcher.java:356)
[2019-08-14T09:05:20.821Z] [ERROR]
[2019-08-14T09:05:20.821Z] [ERROR] Re-run Maven using the -X switch to enable full debug logging.
[2019-08-14T09:05:20.821Z] [ERROR]
[2019-08-14T09:05:20.821Z] [ERROR] For more information about the errors and possible solutions, please read the following articles:
[2019-08-14T09:05:20.821Z] [ERROR] [Help 1] http://cwiki.apache.org/confluence/display/MAVEN/MojoFailureException
[2019-08-14T09:05:20.822Z] [ERROR]
[2019-08-14T09:05:20.822Z] [ERROR] After correcting the problems, you can resume the build with the command
[2019-08-14T09:05:20.822Z] [ERROR]   mvn <goals> -rf :maven-surefire-common
[Pipeline] }
[Pipeline] // withEnv
[Pipeline] }
[Pipeline] // stage
[Pipeline] fileExists
[Pipeline] fileExists
[Pipeline] archiveArtifacts
[2019-08-14T09:05:21.079Z] Archiving artifacts
[Pipeline] cleanWs
[2019-08-14T09:05:21.116Z] [WS-CLEANUP] Deleting project workspace...
[2019-08-14T09:05:21.116Z] [WS-CLEANUP] Deferred wipeout is used...
[2019-08-14T09:05:21.152Z] [WS-CLEANUP] done
[Pipeline] }
[Pipeline] // ws
[Pipeline] }
[Pipeline] // timestamps
[2019-08-14T09:05:21.220Z] Hi There!
[Pipeline] }
[Pipeline] // node
[Pipeline] }
[2019-08-14T09:05:36.896Z] [INFO] Tests run: 219, Failures: 0, Errors: 0, Skipped: 0, Time elapsed: 23.346 s - in org.apache.maven.surefire.JUnit4SuiteTest
[2019-08-14T09:05:36.896Z] [INFO]
[2019-08-14T09:05:36.896Z] [INFO] Results:
[2019-08-14T09:05:36.896Z] [INFO]
[2019-08-14T09:05:36.896Z] [INFO] Tests run: 219, Failures: 0, Errors: 0, Skipped: 0
[2019-08-14T09:05:36.896Z] [INFO]
[2019-08-14T09:05:36.896Z] [INFO]
[2019-08-14T09:05:36.896Z] [INFO] --- jacoco-maven-plugin:0.8.4:restore-instrumented-classes (restore-classes) @ maven-surefire-common ---
[2019-08-14T09:05:36.896Z] [INFO] Skipping JaCoCo execution because property jacoco.skip is set.
[2019-08-14T09:05:36.896Z] [INFO]
[2019-08-14T09:05:36.896Z] [INFO] --- maven-jar-plugin:3.1.0:jar (default-jar) @ maven-surefire-common ---
[2019-08-14T09:05:36.896Z] [INFO] Building jar: C:\Users\jenkins\AppData\Local\Temp\3\jenkins-maven-box-maven-surefire-SUREFIRE-1679-1\maven-surefire-common\target\maven-surefire-common-3.0.0-SNAPSHOT.jar
[2019-08-14T09:05:37.988Z] [INFO]
[2019-08-14T09:05:37.988Z] [INFO] --- maven-site-plugin:3.8.2:attach-descriptor (attach-descriptor) @ maven-surefire-common ---
[2019-08-14T09:05:37.988Z] [INFO] Skipping because packaging 'jar' is not pom.
[2019-08-14T09:05:37.988Z] [INFO]
[2019-08-14T09:05:37.988Z] [INFO] --- maven-shade-plugin:3.1.1:shade (default) @ maven-surefire-common ---
[2019-08-14T09:05:37.988Z] [INFO] Excluding org.apache.maven.surefire:surefire-api:jar:3.0.0-SNAPSHOT from the shaded jar.
[2019-08-14T09:05:37.988Z] [INFO] Excluding org.apache.maven.surefire:surefire-logger-api:jar:3.0.0-SNAPSHOT from the shaded jar.
[2019-08-14T09:05:37.988Z] [INFO] Excluding commons-codec:commons-codec:jar:1.11 from the shaded jar.
[2019-08-14T09:05:37.988Z] [INFO] Excluding org.apache.maven.surefire:surefire-extensions-api:jar:3.0.0-SNAPSHOT from the shaded jar.
[2019-08-14T09:05:37.988Z] [INFO] Excluding org.apache.maven.surefire:surefire-booter:jar:3.0.0-SNAPSHOT from the shaded jar.
[2019-08-14T09:05:37.988Z] [INFO] Excluding org.apache.maven:maven-model:jar:3.0 from the shaded jar.
[2019-08-14T09:05:37.988Z] [INFO] Excluding org.apache.maven:maven-artifact:jar:3.0 from the shaded jar.
[2019-08-14T09:05:37.988Z] [INFO] Excluding org.apache.maven:maven-plugin-api:jar:3.0 from the shaded jar.
[2019-08-14T09:05:37.988Z] [INFO] Excluding org.sonatype.sisu:sisu-inject-plexus:jar:1.4.2 from the shaded jar.
[2019-08-14T09:05:37.988Z] [INFO] Excluding org.sonatype.sisu:sisu-inject-bean:jar:1.4.2 from the shaded jar.
[2019-08-14T09:05:37.988Z] [INFO] Excluding org.sonatype.sisu:sisu-guice:jar:noaop:2.1.7 from the shaded jar.
[2019-08-14T09:05:37.988Z] [INFO] Excluding org.codehaus.plexus:plexus-utils:jar:2.0.4 from the shaded jar.
[2019-08-14T09:05:37.988Z] [INFO] Excluding org.codehaus.plexus:plexus-classworlds:jar:2.2.3 from the shaded jar.
[2019-08-14T09:05:37.988Z] [INFO] Excluding org.codehaus.plexus:plexus-component-annotations:jar:1.7.1 from the shaded jar.
[2019-08-14T09:05:37.988Z] [INFO] Excluding org.apache.maven:maven-toolchain:jar:3.0-alpha-2 from the shaded jar.
[2019-08-14T09:05:37.988Z] [INFO] Including org.apache.maven.shared:maven-common-artifact-filters:jar:3.1.0 in the shaded jar.
[2019-08-14T09:05:37.988Z] [INFO] Excluding org.apache.maven.shared:maven-artifact-transfer:jar:0.11.0 from the shaded jar.
[2019-08-14T09:05:37.988Z] [INFO] Excluding org.slf4j:slf4j-api:jar:1.7.5 from the shaded jar.
[2019-08-14T09:05:37.988Z] [INFO] Excluding org.codehaus.plexus:plexus-java:jar:1.0.3 from the shaded jar.
[2019-08-14T09:05:37.988Z] [INFO] Excluding org.ow2.asm:asm:jar:7.0 from the shaded jar.
[2019-08-14T09:05:37.988Z] [INFO] Excluding com.thoughtworks.qdox:qdox:jar:2.0-M9 from the shaded jar.
[2019-08-14T09:05:37.988Z] [INFO] Including org.apache.maven.shared:maven-shared-utils:jar:3.1.0 in the shaded jar.
[2019-08-14T09:05:37.988Z] [INFO] Including commons-io:commons-io:jar:2.6 in the shaded jar.
[2019-08-14T09:05:37.988Z] [INFO] Including org.apache.commons:commons-lang3:jar:3.8.1 in the shaded jar.
[2019-08-14T09:05:37.988Z] [INFO] Minimizing jar org.apache.maven.surefire:maven-surefire-common:jar:3.0.0-SNAPSHOT
[2019-08-14T09:05:39.419Z] [INFO] Minimized 699 -> 329 (47%)
[2019-08-14T09:05:39.419Z] [INFO] Replacing original artifact with shaded artifact.
[2019-08-14T09:05:39.419Z] [INFO] Replacing C:\Users\jenkins\AppData\Local\Temp\3\jenkins-maven-box-maven-surefire-SUREFIRE-1679-1\maven-surefire-common\target\maven-surefire-common-3.0.0-SNAPSHOT.jar with C:\Users\jenkins\AppData\Local\Temp\3\jenkins-maven-box-maven-surefire-SUREFIRE-1679-1\maven-surefire-common\target\maven-surefire-common-3.0.0-SNAPSHOT-shaded.jar
[2019-08-14T09:05:39.419Z] [INFO] Dependency-reduced POM written at: C:\Users\jenkins\AppData\Local\Temp\3\jenkins-maven-box-maven-surefire-SUREFIRE-1679-1\maven-surefire-common\dependency-reduced-pom.xml
[2019-08-14T09:05:39.694Z] [INFO]
[2019-08-14T09:05:39.694Z] [INFO] --- maven-checkstyle-plugin:3.0.0:check (checkstyle-check) @ maven-surefire-common ---
[2019-08-14T09:05:41.105Z] [INFO] There are 5 errors reported by Checkstyle 6.18 with config/maven_checks.xml ruleset.
[2019-08-14T09:05:41.105Z] [ERROR] src\main\java\org\apache\maven\plugin\surefire\AbstractSurefireMojo.java:[3856,9] (whitespace) FileTabCharacter: Line contains a tab character.
[2019-08-14T09:05:41.105Z] [INFO] Ignored 4 errors, 1 violation remaining.
[2019-08-14T09:05:41.105Z] [INFO] ------------------------------------------------------------------------
[2019-08-14T09:05:41.105Z] [INFO] Reactor Summary for Apache Maven Surefire 3.0.0-SNAPSHOT:
[2019-08-14T09:05:41.105Z] [INFO]
[2019-08-14T09:05:41.105Z] [INFO] Apache Maven Surefire .............................. SUCCESS [01:21 min]
[2019-08-14T09:05:41.105Z] [INFO] SureFire Logger API ................................ SUCCESS [ 32.071 s]
[2019-08-14T09:05:41.105Z] [INFO] SureFire API ....................................... SUCCESS [ 21.666 s]
[2019-08-14T09:05:41.105Z] [INFO] Surefire Extensions API ............................ SUCCESS [  4.003 s]
[2019-08-14T09:05:41.105Z] [INFO] SureFire Booter .................................... SUCCESS [ 20.889 s]
[2019-08-14T09:05:41.105Z] [INFO] Maven Surefire Test-Grouping Support ............... SUCCESS [ 15.345 s]
[2019-08-14T09:05:41.105Z] [INFO] SureFire Providers ................................. SUCCESS [  1.517 s]
[2019-08-14T09:05:41.105Z] [INFO] Shared JUnit3 Provider Code ........................ SUCCESS [  5.454 s]
[2019-08-14T09:05:41.105Z] [INFO] Shared Java 5 Provider Base ........................ SUCCESS [  7.805 s]
[2019-08-14T09:05:41.105Z] [INFO] Shared JUnit4 Provider Code ........................ SUCCESS [  7.567 s]
[2019-08-14T09:05:41.105Z] [INFO] Shared JUnit48 Provider Code ....................... SUCCESS [  8.448 s]
[2019-08-14T09:05:41.105Z] [INFO] SureFire JUnit Runner .............................. SUCCESS [  5.961 s]
[2019-08-14T09:05:41.105Z] [INFO] SureFire JUnit4 Runner ............................. SUCCESS [ 35.791 s]
[2019-08-14T09:05:41.105Z] [INFO] Maven Surefire Common .............................. FAILURE [ 51.004 s]
[2019-08-14T09:05:41.105Z] [INFO] SureFire JUnitCore Runner .......................... SKIPPED
[2019-08-14T09:05:41.105Z] [INFO] SureFire JUnit Platform Runner ..................... SKIPPED
[2019-08-14T09:05:41.105Z] [INFO] SureFire TestNG Utils .............................. SKIPPED
[2019-08-14T09:05:41.105Z] [INFO] SureFire TestNG Runner ............................. SKIPPED
[2019-08-14T09:05:41.105Z] [INFO] ShadeFire JUnit3 Provider .......................... SKIPPED
[2019-08-14T09:05:41.105Z] [INFO] Surefire Report Parser ............................. SKIPPED
[2019-08-14T09:05:41.105Z] [INFO] Maven Surefire Plugin .............................. SKIPPED
[2019-08-14T09:05:41.105Z] [INFO] Maven Failsafe Plugin .............................. SKIPPED
[2019-08-14T09:05:41.105Z] [INFO] Maven Surefire Report Plugin ....................... SKIPPED
[2019-08-14T09:05:41.105Z] [INFO] Maven Surefire Integration Tests ................... SKIPPED
[2019-08-14T09:05:41.105Z] [INFO] ------------------------------------------------------------------------
[2019-08-14T09:05:41.105Z] [INFO] BUILD FAILURE
[2019-08-14T09:05:41.105Z] [INFO] ------------------------------------------------------------------------
[2019-08-14T09:05:41.105Z] [INFO] Total time:  05:01 min
[2019-08-14T09:05:41.105Z] [INFO] Finished at: 2019-08-14T02:05:40-07:00
[2019-08-14T09:05:41.105Z] [INFO] ------------------------------------------------------------------------
[2019-08-14T09:05:41.105Z] [ERROR] Failed to execute goal org.apache.maven.plugins:maven-checkstyle-plugin:3.0.0:check (checkstyle-check) on project maven-surefire-common: You have 1 Checkstyle violation. -> [Help 1]
[2019-08-14T09:05:41.105Z] org.apache.maven.lifecycle.LifecycleExecutionException: Failed to execute goal org.apache.maven.plugins:maven-checkstyle-plugin:3.0.0:check (checkstyle-check) on project maven-surefire-common: You have 1 Checkstyle violation.
[2019-08-14T09:05:41.105Z]     at org.apache.maven.lifecycle.internal.MojoExecutor.execute (MojoExecutor.java:215)
[2019-08-14T09:05:41.105Z]     at org.apache.maven.lifecycle.internal.MojoExecutor.execute (MojoExecutor.java:156)
[2019-08-14T09:05:41.105Z]     at org.apache.maven.lifecycle.internal.MojoExecutor.execute (MojoExecutor.java:148)
[2019-08-14T09:05:41.105Z]     at org.apache.maven.lifecycle.internal.LifecycleModuleBuilder.buildProject (LifecycleModuleBuilder.java:117)
[2019-08-14T09:05:41.105Z]     at org.apache.maven.lifecycle.internal.LifecycleModuleBuilder.buildProject (LifecycleModuleBuilder.java:81)
[2019-08-14T09:05:41.105Z]     at org.apache.maven.lifecycle.internal.builder.singlethreaded.SingleThreadedBuilder.build (SingleThreadedBuilder.java:56)
[2019-08-14T09:05:41.105Z]     at org.apache.maven.lifecycle.internal.LifecycleStarter.execute (LifecycleStarter.java:128)
[2019-08-14T09:05:41.105Z]     at org.apache.maven.DefaultMaven.doExecute (DefaultMaven.java:305)
[2019-08-14T09:05:41.105Z]     at org.apache.maven.DefaultMaven.doExecute (DefaultMaven.java:192)
[2019-08-14T09:05:41.105Z]     at org.apache.maven.DefaultMaven.execute (DefaultMaven.java:105)
[2019-08-14T09:05:41.105Z]     at org.apache.maven.cli.MavenCli.execute (MavenCli.java:956)
[2019-08-14T09:05:41.105Z]     at org.apache.maven.cli.MavenCli.doMain (MavenCli.java:288)
[2019-08-14T09:05:41.105Z]     at org.apache.maven.cli.MavenCli.main (MavenCli.java:192)
[2019-08-14T09:05:41.105Z]     at sun.reflect.NativeMethodAccessorImpl.invoke0 (Native Method)
[2019-08-14T09:05:41.105Z]     at sun.reflect.NativeMethodAccessorImpl.invoke (NativeMethodAccessorImpl.java:62)
[2019-08-14T09:05:41.105Z]     at sun.reflect.DelegatingMethodAccessorImpl.invoke (DelegatingMethodAccessorImpl.java:43)
[2019-08-14T09:05:41.105Z]     at java.lang.reflect.Method.invoke (Method.java:498)
[2019-08-14T09:05:41.105Z]     at org.codehaus.plexus.classworlds.launcher.Launcher.launchEnhanced (Launcher.java:289)
[2019-08-14T09:05:41.106Z]     at org.codehaus.plexus.classworlds.launcher.Launcher.launch (Launcher.java:229)
[2019-08-14T09:05:41.106Z]     at org.codehaus.plexus.classworlds.launcher.Launcher.mainWithExitCode (Launcher.java:415)
[2019-08-14T09:05:41.106Z]     at org.codehaus.plexus.classworlds.launcher.Launcher.main (Launcher.java:356)
[2019-08-14T09:05:41.106Z] Caused by: org.apache.maven.plugin.MojoFailureException: You have 1 Checkstyle violation.
[2019-08-14T09:05:41.106Z]     at org.apache.maven.plugins.checkstyle.CheckstyleViolationCheckMojo.execute (CheckstyleViolationCheckMojo.java:576)
[2019-08-14T09:05:41.106Z]     at org.apache.maven.plugin.DefaultBuildPluginManager.executeMojo (DefaultBuildPluginManager.java:137)
[2019-08-14T09:05:41.106Z]     at org.apache.maven.lifecycle.internal.MojoExecutor.execute (MojoExecutor.java:210)
[2019-08-14T09:05:41.106Z]     at org.apache.maven.lifecycle.internal.MojoExecutor.execute (MojoExecutor.java:156)
[2019-08-14T09:05:41.106Z]     at org.apache.maven.lifecycle.internal.MojoExecutor.execute (MojoExecutor.java:148)
[2019-08-14T09:05:41.106Z]     at org.apache.maven.lifecycle.internal.LifecycleModuleBuilder.buildProject (LifecycleModuleBuilder.java:117)
[2019-08-14T09:05:41.106Z]     at org.apache.maven.lifecycle.internal.LifecycleModuleBuilder.buildProject (LifecycleModuleBuilder.java:81)
[2019-08-14T09:05:41.106Z]     at org.apache.maven.lifecycle.internal.builder.singlethreaded.SingleThreadedBuilder.build (SingleThreadedBuilder.java:56)
[2019-08-14T09:05:41.106Z]     at org.apache.maven.lifecycle.internal.LifecycleStarter.execute (LifecycleStarter.java:128)
[2019-08-14T09:05:41.106Z]     at org.apache.maven.DefaultMaven.doExecute (DefaultMaven.java:305)
[2019-08-14T09:05:41.106Z]     at org.apache.maven.DefaultMaven.doExecute (DefaultMaven.java:192)
[2019-08-14T09:05:41.106Z]     at org.apache.maven.DefaultMaven.execute (DefaultMaven.java:105)
[2019-08-14T09:05:41.106Z]     at org.apache.maven.cli.MavenCli.execute (MavenCli.java:956)
[2019-08-14T09:05:41.106Z]     at org.apache.maven.cli.MavenCli.doMain (MavenCli.java:288)
[2019-08-14T09:05:41.106Z]     at org.apache.maven.cli.MavenCli.main (MavenCli.java:192)
[2019-08-14T09:05:41.106Z]     at sun.reflect.NativeMethodAccessorImpl.invoke0 (Native Method)
[2019-08-14T09:05:41.106Z]     at sun.reflect.NativeMethodAccessorImpl.invoke (NativeMethodAccessorImpl.java:62)
[2019-08-14T09:05:41.106Z]     at sun.reflect.DelegatingMethodAccessorImpl.invoke (DelegatingMethodAccessorImpl.java:43)
[2019-08-14T09:05:41.106Z]     at java.lang.reflect.Method.invoke (Method.java:498)
[2019-08-14T09:05:41.106Z]     at org.codehaus.plexus.classworlds.launcher.Launcher.launchEnhanced (Launcher.java:289)
[2019-08-14T09:05:41.106Z]     at org.codehaus.plexus.classworlds.launcher.Launcher.launch (Launcher.java:229)
[2019-08-14T09:05:41.106Z]     at org.codehaus.plexus.classworlds.launcher.Launcher.mainWithExitCode (Launcher.java:415)
[2019-08-14T09:05:41.106Z]     at org.codehaus.plexus.classworlds.launcher.Launcher.main (Launcher.java:356)
[2019-08-14T09:05:41.106Z] [ERROR]
[2019-08-14T09:05:41.106Z] [ERROR] Re-run Maven using the -X switch to enable full debug logging.
[2019-08-14T09:05:41.106Z] [ERROR]
[2019-08-14T09:05:41.106Z] [ERROR] For more information about the errors and possible solutions, please read the following articles:
[2019-08-14T09:05:41.106Z] [ERROR] [Help 1] http://cwiki.apache.org/confluence/display/MAVEN/MojoFailureException
[2019-08-14T09:05:41.106Z] [ERROR]
[2019-08-14T09:05:41.106Z] [ERROR] After correcting the problems, you can resume the build with the command
[2019-08-14T09:05:41.106Z] [ERROR]   mvn <goals> -rf :maven-surefire-common
[Pipeline] }
[Pipeline] // withEnv
[Pipeline] }
[Pipeline] // stage
[Pipeline] fileExists
[Pipeline] fileExists
[Pipeline] archiveArtifacts
[2019-08-14T09:05:41.228Z] Archiving artifacts
[Pipeline] cleanWs
[2019-08-14T09:05:41.266Z] [WS-CLEANUP] Deleting project workspace...
[2019-08-14T09:05:41.266Z] [WS-CLEANUP] Deferred wipeout is used...
[2019-08-14T09:05:41.301Z] [WS-CLEANUP] done
[Pipeline] }
[Pipeline] // ws
[Pipeline] }
[Pipeline] // timestamps
[Pipeline] }
[Pipeline] // node
[Pipeline] }
[Pipeline] // parallel
[Pipeline] echo
Build result: FAILURE
[Pipeline] jiraIssueSelector
[Pipeline] echo
The authors of changes [].
[Pipeline] echo
Sending email ...
[Pipeline] emailext
Reply | Threaded
Open this post in threaded view
|

Build succeeded in Jenkins: Maven TLP » maven-surefire » SUREFIRE-1679 #2

Apache Jenkins Server-2