Build failed in Jenkins: Maven TLP » maven-surefire » SUREFIRE-1603 #12

classic Classic list List threaded Threaded
5 messages Options
Reply | Threaded
Open this post in threaded view
|

Build failed in Jenkins: Maven TLP » maven-surefire » SUREFIRE-1603 #12

Apache Jenkins Server-2
See https://builds.apache.org/job/maven-box/job/maven-surefire/job/SUREFIRE-1603/12/

Changes:

* Log unique commits
* Other attempt due to 'Scripts not permitted to use staticMethod
* Revert "Log unique commits"

No tests ran.

Build log:
[...truncated 20370 lines...]
[2019-09-23T14:37:52.047Z] [INFO] Downloading from central: https://repo.maven.apache.org/maven2/org/opentest4j/opentest4j/1.1.1/opentest4j-1.1.1.jar
[2019-09-23T14:37:52.047Z] [INFO] Downloaded from central: https://repo.maven.apache.org/maven2/org/junit/platform/junit-platform-launcher/1.3.1/junit-platform-launcher-1.3.1.jar (95 kB at 2.2 MB/s)
[2019-09-23T14:37:52.047Z] [INFO] Downloading from central: https://repo.maven.apache.org/maven2/org/junit/jupiter/junit-jupiter-engine/5.3.1/junit-jupiter-engine-5.3.1.jar
[2019-09-23T14:37:52.047Z] [INFO] Downloaded from central: https://repo.maven.apache.org/maven2/org/junit/platform/junit-platform-commons/1.3.1/junit-platform-commons-1.3.1.jar (78 kB at 1.6 MB/s)
[2019-09-23T14:37:52.047Z] [INFO] Downloading from central: https://repo.maven.apache.org/maven2/org/junit/jupiter/junit-jupiter-api/5.3.1/junit-jupiter-api-5.3.1.jar
[2019-09-23T14:37:52.047Z] [INFO] Downloaded from central: https://repo.maven.apache.org/maven2/org/junit/platform/junit-platform-engine/1.3.1/junit-platform-engine-1.3.1.jar (135 kB at 2.4 MB/s)
[2019-09-23T14:37:52.047Z] [INFO] Downloading from central: https://repo.maven.apache.org/maven2/org/assertj/assertj-core/3.9.1/assertj-core-3.9.1.jar
[2019-09-23T14:37:52.047Z] [INFO] Downloaded from central: https://repo.maven.apache.org/maven2/org/apiguardian/apiguardian-api/1.0.0/apiguardian-api-1.0.0.jar (2.2 kB at 32 kB/s)
[2019-09-23T14:37:52.325Z] [INFO] Downloaded from central: https://repo.maven.apache.org/maven2/org/opentest4j/opentest4j/1.1.1/opentest4j-1.1.1.jar (7.1 kB at 58 kB/s)
[2019-09-23T14:37:52.325Z] [INFO] Downloaded from central: https://repo.maven.apache.org/maven2/org/junit/jupiter/junit-jupiter-api/5.3.1/junit-jupiter-api-5.3.1.jar (115 kB at 337 kB/s)
[2019-09-23T14:37:52.634Z] [INFO] Downloaded from central: https://repo.maven.apache.org/maven2/org/junit/jupiter/junit-jupiter-engine/5.3.1/junit-jupiter-engine-5.3.1.jar (150 kB at 365 kB/s)
[2019-09-23T14:37:52.634Z] [INFO] Downloaded from central: https://repo.maven.apache.org/maven2/org/assertj/assertj-core/3.9.1/assertj-core-3.9.1.jar (3.9 MB at 8.3 MB/s)
[2019-09-23T14:37:52.634Z] [INFO]
[2019-09-23T14:37:52.634Z] [INFO] --- maven-clean-plugin:3.1.0:clean (default-clean) @ surefire-junit-platform ---
[2019-09-23T14:37:52.634Z] [INFO]
[2019-09-23T14:37:52.634Z] [INFO] --- maven-enforcer-plugin:3.0.0-M2:enforce (enforce-maven-version) @ surefire-junit-platform ---
[2019-09-23T14:37:52.634Z] [INFO]
[2019-09-23T14:37:52.634Z] [INFO] --- maven-enforcer-plugin:3.0.0-M2:enforce (enforce-bytecode-version) @ surefire-junit-platform ---
[2019-09-23T14:37:52.934Z] [INFO]
[2019-09-23T14:37:52.935Z] [INFO] --- maven-enforcer-plugin:3.0.0-M2:enforce (ban-known-bad-maven-versions) @ surefire-junit-platform ---
[2019-09-23T14:37:52.935Z] [INFO]
[2019-09-23T14:37:52.935Z] [INFO] --- maven-enforcer-plugin:3.0.0-M2:enforce (enforce-java) @ surefire-junit-platform ---
[2019-09-23T14:37:52.935Z] [INFO]
[2019-09-23T14:37:52.935Z] [INFO] --- maven-enforcer-plugin:3.0.0-M2:enforce (enforce-maven) @ surefire-junit-platform ---
[2019-09-23T14:37:52.935Z] [INFO]
[2019-09-23T14:37:52.935Z] [INFO] --- apache-rat-plugin:0.12:check (rat-check) @ surefire-junit-platform ---
[2019-09-23T14:37:52.935Z] [INFO] Enabled default license matchers.
[2019-09-23T14:37:52.935Z] [INFO] Will parse SCM ignores for exclusions...
[2019-09-23T14:37:52.935Z] [INFO] Finished adding exclusions from SCM ignore files.
[2019-09-23T14:37:52.935Z] [INFO] 61 implicit excludes (use -debug for more details).
[2019-09-23T14:37:52.935Z] [INFO] Exclude: .repository/**
[2019-09-23T14:37:52.935Z] [INFO] Exclude: .maven/spy.log
[2019-09-23T14:37:52.935Z] [INFO] Exclude: dependency-reduced-pom.xml
[2019-09-23T14:37:52.935Z] [INFO] Exclude: .java-version
[2019-09-23T14:37:52.935Z] [INFO] Exclude: Jenkinsfile
[2019-09-23T14:37:52.935Z] [INFO] Exclude: README.md
[2019-09-23T14:37:52.935Z] [INFO] Exclude: .gitignore
[2019-09-23T14:37:52.935Z] [INFO] Exclude: .git/**/*
[2019-09-23T14:37:52.935Z] [INFO] Exclude: **/.idea
[2019-09-23T14:37:52.935Z] [INFO] Exclude: **/.svn/**/*
[2019-09-23T14:37:52.935Z] [INFO] Exclude: **/*.iml
[2019-09-23T14:37:52.935Z] [INFO] Exclude: **/*.ipr
[2019-09-23T14:37:52.935Z] [INFO] Exclude: **/*.iws
[2019-09-23T14:37:52.935Z] [INFO] Exclude: **/*.versionsBackup
[2019-09-23T14:37:52.935Z] [INFO] Exclude: **/dependency-reduced-pom.xml
[2019-09-23T14:37:52.935Z] [INFO] Exclude: .repository/**
[2019-09-23T14:37:52.935Z] [INFO] Exclude: src/test/resources/**/*
[2019-09-23T14:37:52.935Z] [INFO] Exclude: src/test/resources/**/*.css
[2019-09-23T14:37:52.935Z] [INFO] Exclude: **/*.jj
[2019-09-23T14:37:52.935Z] [INFO] Exclude: src/main/resources/META-INF/services/org.apache.maven.surefire.providerapi.SurefireProvider
[2019-09-23T14:37:52.935Z] [INFO] Exclude: DEPENDENCIES
[2019-09-23T14:37:52.935Z] [INFO] Exclude: .m2/**
[2019-09-23T14:37:52.935Z] [INFO] Exclude: .m2
[2019-09-23T14:37:52.935Z] [INFO] Exclude: .travis.yml
[2019-09-23T14:37:52.935Z] [INFO] 9 resources included (use -debug for more details)
[2019-09-23T14:37:53.203Z] [INFO] Rat check: Summary over all files. Unapproved: 0, unknown: 0, generated: 0, approved: 9 licenses.
[2019-09-23T14:37:53.203Z] [INFO]
[2019-09-23T14:37:53.203Z] [INFO] --- jacoco-maven-plugin:0.8.2:prepare-agent (jacoco-agent) @ surefire-junit-platform ---
[2019-09-23T14:37:53.203Z] [INFO] Skipping JaCoCo execution because property jacoco.skip is set.
[2019-09-23T14:37:53.203Z] [INFO] jacoco.agent set to empty
[2019-09-23T14:37:53.203Z] [INFO]
[2019-09-23T14:37:53.203Z] [INFO] --- maven-compiler-plugin:3.7.0:compile (compile-generated) @ surefire-junit-platform ---
[2019-09-23T14:37:53.203Z] [INFO] Nothing to compile - all classes are up to date
[2019-09-23T14:37:53.203Z] [INFO]
[2019-09-23T14:37:53.203Z] [INFO] --- maven-remote-resources-plugin:1.5:process (process-resource-bundles) @ surefire-junit-platform ---
[2019-09-23T14:37:53.510Z] [INFO]
[2019-09-23T14:37:53.510Z] [INFO] --- maven-resources-plugin:3.1.0:resources (default-resources) @ surefire-junit-platform ---
[2019-09-23T14:37:53.510Z] [INFO] Using 'UTF-8' encoding to copy filtered resources.
[2019-09-23T14:37:53.510Z] [INFO] Copying 1 resource
[2019-09-23T14:37:53.510Z] [INFO] Copying 3 resources
[2019-09-23T14:37:53.510Z] [INFO]
[2019-09-23T14:37:53.510Z] [INFO] --- maven-compiler-plugin:3.7.0:compile (default-compile) @ surefire-junit-platform ---
[2019-09-23T14:37:53.510Z] [INFO] Changes detected - recompiling the module!
[2019-09-23T14:37:53.510Z] [INFO] Compiling 4 source files to F:\jenkins\jenkins-slave\workspace\box_maven-surefire_SUREFIRE-1603\surefire-providers\surefire-junit-platform\target\classes
[2019-09-23T14:37:55.496Z] [INFO]
[2019-09-23T14:37:55.496Z] [INFO] --- animal-sniffer-maven-plugin:1.17:check (signature-check) @ surefire-junit-platform ---
[2019-09-23T14:37:55.496Z] [INFO] Checking unresolved references to org.codehaus.mojo.signature:java18:1.0
[2019-09-23T14:37:55.496Z] [INFO] Downloading from central: https://repo.maven.apache.org/maven2/org/codehaus/mojo/signature/java18/1.0/java18-1.0.signature
[2019-09-23T14:37:55.496Z] [INFO] Downloaded from central: https://repo.maven.apache.org/maven2/org/codehaus/mojo/signature/java18/1.0/java18-1.0.signature (2.0 MB at 8.0 MB/s)
[2019-09-23T14:37:56.494Z] [INFO]
[2019-09-23T14:37:56.494Z] [INFO] --- maven-resources-plugin:3.1.0:testResources (default-testResources) @ surefire-junit-platform ---
[2019-09-23T14:37:56.494Z] [INFO] Using 'UTF-8' encoding to copy filtered resources.
[2019-09-23T14:37:56.494Z] [INFO] skip non existing resourceDirectory F:\jenkins\jenkins-slave\workspace\box_maven-surefire_SUREFIRE-1603\surefire-providers\surefire-junit-platform\src\test\resources
[2019-09-23T14:37:56.494Z] [INFO] Copying 3 resources
[2019-09-23T14:37:56.762Z] [INFO]
[2019-09-23T14:37:56.762Z] [INFO] --- maven-compiler-plugin:3.7.0:testCompile (default-testCompile) @ surefire-junit-platform ---
[2019-09-23T14:37:56.762Z] [INFO] Changes detected - recompiling the module!
[2019-09-23T14:37:56.762Z] [INFO] Compiling 4 source files to F:\jenkins\jenkins-slave\workspace\box_maven-surefire_SUREFIRE-1603\surefire-providers\surefire-junit-platform\target\test-classes
[2019-09-23T14:38:00.160Z] [INFO]
[2019-09-23T14:38:00.160Z] [INFO] --- maven-surefire-plugin:2.12.4:test (default-test) @ surefire-junit-platform ---
[2019-09-23T14:38:00.160Z] [INFO] Surefire report directory: F:\jenkins\jenkins-slave\workspace\box_maven-surefire_SUREFIRE-1603\surefire-providers\surefire-junit-platform\target\surefire-reports
[2019-09-23T14:38:00.160Z] [INFO] Using configured provider org.apache.maven.surefire.shadefire.junit.JUnit3Provider
[2019-09-23T14:38:00.160Z]
[2019-09-23T14:38:00.160Z] -------------------------------------------------------
[2019-09-23T14:38:00.160Z]  T E S T S
[2019-09-23T14:38:00.160Z] -------------------------------------------------------
[2019-09-23T14:38:00.160Z] Running org.apache.maven.surefire.junitplatform.JUnitPlatformProviderTest
[2019-09-23T14:38:00.160Z] Tests run: 0, Failures: 0, Errors: 0, Skipped: 0, Time elapsed: 0 sec
[2019-09-23T14:38:00.780Z] Running org.apache.maven.surefire.junitplatform.RunListenerAdapterTest
[2019-09-23T14:38:00.780Z] Tests run: 0, Failures: 0, Errors: 0, Skipped: 0, Time elapsed: 0 sec
[2019-09-23T14:38:00.780Z] Running org.apache.maven.surefire.junitplatform.TestMethodFilterTest
[2019-09-23T14:38:00.780Z] Tests run: 0, Failures: 0, Errors: 0, Skipped: 0, Time elapsed: 0 sec
[2019-09-23T14:38:00.780Z] Running org.apache.maven.surefire.junitplatform.TestPlanScannerFilterTest
[2019-09-23T14:38:00.780Z] Tests run: 0, Failures: 0, Errors: 0, Skipped: 0, Time elapsed: 0 sec
[2019-09-23T14:38:00.780Z]
[2019-09-23T14:38:00.780Z] Results :
[2019-09-23T14:38:00.780Z]
[2019-09-23T14:38:00.780Z] Tests run: 0, Failures: 0, Errors: 0, Skipped: 0
[2019-09-23T14:38:00.780Z]
[2019-09-23T14:38:00.780Z] [INFO]
[2019-09-23T14:38:00.780Z] [INFO] --- maven-jar-plugin:3.1.0:jar (default-jar) @ surefire-junit-platform ---
[2019-09-23T14:38:00.780Z] [INFO] Building jar: F:\jenkins\jenkins-slave\workspace\box_maven-surefire_SUREFIRE-1603\surefire-providers\surefire-junit-platform\target\surefire-junit-platform-3.0.0-M2-SNAPSHOT.jar
[2019-09-23T14:38:01.045Z] [INFO]
[2019-09-23T14:38:01.045Z] [INFO] --- maven-site-plugin:3.7.1:attach-descriptor (attach-descriptor) @ surefire-junit-platform ---
[2019-09-23T14:38:01.045Z] [INFO] Skipping because packaging 'jar' is not pom.
[2019-09-23T14:38:01.045Z] [INFO]
[2019-09-23T14:38:01.045Z] [INFO] --- maven-checkstyle-plugin:3.0.0:check (checkstyle-check) @ surefire-junit-platform ---
[2019-09-23T14:38:01.321Z] [INFO] There are 2 errors reported by Checkstyle 6.18 with config/maven_checks.xml ruleset.
[2019-09-23T14:38:01.321Z] [ERROR] src\main\java\org\apache\maven\surefire\junitplatform\RunListenerAdapter.java:[206,13] (whitespace) ParenPad: '(' is not followed by whitespace.
[2019-09-23T14:38:01.321Z] [ERROR] src\main\java\org\apache\maven\surefire\junitplatform\RunListenerAdapter.java:[206,28] (whitespace) ParenPad: ')' is not preceded with whitespace.
[2019-09-23T14:38:01.321Z] [INFO] ------------------------------------------------------------------------
[2019-09-23T14:38:01.321Z] [INFO] Reactor Summary:
[2019-09-23T14:38:01.321Z] [INFO]
[2019-09-23T14:38:01.321Z] [INFO] Apache Maven Surefire .............................. SUCCESS [ 54.723 s]
[2019-09-23T14:38:01.321Z] [INFO] SureFire Logger API ................................ SUCCESS [ 10.419 s]
[2019-09-23T14:38:01.321Z] [INFO] SureFire API ....................................... SUCCESS [ 20.839 s]
[2019-09-23T14:38:01.321Z] [INFO] SureFire Booter .................................... SUCCESS [ 18.371 s]
[2019-09-23T14:38:01.321Z] [INFO] Maven Surefire Test-Grouping Support ............... SUCCESS [ 10.585 s]
[2019-09-23T14:38:01.321Z] [INFO] SureFire Providers ................................. SUCCESS [  1.231 s]
[2019-09-23T14:38:01.321Z] [INFO] Shared JUnit3 Provider Code ........................ SUCCESS [  4.158 s]
[2019-09-23T14:38:01.321Z] [INFO] Shared Java 5 Provider Base ........................ SUCCESS [  5.850 s]
[2019-09-23T14:38:01.321Z] [INFO] Shared JUnit4 Provider Code ........................ SUCCESS [  5.987 s]
[2019-09-23T14:38:01.321Z] [INFO] Shared JUnit48 Provider Code ....................... SUCCESS [  7.058 s]
[2019-09-23T14:38:01.321Z] [INFO] SureFire JUnit Runner .............................. SUCCESS [  4.910 s]
[2019-09-23T14:38:01.321Z] [INFO] SureFire JUnit4 Runner ............................. SUCCESS [  5.098 s]
[2019-09-23T14:38:01.321Z] [INFO] Maven Surefire Common .............................. SUCCESS [ 33.958 s]
[2019-09-23T14:38:01.321Z] [INFO] SureFire JUnitCore Runner .......................... SUCCESS [02:22 min]
[2019-09-23T14:38:01.321Z] [INFO] SureFire JUnit Platform Runner ..................... FAILURE [  9.813 s]
[2019-09-23T14:38:01.321Z] [INFO] SureFire TestNG Utils .............................. SKIPPED
[2019-09-23T14:38:01.321Z] [INFO] SureFire TestNG Runner ............................. SKIPPED
[2019-09-23T14:38:01.321Z] [INFO] ShadeFire JUnit3 Provider .......................... SKIPPED
[2019-09-23T14:38:01.322Z] [INFO] Surefire Report Parser ............................. SKIPPED
[2019-09-23T14:38:01.322Z] [INFO] Maven Surefire Plugin .............................. SKIPPED
[2019-09-23T14:38:01.322Z] [INFO] Maven Failsafe Plugin .............................. SKIPPED
[2019-09-23T14:38:01.322Z] [INFO] Maven Surefire Report Plugin ....................... SKIPPED
[2019-09-23T14:38:01.322Z] [INFO] Maven Surefire Integration Tests ................... SKIPPED
[2019-09-23T14:38:01.322Z] [INFO] ------------------------------------------------------------------------
[2019-09-23T14:38:01.322Z] [INFO] BUILD FAILURE
[2019-09-23T14:38:01.322Z] [INFO] ------------------------------------------------------------------------
[2019-09-23T14:38:01.322Z] [INFO] Total time: 05:38 min
[2019-09-23T14:38:01.322Z] [INFO] Finished at: 2019-09-23T07:38:01-07:00
[2019-09-23T14:38:01.637Z] [INFO] Final Memory: 39M/130M
[2019-09-23T14:38:01.637Z] [INFO] ------------------------------------------------------------------------
[2019-09-23T14:38:01.637Z] [ERROR] Failed to execute goal org.apache.maven.plugins:maven-checkstyle-plugin:3.0.0:check (checkstyle-check) on project surefire-junit-platform: You have 2 Checkstyle violations. -> [Help 1]
[2019-09-23T14:38:01.637Z] org.apache.maven.lifecycle.LifecycleExecutionException: Failed to execute goal org.apache.maven.plugins:maven-checkstyle-plugin:3.0.0:check (checkstyle-check) on project surefire-junit-platform: You have 2 Checkstyle violations.
[2019-09-23T14:38:01.637Z]     at org.apache.maven.lifecycle.internal.MojoExecutor.execute (MojoExecutor.java:213)
[2019-09-23T14:38:01.637Z]     at org.apache.maven.lifecycle.internal.MojoExecutor.execute (MojoExecutor.java:154)
[2019-09-23T14:38:01.637Z]     at org.apache.maven.lifecycle.internal.MojoExecutor.execute (MojoExecutor.java:146)
[2019-09-23T14:38:01.637Z]     at org.apache.maven.lifecycle.internal.LifecycleModuleBuilder.buildProject (LifecycleModuleBuilder.java:117)
[2019-09-23T14:38:01.637Z]     at org.apache.maven.lifecycle.internal.LifecycleModuleBuilder.buildProject (LifecycleModuleBuilder.java:81)
[2019-09-23T14:38:01.637Z]     at org.apache.maven.lifecycle.internal.builder.singlethreaded.SingleThreadedBuilder.build (SingleThreadedBuilder.java:51)
[2019-09-23T14:38:01.637Z]     at org.apache.maven.lifecycle.internal.LifecycleStarter.execute (LifecycleStarter.java:128)
[2019-09-23T14:38:01.637Z]     at org.apache.maven.DefaultMaven.doExecute (DefaultMaven.java:309)
[2019-09-23T14:38:01.637Z]     at org.apache.maven.DefaultMaven.doExecute (DefaultMaven.java:194)
[2019-09-23T14:38:01.637Z]     at org.apache.maven.DefaultMaven.execute (DefaultMaven.java:107)
[2019-09-23T14:38:01.637Z]     at org.apache.maven.cli.MavenCli.execute (MavenCli.java:955)
[2019-09-23T14:38:01.637Z]     at org.apache.maven.cli.MavenCli.doMain (MavenCli.java:290)
[2019-09-23T14:38:01.637Z]     at org.apache.maven.cli.MavenCli.main (MavenCli.java:194)
[2019-09-23T14:38:01.637Z]     at sun.reflect.NativeMethodAccessorImpl.invoke0 (Native Method)
[2019-09-23T14:38:01.637Z]     at sun.reflect.NativeMethodAccessorImpl.invoke (NativeMethodAccessorImpl.java:62)
[2019-09-23T14:38:01.637Z]     at sun.reflect.DelegatingMethodAccessorImpl.invoke (DelegatingMethodAccessorImpl.java:43)
[2019-09-23T14:38:01.637Z]     at java.lang.reflect.Method.invoke (Method.java:498)
[2019-09-23T14:38:01.637Z]     at org.codehaus.plexus.classworlds.launcher.Launcher.launchEnhanced (Launcher.java:289)
[2019-09-23T14:38:01.637Z]     at org.codehaus.plexus.classworlds.launcher.Launcher.launch (Launcher.java:229)
[2019-09-23T14:38:01.637Z]     at org.codehaus.plexus.classworlds.launcher.Launcher.mainWithExitCode (Launcher.java:415)
[2019-09-23T14:38:01.638Z]     at org.codehaus.plexus.classworlds.launcher.Launcher.main (Launcher.java:356)
[2019-09-23T14:38:01.638Z] Caused by: org.apache.maven.plugin.MojoFailureException: You have 2 Checkstyle violations.
[2019-09-23T14:38:01.638Z]     at org.apache.maven.plugins.checkstyle.CheckstyleViolationCheckMojo.execute (CheckstyleViolationCheckMojo.java:576)
[2019-09-23T14:38:01.638Z]     at org.apache.maven.plugin.DefaultBuildPluginManager.executeMojo (DefaultBuildPluginManager.java:134)
[2019-09-23T14:38:01.638Z]     at org.apache.maven.lifecycle.internal.MojoExecutor.execute (MojoExecutor.java:208)
[2019-09-23T14:38:01.638Z]     at org.apache.maven.lifecycle.internal.MojoExecutor.execute (MojoExecutor.java:154)
[2019-09-23T14:38:01.638Z]     at org.apache.maven.lifecycle.internal.MojoExecutor.execute (MojoExecutor.java:146)
[2019-09-23T14:38:01.638Z]     at org.apache.maven.lifecycle.internal.LifecycleModuleBuilder.buildProject (LifecycleModuleBuilder.java:117)
[2019-09-23T14:38:01.638Z]     at org.apache.maven.lifecycle.internal.LifecycleModuleBuilder.buildProject (LifecycleModuleBuilder.java:81)
[2019-09-23T14:38:01.638Z]     at org.apache.maven.lifecycle.internal.builder.singlethreaded.SingleThreadedBuilder.build (SingleThreadedBuilder.java:51)
[2019-09-23T14:38:01.638Z]     at org.apache.maven.lifecycle.internal.LifecycleStarter.execute (LifecycleStarter.java:128)
[2019-09-23T14:38:01.638Z]     at org.apache.maven.DefaultMaven.doExecute (DefaultMaven.java:309)
[2019-09-23T14:38:01.638Z]     at org.apache.maven.DefaultMaven.doExecute (DefaultMaven.java:194)
[2019-09-23T14:38:01.638Z]     at org.apache.maven.DefaultMaven.execute (DefaultMaven.java:107)
[2019-09-23T14:38:01.638Z]     at org.apache.maven.cli.MavenCli.execute (MavenCli.java:955)
[2019-09-23T14:38:01.638Z]     at org.apache.maven.cli.MavenCli.doMain (MavenCli.java:290)
[2019-09-23T14:38:01.638Z]     at org.apache.maven.cli.MavenCli.main (MavenCli.java:194)
[2019-09-23T14:38:01.638Z]     at sun.reflect.NativeMethodAccessorImpl.invoke0 (Native Method)
[2019-09-23T14:38:01.638Z]     at sun.reflect.NativeMethodAccessorImpl.invoke (NativeMethodAccessorImpl.java:62)
[2019-09-23T14:38:01.638Z]     at sun.reflect.DelegatingMethodAccessorImpl.invoke (DelegatingMethodAccessorImpl.java:43)
[2019-09-23T14:38:01.638Z]     at java.lang.reflect.Method.invoke (Method.java:498)
[2019-09-23T14:38:01.638Z]     at org.codehaus.plexus.classworlds.launcher.Launcher.launchEnhanced (Launcher.java:289)
[2019-09-23T14:38:01.638Z]     at org.codehaus.plexus.classworlds.launcher.Launcher.launch (Launcher.java:229)
[2019-09-23T14:38:01.638Z]     at org.codehaus.plexus.classworlds.launcher.Launcher.mainWithExitCode (Launcher.java:415)
[2019-09-23T14:38:01.638Z]     at org.codehaus.plexus.classworlds.launcher.Launcher.main (Launcher.java:356)
[2019-09-23T14:38:01.638Z] [ERROR]
[2019-09-23T14:38:01.638Z] [ERROR] Re-run Maven using the -X switch to enable full debug logging.
[2019-09-23T14:38:01.638Z] [ERROR]
[2019-09-23T14:38:01.638Z] [ERROR] For more information about the errors and possible solutions, please read the following articles:
[2019-09-23T14:38:01.638Z] [ERROR] [Help 1] http://cwiki.apache.org/confluence/display/MAVEN/MojoFailureException
[2019-09-23T14:38:01.638Z] [ERROR]
[2019-09-23T14:38:01.638Z] [ERROR] After correcting the problems, you can resume the build with the command
[2019-09-23T14:38:01.638Z] [ERROR]   mvn <goals> -rf :surefire-junit-platform
[Pipeline] }
[Pipeline] // withEnv
[Pipeline] }
[Pipeline] // stage
[Pipeline] stage
[Pipeline] { (reporting windows-jdk7-maven3.5.x)
[Pipeline] fileExists
[Pipeline] fileExists
[Pipeline] archiveArtifacts
[2019-09-23T14:38:01.872Z] Archiving artifacts
[2019-09-23T14:38:02.322Z] ‘*--windows-jdk7-maven3.5.x.zip’ doesn’t match anything
[2019-09-23T14:38:02.322Z] No artifacts found that match the file pattern "*--windows-jdk7-maven3.5.x.zip". Configuration error?
[Pipeline] }
[Pipeline] // stage
[Pipeline] stage
[Pipeline] { (cleanup windows-jdk7-maven3.5.x)
[Pipeline] cleanWs
[2019-09-23T14:38:02.428Z] [WS-CLEANUP] Deleting project workspace...
[2019-09-23T14:38:02.428Z] [WS-CLEANUP] Deferred wipeout is used...
[2019-09-23T14:38:02.500Z] [WS-CLEANUP] done
[Pipeline] }
[Pipeline] // stage
[Pipeline] }
[Pipeline] // timestamps
[Pipeline] }
[Pipeline] // node
[Pipeline] }
Failed in branch windows-jdk7-maven3.5.x
[Pipeline] // parallel
[Pipeline] echo
hudson.AbortException: hudson.AbortException: script returned exit code 1
[Pipeline] stage
[Pipeline] { (notifications)
[Pipeline] echo
Build result: FAILURE
[Pipeline] jiraIssueSelector
[Pipeline] echo
The authors of changes [rfscholte].
[Pipeline] echo
Sending email ...
[Pipeline] emailext
Reply | Threaded
Open this post in threaded view
|

Build failed in Jenkins: Maven TLP » maven-surefire » SUREFIRE-1603 #13

Apache Jenkins Server-2
See https://builds.apache.org/job/maven-box/job/maven-surefire/job/SUREFIRE-1603/13/

Changes:

* Apply Maven 3.6.2
* H29 has checkout issues...
* Issues with H28 too
* Seems like Maven 3.6.2 is not available on all Linux nodes yet
* Java 13 released: drop 12 + include 14 (-ea)

All tests passed

Build log:
[...truncated 24271 lines...]
[2019-10-01T07:21:52.890Z] [INFO] Downloading from central: https://repo.maven.apache.org/maven2/org/opentest4j/opentest4j/1.1.1/opentest4j-1.1.1.jar
[2019-10-01T07:21:52.890Z] [INFO] Downloaded from central: https://repo.maven.apache.org/maven2/org/junit/platform/junit-platform-commons/1.3.1/junit-platform-commons-1.3.1.jar (78 kB at 1.8 MB/s)
[2019-10-01T07:21:52.890Z] [INFO] Downloading from central: https://repo.maven.apache.org/maven2/org/junit/jupiter/junit-jupiter-engine/5.3.1/junit-jupiter-engine-5.3.1.jar
[2019-10-01T07:21:52.890Z] [INFO] Downloaded from central: https://repo.maven.apache.org/maven2/org/junit/platform/junit-platform-launcher/1.3.1/junit-platform-launcher-1.3.1.jar (95 kB at 2.2 MB/s)
[2019-10-01T07:21:52.890Z] [INFO] Downloading from central: https://repo.maven.apache.org/maven2/org/junit/jupiter/junit-jupiter-api/5.3.1/junit-jupiter-api-5.3.1.jar
[2019-10-01T07:21:52.890Z] [INFO] Downloaded from central: https://repo.maven.apache.org/maven2/org/junit/platform/junit-platform-engine/1.3.1/junit-platform-engine-1.3.1.jar (135 kB at 2.7 MB/s)
[2019-10-01T07:21:52.890Z] [INFO] Downloading from central: https://repo.maven.apache.org/maven2/org/assertj/assertj-core/3.9.1/assertj-core-3.9.1.jar
[2019-10-01T07:21:53.166Z] [INFO] Downloaded from central: https://repo.maven.apache.org/maven2/org/apiguardian/apiguardian-api/1.0.0/apiguardian-api-1.0.0.jar (2.2 kB at 31 kB/s)
[2019-10-01T07:21:53.166Z] [INFO] Downloaded from central: https://repo.maven.apache.org/maven2/org/opentest4j/opentest4j/1.1.1/opentest4j-1.1.1.jar (7.1 kB at 51 kB/s)
[2019-10-01T07:21:53.166Z] [INFO] Downloaded from central: https://repo.maven.apache.org/maven2/org/junit/jupiter/junit-jupiter-api/5.3.1/junit-jupiter-api-5.3.1.jar (115 kB at 337 kB/s)
[2019-10-01T07:21:53.442Z] [INFO] Downloaded from central: https://repo.maven.apache.org/maven2/org/junit/jupiter/junit-jupiter-engine/5.3.1/junit-jupiter-engine-5.3.1.jar (150 kB at 329 kB/s)
[2019-10-01T07:21:53.442Z] [INFO] Downloaded from central: https://repo.maven.apache.org/maven2/org/assertj/assertj-core/3.9.1/assertj-core-3.9.1.jar (3.9 MB at 6.6 MB/s)
[2019-10-01T07:21:53.733Z] [INFO]
[2019-10-01T07:21:53.733Z] [INFO] --- maven-clean-plugin:3.1.0:clean (default-clean) @ surefire-junit-platform ---
[2019-10-01T07:21:53.733Z] [INFO]
[2019-10-01T07:21:53.733Z] [INFO] --- maven-enforcer-plugin:3.0.0-M2:enforce (enforce-maven-version) @ surefire-junit-platform ---
[2019-10-01T07:21:53.733Z] [INFO]
[2019-10-01T07:21:53.733Z] [INFO] --- maven-enforcer-plugin:3.0.0-M2:enforce (enforce-bytecode-version) @ surefire-junit-platform ---
[2019-10-01T07:21:53.733Z] [INFO]
[2019-10-01T07:21:53.733Z] [INFO] --- maven-enforcer-plugin:3.0.0-M2:enforce (ban-known-bad-maven-versions) @ surefire-junit-platform ---
[2019-10-01T07:21:53.733Z] [INFO]
[2019-10-01T07:21:53.733Z] [INFO] --- maven-enforcer-plugin:3.0.0-M2:enforce (enforce-java) @ surefire-junit-platform ---
[2019-10-01T07:21:53.733Z] [INFO]
[2019-10-01T07:21:53.733Z] [INFO] --- maven-enforcer-plugin:3.0.0-M2:enforce (enforce-maven) @ surefire-junit-platform ---
[2019-10-01T07:21:53.733Z] [INFO]
[2019-10-01T07:21:53.733Z] [INFO] --- apache-rat-plugin:0.12:check (rat-check) @ surefire-junit-platform ---
[2019-10-01T07:21:53.733Z] [INFO] Enabled default license matchers.
[2019-10-01T07:21:53.733Z] [INFO] Will parse SCM ignores for exclusions...
[2019-10-01T07:21:53.733Z] [INFO] Finished adding exclusions from SCM ignore files.
[2019-10-01T07:21:53.733Z] [INFO] 61 implicit excludes (use -debug for more details).
[2019-10-01T07:21:53.733Z] [INFO] Exclude: .repository/**
[2019-10-01T07:21:53.733Z] [INFO] Exclude: .maven/spy.log
[2019-10-01T07:21:53.733Z] [INFO] Exclude: dependency-reduced-pom.xml
[2019-10-01T07:21:53.733Z] [INFO] Exclude: .java-version
[2019-10-01T07:21:53.733Z] [INFO] Exclude: Jenkinsfile
[2019-10-01T07:21:53.733Z] [INFO] Exclude: README.md
[2019-10-01T07:21:53.733Z] [INFO] Exclude: .gitignore
[2019-10-01T07:21:53.733Z] [INFO] Exclude: .git/**/*
[2019-10-01T07:21:53.733Z] [INFO] Exclude: **/.idea
[2019-10-01T07:21:53.733Z] [INFO] Exclude: **/.svn/**/*
[2019-10-01T07:21:53.733Z] [INFO] Exclude: **/*.iml
[2019-10-01T07:21:53.733Z] [INFO] Exclude: **/*.ipr
[2019-10-01T07:21:53.733Z] [INFO] Exclude: **/*.iws
[2019-10-01T07:21:53.733Z] [INFO] Exclude: **/*.versionsBackup
[2019-10-01T07:21:53.733Z] [INFO] Exclude: **/dependency-reduced-pom.xml
[2019-10-01T07:21:53.733Z] [INFO] Exclude: .repository/**
[2019-10-01T07:21:53.733Z] [INFO] Exclude: src/test/resources/**/*
[2019-10-01T07:21:53.733Z] [INFO] Exclude: src/test/resources/**/*.css
[2019-10-01T07:21:53.733Z] [INFO] Exclude: **/*.jj
[2019-10-01T07:21:53.733Z] [INFO] Exclude: src/main/resources/META-INF/services/org.apache.maven.surefire.providerapi.SurefireProvider
[2019-10-01T07:21:53.733Z] [INFO] Exclude: DEPENDENCIES
[2019-10-01T07:21:53.733Z] [INFO] Exclude: .m2/**
[2019-10-01T07:21:53.733Z] [INFO] Exclude: .m2
[2019-10-01T07:21:53.733Z] [INFO] Exclude: .travis.yml
[2019-10-01T07:21:53.733Z] [INFO] 9 resources included (use -debug for more details)
[2019-10-01T07:21:54.039Z] [INFO] Rat check: Summary over all files. Unapproved: 0, unknown: 0, generated: 0, approved: 9 licenses.
[2019-10-01T07:21:54.039Z] [INFO]
[2019-10-01T07:21:54.039Z] [INFO] --- jacoco-maven-plugin:0.8.2:prepare-agent (jacoco-agent) @ surefire-junit-platform ---
[2019-10-01T07:21:54.039Z] [INFO] Skipping JaCoCo execution because property jacoco.skip is set.
[2019-10-01T07:21:54.039Z] [INFO] jacoco.agent set to empty
[2019-10-01T07:21:54.039Z] [INFO]
[2019-10-01T07:21:54.039Z] [INFO] --- maven-compiler-plugin:3.7.0:compile (compile-generated) @ surefire-junit-platform ---
[2019-10-01T07:21:54.039Z] [INFO] Nothing to compile - all classes are up to date
[2019-10-01T07:21:54.039Z] [INFO]
[2019-10-01T07:21:54.039Z] [INFO] --- maven-remote-resources-plugin:1.5:process (process-resource-bundles) @ surefire-junit-platform ---
[2019-10-01T07:21:54.039Z] [INFO]
[2019-10-01T07:21:54.039Z] [INFO] --- maven-resources-plugin:3.1.0:resources (default-resources) @ surefire-junit-platform ---
[2019-10-01T07:21:54.039Z] [INFO] Using 'UTF-8' encoding to copy filtered resources.
[2019-10-01T07:21:54.039Z] [INFO] Copying 1 resource
[2019-10-01T07:21:54.039Z] [INFO] Copying 3 resources
[2019-10-01T07:21:54.039Z] [INFO]
[2019-10-01T07:21:54.039Z] [INFO] --- maven-compiler-plugin:3.7.0:compile (default-compile) @ surefire-junit-platform ---
[2019-10-01T07:21:54.039Z] [INFO] Changes detected - recompiling the module!
[2019-10-01T07:21:54.039Z] [INFO] Compiling 4 source files to F:\jenkins\jenkins-slave\workspace\box_maven-surefire_SUREFIRE-1603\surefire-providers\surefire-junit-platform\target\classes
[2019-10-01T07:21:56.015Z] [INFO]
[2019-10-01T07:21:56.015Z] [INFO] --- animal-sniffer-maven-plugin:1.17:check (signature-check) @ surefire-junit-platform ---
[2019-10-01T07:21:56.015Z] [INFO] Checking unresolved references to org.codehaus.mojo.signature:java18:1.0
[2019-10-01T07:21:56.015Z] [INFO] Downloading from central: https://repo.maven.apache.org/maven2/org/codehaus/mojo/signature/java18/1.0/java18-1.0.signature
[2019-10-01T07:21:56.015Z] [INFO] Downloaded from central: https://repo.maven.apache.org/maven2/org/codehaus/mojo/signature/java18/1.0/java18-1.0.signature (2.0 MB at 8.1 MB/s)
[2019-10-01T07:21:57.012Z] [INFO]
[2019-10-01T07:21:57.012Z] [INFO] --- maven-resources-plugin:3.1.0:testResources (default-testResources) @ surefire-junit-platform ---
[2019-10-01T07:21:57.012Z] [INFO] Using 'UTF-8' encoding to copy filtered resources.
[2019-10-01T07:21:57.012Z] [INFO] skip non existing resourceDirectory F:\jenkins\jenkins-slave\workspace\box_maven-surefire_SUREFIRE-1603\surefire-providers\surefire-junit-platform\src\test\resources
[2019-10-01T07:21:57.012Z] [INFO] Copying 3 resources
[2019-10-01T07:21:57.012Z] [INFO]
[2019-10-01T07:21:57.012Z] [INFO] --- maven-compiler-plugin:3.7.0:testCompile (default-testCompile) @ surefire-junit-platform ---
[2019-10-01T07:21:57.012Z] [INFO] Changes detected - recompiling the module!
[2019-10-01T07:21:57.012Z] [INFO] Compiling 4 source files to F:\jenkins\jenkins-slave\workspace\box_maven-surefire_SUREFIRE-1603\surefire-providers\surefire-junit-platform\target\test-classes
[2019-10-01T07:21:59.647Z] [INFO]
[2019-10-01T07:21:59.647Z] [INFO] --- maven-surefire-plugin:2.12.4:test (default-test) @ surefire-junit-platform ---
[2019-10-01T07:21:59.647Z] [INFO] Surefire report directory: F:\jenkins\jenkins-slave\workspace\box_maven-surefire_SUREFIRE-1603\surefire-providers\surefire-junit-platform\target\surefire-reports
[2019-10-01T07:21:59.647Z] [INFO] Using configured provider org.apache.maven.surefire.shadefire.junit.JUnit3Provider
[2019-10-01T07:21:59.647Z]
[2019-10-01T07:21:59.647Z] -------------------------------------------------------
[2019-10-01T07:21:59.647Z]  T E S T S
[2019-10-01T07:21:59.648Z] -------------------------------------------------------
[2019-10-01T07:21:59.956Z] Running org.apache.maven.surefire.junitplatform.JUnitPlatformProviderTest
[2019-10-01T07:21:59.956Z] Tests run: 0, Failures: 0, Errors: 0, Skipped: 0, Time elapsed: 0.001 sec
[2019-10-01T07:22:00.590Z] Running org.apache.maven.surefire.junitplatform.RunListenerAdapterTest
[2019-10-01T07:22:00.590Z] Tests run: 0, Failures: 0, Errors: 0, Skipped: 0, Time elapsed: 0 sec
[2019-10-01T07:22:00.888Z] Running org.apache.maven.surefire.junitplatform.TestMethodFilterTest
[2019-10-01T07:22:00.888Z] Tests run: 0, Failures: 0, Errors: 0, Skipped: 0, Time elapsed: 0 sec
[2019-10-01T07:22:00.888Z] Running org.apache.maven.surefire.junitplatform.TestPlanScannerFilterTest
[2019-10-01T07:22:00.888Z] Tests run: 0, Failures: 0, Errors: 0, Skipped: 0, Time elapsed: 0 sec
[2019-10-01T07:22:00.888Z]
[2019-10-01T07:22:00.888Z] Results :
[2019-10-01T07:22:00.888Z]
[2019-10-01T07:22:00.888Z] Tests run: 0, Failures: 0, Errors: 0, Skipped: 0
[2019-10-01T07:22:00.888Z]
[2019-10-01T07:22:00.888Z] [INFO]
[2019-10-01T07:22:00.888Z] [INFO] --- maven-jar-plugin:3.1.0:jar (default-jar) @ surefire-junit-platform ---
[2019-10-01T07:22:00.888Z] [INFO] Building jar: F:\jenkins\jenkins-slave\workspace\box_maven-surefire_SUREFIRE-1603\surefire-providers\surefire-junit-platform\target\surefire-junit-platform-3.0.0-M2-SNAPSHOT.jar
[2019-10-01T07:22:00.888Z] [INFO]
[2019-10-01T07:22:00.888Z] [INFO] --- maven-site-plugin:3.7.1:attach-descriptor (attach-descriptor) @ surefire-junit-platform ---
[2019-10-01T07:22:00.888Z] [INFO] Skipping because packaging 'jar' is not pom.
[2019-10-01T07:22:00.888Z] [INFO]
[2019-10-01T07:22:00.888Z] [INFO] --- maven-checkstyle-plugin:3.0.0:check (checkstyle-check) @ surefire-junit-platform ---
[2019-10-01T07:22:01.493Z] [INFO] There are 2 errors reported by Checkstyle 6.18 with config/maven_checks.xml ruleset.
[2019-10-01T07:22:01.493Z] [ERROR] src\main\java\org\apache\maven\surefire\junitplatform\RunListenerAdapter.java:[206,13] (whitespace) ParenPad: '(' is not followed by whitespace.
[2019-10-01T07:22:01.493Z] [ERROR] src\main\java\org\apache\maven\surefire\junitplatform\RunListenerAdapter.java:[206,28] (whitespace) ParenPad: ')' is not preceded with whitespace.
[2019-10-01T07:22:01.493Z] [INFO] ------------------------------------------------------------------------
[2019-10-01T07:22:01.493Z] [INFO] Reactor Summary:
[2019-10-01T07:22:01.493Z] [INFO]
[2019-10-01T07:22:01.493Z] [INFO] Apache Maven Surefire .............................. SUCCESS [ 50.061 s]
[2019-10-01T07:22:01.493Z] [INFO] SureFire Logger API ................................ SUCCESS [ 10.127 s]
[2019-10-01T07:22:01.493Z] [INFO] SureFire API ....................................... SUCCESS [ 16.998 s]
[2019-10-01T07:22:01.493Z] [INFO] SureFire Booter .................................... SUCCESS [ 17.119 s]
[2019-10-01T07:22:01.493Z] [INFO] Maven Surefire Test-Grouping Support ............... SUCCESS [  9.849 s]
[2019-10-01T07:22:01.494Z] [INFO] SureFire Providers ................................. SUCCESS [  1.001 s]
[2019-10-01T07:22:01.494Z] [INFO] Shared JUnit3 Provider Code ........................ SUCCESS [  4.485 s]
[2019-10-01T07:22:01.494Z] [INFO] Shared Java 5 Provider Base ........................ SUCCESS [  5.536 s]
[2019-10-01T07:22:01.494Z] [INFO] Shared JUnit4 Provider Code ........................ SUCCESS [  5.519 s]
[2019-10-01T07:22:01.494Z] [INFO] Shared JUnit48 Provider Code ....................... SUCCESS [  6.298 s]
[2019-10-01T07:22:01.494Z] [INFO] SureFire JUnit Runner .............................. SUCCESS [  4.528 s]
[2019-10-01T07:22:01.494Z] [INFO] SureFire JUnit4 Runner ............................. SUCCESS [  5.069 s]
[2019-10-01T07:22:01.494Z] [INFO] Maven Surefire Common .............................. SUCCESS [ 32.965 s]
[2019-10-01T07:22:01.494Z] [INFO] SureFire JUnitCore Runner .......................... SUCCESS [02:21 min]
[2019-10-01T07:22:01.494Z] [INFO] SureFire JUnit Platform Runner ..................... FAILURE [  8.894 s]
[2019-10-01T07:22:01.494Z] [INFO] SureFire TestNG Utils .............................. SKIPPED
[2019-10-01T07:22:01.494Z] [INFO] SureFire TestNG Runner ............................. SKIPPED
[2019-10-01T07:22:01.494Z] [INFO] ShadeFire JUnit3 Provider .......................... SKIPPED
[2019-10-01T07:22:01.494Z] [INFO] Surefire Report Parser ............................. SKIPPED
[2019-10-01T07:22:01.494Z] [INFO] Maven Surefire Plugin .............................. SKIPPED
[2019-10-01T07:22:01.494Z] [INFO] Maven Failsafe Plugin .............................. SKIPPED
[2019-10-01T07:22:01.494Z] [INFO] Maven Surefire Report Plugin ....................... SKIPPED
[2019-10-01T07:22:01.494Z] [INFO] Maven Surefire Integration Tests ................... SKIPPED
[2019-10-01T07:22:01.494Z] [INFO] ------------------------------------------------------------------------
[2019-10-01T07:22:01.494Z] [INFO] BUILD FAILURE
[2019-10-01T07:22:01.494Z] [INFO] ------------------------------------------------------------------------
[2019-10-01T07:22:01.494Z] [INFO] Total time: 05:22 min
[2019-10-01T07:22:01.494Z] [INFO] Finished at: 2019-10-01T00:22:01-07:00
[2019-10-01T07:22:01.762Z] [INFO] Final Memory: 39M/130M
[2019-10-01T07:22:01.762Z] [INFO] ------------------------------------------------------------------------
[2019-10-01T07:22:01.762Z] [ERROR] Failed to execute goal org.apache.maven.plugins:maven-checkstyle-plugin:3.0.0:check (checkstyle-check) on project surefire-junit-platform: You have 2 Checkstyle violations. -> [Help 1]
[2019-10-01T07:22:01.762Z] org.apache.maven.lifecycle.LifecycleExecutionException: Failed to execute goal org.apache.maven.plugins:maven-checkstyle-plugin:3.0.0:check (checkstyle-check) on project surefire-junit-platform: You have 2 Checkstyle violations.
[2019-10-01T07:22:01.762Z]     at org.apache.maven.lifecycle.internal.MojoExecutor.execute (MojoExecutor.java:213)
[2019-10-01T07:22:01.762Z]     at org.apache.maven.lifecycle.internal.MojoExecutor.execute (MojoExecutor.java:154)
[2019-10-01T07:22:01.762Z]     at org.apache.maven.lifecycle.internal.MojoExecutor.execute (MojoExecutor.java:146)
[2019-10-01T07:22:01.762Z]     at org.apache.maven.lifecycle.internal.LifecycleModuleBuilder.buildProject (LifecycleModuleBuilder.java:117)
[2019-10-01T07:22:01.762Z]     at org.apache.maven.lifecycle.internal.LifecycleModuleBuilder.buildProject (LifecycleModuleBuilder.java:81)
[2019-10-01T07:22:01.762Z]     at org.apache.maven.lifecycle.internal.builder.singlethreaded.SingleThreadedBuilder.build (SingleThreadedBuilder.java:51)
[2019-10-01T07:22:01.762Z]     at org.apache.maven.lifecycle.internal.LifecycleStarter.execute (LifecycleStarter.java:128)
[2019-10-01T07:22:01.762Z]     at org.apache.maven.DefaultMaven.doExecute (DefaultMaven.java:309)
[2019-10-01T07:22:01.762Z]     at org.apache.maven.DefaultMaven.doExecute (DefaultMaven.java:194)
[2019-10-01T07:22:01.762Z]     at org.apache.maven.DefaultMaven.execute (DefaultMaven.java:107)
[2019-10-01T07:22:01.762Z]     at org.apache.maven.cli.MavenCli.execute (MavenCli.java:955)
[2019-10-01T07:22:01.762Z]     at org.apache.maven.cli.MavenCli.doMain (MavenCli.java:290)
[2019-10-01T07:22:01.762Z]     at org.apache.maven.cli.MavenCli.main (MavenCli.java:194)
[2019-10-01T07:22:01.762Z]     at sun.reflect.NativeMethodAccessorImpl.invoke0 (Native Method)
[2019-10-01T07:22:01.762Z]     at sun.reflect.NativeMethodAccessorImpl.invoke (NativeMethodAccessorImpl.java:62)
[2019-10-01T07:22:01.762Z]     at sun.reflect.DelegatingMethodAccessorImpl.invoke (DelegatingMethodAccessorImpl.java:43)
[2019-10-01T07:22:01.762Z]     at java.lang.reflect.Method.invoke (Method.java:498)
[2019-10-01T07:22:01.762Z]     at org.codehaus.plexus.classworlds.launcher.Launcher.launchEnhanced (Launcher.java:289)
[2019-10-01T07:22:01.762Z]     at org.codehaus.plexus.classworlds.launcher.Launcher.launch (Launcher.java:229)
[2019-10-01T07:22:01.762Z]     at org.codehaus.plexus.classworlds.launcher.Launcher.mainWithExitCode (Launcher.java:415)
[2019-10-01T07:22:01.762Z]     at org.codehaus.plexus.classworlds.launcher.Launcher.main (Launcher.java:356)
[2019-10-01T07:22:01.762Z] Caused by: org.apache.maven.plugin.MojoFailureException: You have 2 Checkstyle violations.
[2019-10-01T07:22:01.762Z]     at org.apache.maven.plugins.checkstyle.CheckstyleViolationCheckMojo.execute (CheckstyleViolationCheckMojo.java:576)
[2019-10-01T07:22:01.762Z]     at org.apache.maven.plugin.DefaultBuildPluginManager.executeMojo (DefaultBuildPluginManager.java:134)
[2019-10-01T07:22:01.762Z]     at org.apache.maven.lifecycle.internal.MojoExecutor.execute (MojoExecutor.java:208)
[2019-10-01T07:22:01.762Z]     at org.apache.maven.lifecycle.internal.MojoExecutor.execute (MojoExecutor.java:154)
[2019-10-01T07:22:01.762Z]     at org.apache.maven.lifecycle.internal.MojoExecutor.execute (MojoExecutor.java:146)
[2019-10-01T07:22:01.762Z]     at org.apache.maven.lifecycle.internal.LifecycleModuleBuilder.buildProject (LifecycleModuleBuilder.java:117)
[2019-10-01T07:22:01.762Z]     at org.apache.maven.lifecycle.internal.LifecycleModuleBuilder.buildProject (LifecycleModuleBuilder.java:81)
[2019-10-01T07:22:01.762Z]     at org.apache.maven.lifecycle.internal.builder.singlethreaded.SingleThreadedBuilder.build (SingleThreadedBuilder.java:51)
[2019-10-01T07:22:01.762Z]     at org.apache.maven.lifecycle.internal.LifecycleStarter.execute (LifecycleStarter.java:128)
[2019-10-01T07:22:01.762Z]     at org.apache.maven.DefaultMaven.doExecute (DefaultMaven.java:309)
[2019-10-01T07:22:01.762Z]     at org.apache.maven.DefaultMaven.doExecute (DefaultMaven.java:194)
[2019-10-01T07:22:01.762Z]     at org.apache.maven.DefaultMaven.execute (DefaultMaven.java:107)
[2019-10-01T07:22:01.762Z]     at org.apache.maven.cli.MavenCli.execute (MavenCli.java:955)
[2019-10-01T07:22:01.762Z]     at org.apache.maven.cli.MavenCli.doMain (MavenCli.java:290)
[2019-10-01T07:22:01.762Z]     at org.apache.maven.cli.MavenCli.main (MavenCli.java:194)
[2019-10-01T07:22:01.762Z]     at sun.reflect.NativeMethodAccessorImpl.invoke0 (Native Method)
[2019-10-01T07:22:01.762Z]     at sun.reflect.NativeMethodAccessorImpl.invoke (NativeMethodAccessorImpl.java:62)
[2019-10-01T07:22:01.762Z]     at sun.reflect.DelegatingMethodAccessorImpl.invoke (DelegatingMethodAccessorImpl.java:43)
[2019-10-01T07:22:01.762Z]     at java.lang.reflect.Method.invoke (Method.java:498)
[2019-10-01T07:22:01.762Z]     at org.codehaus.plexus.classworlds.launcher.Launcher.launchEnhanced (Launcher.java:289)
[2019-10-01T07:22:01.762Z]     at org.codehaus.plexus.classworlds.launcher.Launcher.launch (Launcher.java:229)
[2019-10-01T07:22:01.762Z]     at org.codehaus.plexus.classworlds.launcher.Launcher.mainWithExitCode (Launcher.java:415)
[2019-10-01T07:22:01.762Z]     at org.codehaus.plexus.classworlds.launcher.Launcher.main (Launcher.java:356)
[2019-10-01T07:22:01.762Z] [ERROR]
[2019-10-01T07:22:01.763Z] [ERROR] Re-run Maven using the -X switch to enable full debug logging.
[2019-10-01T07:22:01.763Z] [ERROR]
[2019-10-01T07:22:01.763Z] [ERROR] For more information about the errors and possible solutions, please read the following articles:
[2019-10-01T07:22:01.763Z] [ERROR] [Help 1] http://cwiki.apache.org/confluence/display/MAVEN/MojoFailureException
[2019-10-01T07:22:01.763Z] [ERROR]
[2019-10-01T07:22:01.763Z] [ERROR] After correcting the problems, you can resume the build with the command
[2019-10-01T07:22:01.763Z] [ERROR]   mvn <goals> -rf :surefire-junit-platform
[Pipeline] }
[Pipeline] // withEnv
[Pipeline] }
[Pipeline] // stage
[Pipeline] stage
[Pipeline] { (reporting windows-jdk7-maven3.5.x)
[Pipeline] fileExists
[Pipeline] fileExists
[Pipeline] archiveArtifacts
[2019-10-01T07:22:02.015Z] Archiving artifacts
[2019-10-01T07:22:02.407Z] ‘*--windows-jdk7-maven3.5.x.zip’ doesn’t match anything
[2019-10-01T07:22:02.407Z] No artifacts found that match the file pattern "*--windows-jdk7-maven3.5.x.zip". Configuration error?
[Pipeline] }
[Pipeline] // stage
[Pipeline] stage
[Pipeline] { (cleanup windows-jdk7-maven3.5.x)
[Pipeline] cleanWs
[2019-10-01T07:22:02.519Z] [WS-CLEANUP] Deleting project workspace...
[2019-10-01T07:22:02.520Z] [WS-CLEANUP] Deferred wipeout is used...
[2019-10-01T07:22:02.552Z] [WS-CLEANUP] done
[Pipeline] }
[Pipeline] // stage
[Pipeline] }
[Pipeline] // timestamps
[Pipeline] }
[Pipeline] // node
[Pipeline] }
Failed in branch windows-jdk7-maven3.5.x
[Pipeline] // parallel
[Pipeline] echo
hudson.AbortException: hudson.AbortException: script returned exit code 1
[Pipeline] stage
[Pipeline] { (notifications)
[Pipeline] echo
Build result: FAILURE
[Pipeline] jiraIssueSelector
[Pipeline] echo
The authors of changes [rfscholte].
[Pipeline] echo
Sending email ...
[Pipeline] emailext
Reply | Threaded
Open this post in threaded view
|

Build failed in Jenkins: Maven TLP » maven-surefire » SUREFIRE-1603 #14

Apache Jenkins Server-2
See https://builds.apache.org/job/maven-box/job/maven-surefire/job/SUREFIRE-1603/14/

No changes.

All tests passed

Build log:
[...truncated 24271 lines...]
[2019-10-04T07:46:09.149Z] [INFO] Downloading from central: https://repo.maven.apache.org/maven2/org/junit/platform/junit-platform-engine/1.3.1/junit-platform-engine-1.3.1.jar
[2019-10-04T07:46:09.149Z] [INFO] Downloading from central: https://repo.maven.apache.org/maven2/org/apiguardian/apiguardian-api/1.0.0/apiguardian-api-1.0.0.jar
[2019-10-04T07:46:09.149Z] [INFO] Downloaded from central: https://repo.maven.apache.org/maven2/org/opentest4j/opentest4j/1.1.1/opentest4j-1.1.1.jar (7.1 kB at 132 kB/s)
[2019-10-04T07:46:09.149Z] [INFO] Downloading from central: https://repo.maven.apache.org/maven2/org/junit/jupiter/junit-jupiter-engine/5.3.1/junit-jupiter-engine-5.3.1.jar
[2019-10-04T07:46:09.149Z] [INFO] Downloaded from central: https://repo.maven.apache.org/maven2/org/apiguardian/apiguardian-api/1.0.0/apiguardian-api-1.0.0.jar (2.2 kB at 39 kB/s)
[2019-10-04T07:46:09.149Z] [INFO] Downloading from central: https://repo.maven.apache.org/maven2/org/junit/jupiter/junit-jupiter-api/5.3.1/junit-jupiter-api-5.3.1.jar
[2019-10-04T07:46:09.149Z] [INFO] Downloaded from central: https://repo.maven.apache.org/maven2/org/junit/platform/junit-platform-commons/1.3.1/junit-platform-commons-1.3.1.jar (78 kB at 1.3 MB/s)
[2019-10-04T07:46:09.149Z] [INFO] Downloading from central: https://repo.maven.apache.org/maven2/org/assertj/assertj-core/3.9.1/assertj-core-3.9.1.jar
[2019-10-04T07:46:09.149Z] [INFO] Downloaded from central: https://repo.maven.apache.org/maven2/org/junit/platform/junit-platform-launcher/1.3.1/junit-platform-launcher-1.3.1.jar (95 kB at 1.5 MB/s)
[2019-10-04T07:46:09.149Z] [INFO] Downloaded from central: https://repo.maven.apache.org/maven2/org/junit/platform/junit-platform-engine/1.3.1/junit-platform-engine-1.3.1.jar (135 kB at 1.9 MB/s)
[2019-10-04T07:46:09.149Z] [INFO] Downloaded from central: https://repo.maven.apache.org/maven2/org/junit/jupiter/junit-jupiter-engine/5.3.1/junit-jupiter-engine-5.3.1.jar (150 kB at 1.3 MB/s)
[2019-10-04T07:46:09.149Z] [INFO] Downloaded from central: https://repo.maven.apache.org/maven2/org/junit/jupiter/junit-jupiter-api/5.3.1/junit-jupiter-api-5.3.1.jar (115 kB at 982 kB/s)
[2019-10-04T07:46:09.149Z] [INFO] Downloaded from central: https://repo.maven.apache.org/maven2/org/assertj/assertj-core/3.9.1/assertj-core-3.9.1.jar (3.9 MB at 8.9 MB/s)
[2019-10-04T07:46:09.149Z] [INFO]
[2019-10-04T07:46:09.149Z] [INFO] --- maven-clean-plugin:3.1.0:clean (default-clean) @ surefire-junit-platform ---
[2019-10-04T07:46:09.149Z] [INFO]
[2019-10-04T07:46:09.149Z] [INFO] --- maven-enforcer-plugin:3.0.0-M2:enforce (enforce-maven-version) @ surefire-junit-platform ---
[2019-10-04T07:46:09.149Z] [INFO]
[2019-10-04T07:46:09.149Z] [INFO] --- maven-enforcer-plugin:3.0.0-M2:enforce (enforce-bytecode-version) @ surefire-junit-platform ---
[2019-10-04T07:46:09.149Z] [INFO]
[2019-10-04T07:46:09.149Z] [INFO] --- maven-enforcer-plugin:3.0.0-M2:enforce (ban-known-bad-maven-versions) @ surefire-junit-platform ---
[2019-10-04T07:46:09.149Z] [INFO]
[2019-10-04T07:46:09.149Z] [INFO] --- maven-enforcer-plugin:3.0.0-M2:enforce (enforce-java) @ surefire-junit-platform ---
[2019-10-04T07:46:09.149Z] [INFO]
[2019-10-04T07:46:09.149Z] [INFO] --- maven-enforcer-plugin:3.0.0-M2:enforce (enforce-maven) @ surefire-junit-platform ---
[2019-10-04T07:46:09.149Z] [INFO]
[2019-10-04T07:46:09.149Z] [INFO] --- apache-rat-plugin:0.12:check (rat-check) @ surefire-junit-platform ---
[2019-10-04T07:46:09.149Z] [INFO] Enabled default license matchers.
[2019-10-04T07:46:09.149Z] [INFO] Will parse SCM ignores for exclusions...
[2019-10-04T07:46:09.149Z] [INFO] Finished adding exclusions from SCM ignore files.
[2019-10-04T07:46:09.149Z] [INFO] 61 implicit excludes (use -debug for more details).
[2019-10-04T07:46:09.149Z] [INFO] Exclude: .repository/**
[2019-10-04T07:46:09.149Z] [INFO] Exclude: .maven/spy.log
[2019-10-04T07:46:09.149Z] [INFO] Exclude: dependency-reduced-pom.xml
[2019-10-04T07:46:09.149Z] [INFO] Exclude: .java-version
[2019-10-04T07:46:09.149Z] [INFO] Exclude: Jenkinsfile
[2019-10-04T07:46:09.149Z] [INFO] Exclude: README.md
[2019-10-04T07:46:09.149Z] [INFO] Exclude: .gitignore
[2019-10-04T07:46:09.149Z] [INFO] Exclude: .git/**/*
[2019-10-04T07:46:09.149Z] [INFO] Exclude: **/.idea
[2019-10-04T07:46:09.149Z] [INFO] Exclude: **/.svn/**/*
[2019-10-04T07:46:09.149Z] [INFO] Exclude: **/*.iml
[2019-10-04T07:46:09.149Z] [INFO] Exclude: **/*.ipr
[2019-10-04T07:46:09.149Z] [INFO] Exclude: **/*.iws
[2019-10-04T07:46:09.149Z] [INFO] Exclude: **/*.versionsBackup
[2019-10-04T07:46:09.149Z] [INFO] Exclude: **/dependency-reduced-pom.xml
[2019-10-04T07:46:09.149Z] [INFO] Exclude: .repository/**
[2019-10-04T07:46:09.149Z] [INFO] Exclude: src/test/resources/**/*
[2019-10-04T07:46:09.149Z] [INFO] Exclude: src/test/resources/**/*.css
[2019-10-04T07:46:09.149Z] [INFO] Exclude: **/*.jj
[2019-10-04T07:46:09.149Z] [INFO] Exclude: src/main/resources/META-INF/services/org.apache.maven.surefire.providerapi.SurefireProvider
[2019-10-04T07:46:09.149Z] [INFO] Exclude: DEPENDENCIES
[2019-10-04T07:46:09.149Z] [INFO] Exclude: .m2/**
[2019-10-04T07:46:09.149Z] [INFO] Exclude: .m2
[2019-10-04T07:46:09.149Z] [INFO] Exclude: .travis.yml
[2019-10-04T07:46:09.149Z] [INFO] 9 resources included (use -debug for more details)
[2019-10-04T07:46:09.149Z] [INFO] Rat check: Summary over all files. Unapproved: 0, unknown: 0, generated: 0, approved: 9 licenses.
[2019-10-04T07:46:09.149Z] [INFO]
[2019-10-04T07:46:09.149Z] [INFO] --- jacoco-maven-plugin:0.8.2:prepare-agent (jacoco-agent) @ surefire-junit-platform ---
[2019-10-04T07:46:09.149Z] [INFO] Skipping JaCoCo execution because property jacoco.skip is set.
[2019-10-04T07:46:09.149Z] [INFO] jacoco.agent set to empty
[2019-10-04T07:46:09.149Z] [INFO]
[2019-10-04T07:46:09.149Z] [INFO] --- maven-compiler-plugin:3.7.0:compile (compile-generated) @ surefire-junit-platform ---
[2019-10-04T07:46:09.149Z] [INFO] Nothing to compile - all classes are up to date
[2019-10-04T07:46:09.149Z] [INFO]
[2019-10-04T07:46:09.149Z] [INFO] --- maven-remote-resources-plugin:1.5:process (process-resource-bundles) @ surefire-junit-platform ---
[2019-10-04T07:46:09.860Z] [INFO]
[2019-10-04T07:46:09.860Z] [INFO] --- maven-resources-plugin:3.1.0:resources (default-resources) @ surefire-junit-platform ---
[2019-10-04T07:46:09.860Z] [INFO] Using 'UTF-8' encoding to copy filtered resources.
[2019-10-04T07:46:09.860Z] [INFO] Copying 1 resource
[2019-10-04T07:46:09.860Z] [INFO] Copying 3 resources
[2019-10-04T07:46:09.860Z] [INFO]
[2019-10-04T07:46:09.860Z] [INFO] --- maven-compiler-plugin:3.7.0:compile (default-compile) @ surefire-junit-platform ---
[2019-10-04T07:46:09.860Z] [INFO] Changes detected - recompiling the module!
[2019-10-04T07:46:09.860Z] [INFO] Compiling 4 source files to /home/jenkins/jenkins-slave/workspace/box_maven-surefire_SUREFIRE-1603/surefire-providers/surefire-junit-platform/target/classes
[2019-10-04T07:46:10.751Z] [INFO]
[2019-10-04T07:46:10.751Z] [INFO] --- animal-sniffer-maven-plugin:1.17:check (signature-check) @ surefire-junit-platform ---
[2019-10-04T07:46:10.751Z] [INFO] Checking unresolved references to org.codehaus.mojo.signature:java18:1.0
[2019-10-04T07:46:10.751Z] [INFO] Downloading from central: https://repo.maven.apache.org/maven2/org/codehaus/mojo/signature/java18/1.0/java18-1.0.signature
[2019-10-04T07:46:10.751Z] [INFO] Downloaded from central: https://repo.maven.apache.org/maven2/org/codehaus/mojo/signature/java18/1.0/java18-1.0.signature (2.0 MB at 9.1 MB/s)
[2019-10-04T07:46:11.472Z] [INFO]
[2019-10-04T07:46:11.472Z] [INFO] --- maven-resources-plugin:3.1.0:testResources (default-testResources) @ surefire-junit-platform ---
[2019-10-04T07:46:11.472Z] [INFO] Using 'UTF-8' encoding to copy filtered resources.
[2019-10-04T07:46:11.472Z] [INFO] skip non existing resourceDirectory /home/jenkins/jenkins-slave/workspace/box_maven-surefire_SUREFIRE-1603/surefire-providers/surefire-junit-platform/src/test/resources
[2019-10-04T07:46:11.472Z] [INFO] Copying 3 resources
[2019-10-04T07:46:11.472Z] [INFO]
[2019-10-04T07:46:11.472Z] [INFO] --- maven-compiler-plugin:3.7.0:testCompile (default-testCompile) @ surefire-junit-platform ---
[2019-10-04T07:46:11.472Z] [INFO] Changes detected - recompiling the module!
[2019-10-04T07:46:11.472Z] [INFO] Compiling 4 source files to /home/jenkins/jenkins-slave/workspace/box_maven-surefire_SUREFIRE-1603/surefire-providers/surefire-junit-platform/target/test-classes
[2019-10-04T07:46:13.767Z] [INFO]
[2019-10-04T07:46:13.767Z] [INFO] --- maven-surefire-plugin:2.12.4:test (default-test) @ surefire-junit-platform ---
[2019-10-04T07:46:13.767Z] [INFO] Surefire report directory: /home/jenkins/jenkins-slave/workspace/box_maven-surefire_SUREFIRE-1603/surefire-providers/surefire-junit-platform/target/surefire-reports
[2019-10-04T07:46:13.767Z] [INFO] Using configured provider org.apache.maven.surefire.shadefire.junit.JUnit3Provider
[2019-10-04T07:46:13.767Z]
[2019-10-04T07:46:13.767Z] -------------------------------------------------------
[2019-10-04T07:46:13.767Z]  T E S T S
[2019-10-04T07:46:13.767Z] -------------------------------------------------------
[2019-10-04T07:46:13.767Z] Running org.apache.maven.surefire.junitplatform.RunListenerAdapterTest
[2019-10-04T07:46:13.767Z] Tests run: 0, Failures: 0, Errors: 0, Skipped: 0, Time elapsed: 0.001 sec
[2019-10-04T07:46:14.698Z] Running org.apache.maven.surefire.junitplatform.TestMethodFilterTest
[2019-10-04T07:46:14.698Z] Tests run: 0, Failures: 0, Errors: 0, Skipped: 0, Time elapsed: 0 sec
[2019-10-04T07:46:14.698Z] Running org.apache.maven.surefire.junitplatform.TestPlanScannerFilterTest
[2019-10-04T07:46:14.698Z] Tests run: 0, Failures: 0, Errors: 0, Skipped: 0, Time elapsed: 0 sec
[2019-10-04T07:46:14.698Z] Running org.apache.maven.surefire.junitplatform.JUnitPlatformProviderTest
[2019-10-04T07:46:14.698Z] Tests run: 0, Failures: 0, Errors: 0, Skipped: 0, Time elapsed: 0 sec
[2019-10-04T07:46:14.698Z]
[2019-10-04T07:46:14.698Z] Results :
[2019-10-04T07:46:14.698Z]
[2019-10-04T07:46:14.698Z] Tests run: 0, Failures: 0, Errors: 0, Skipped: 0
[2019-10-04T07:46:14.698Z]
[2019-10-04T07:46:14.698Z] [INFO]
[2019-10-04T07:46:14.698Z] [INFO] --- maven-jar-plugin:3.1.0:jar (default-jar) @ surefire-junit-platform ---
[2019-10-04T07:46:14.698Z] [INFO] Building jar: /home/jenkins/jenkins-slave/workspace/box_maven-surefire_SUREFIRE-1603/surefire-providers/surefire-junit-platform/target/surefire-junit-platform-3.0.0-M2-SNAPSHOT.jar
[2019-10-04T07:46:14.698Z] [INFO]
[2019-10-04T07:46:14.698Z] [INFO] --- maven-site-plugin:3.7.1:attach-descriptor (attach-descriptor) @ surefire-junit-platform ---
[2019-10-04T07:46:14.698Z] [INFO] Skipping because packaging 'jar' is not pom.
[2019-10-04T07:46:14.698Z] [INFO]
[2019-10-04T07:46:14.698Z] [INFO] --- maven-checkstyle-plugin:3.0.0:check (checkstyle-check) @ surefire-junit-platform ---
[2019-10-04T07:46:14.698Z] [INFO] There are 2 errors reported by Checkstyle 6.18 with config/maven_checks.xml ruleset.
[2019-10-04T07:46:14.698Z] [ERROR] src/main/java/org/apache/maven/surefire/junitplatform/RunListenerAdapter.java:[206,13] (whitespace) ParenPad: '(' is not followed by whitespace.
[2019-10-04T07:46:14.698Z] [ERROR] src/main/java/org/apache/maven/surefire/junitplatform/RunListenerAdapter.java:[206,28] (whitespace) ParenPad: ')' is not preceded with whitespace.
[2019-10-04T07:46:14.698Z] [INFO] ------------------------------------------------------------------------
[2019-10-04T07:46:14.698Z] [INFO] Reactor Summary:
[2019-10-04T07:46:14.698Z] [INFO]
[2019-10-04T07:46:14.698Z] [INFO] Apache Maven Surefire 3.0.0-M2-SNAPSHOT ............ SUCCESS [ 38.723 s]
[2019-10-04T07:46:14.698Z] [INFO] SureFire Logger API ................................ SUCCESS [  6.740 s]
[2019-10-04T07:46:14.698Z] [INFO] SureFire API ....................................... SUCCESS [  9.836 s]
[2019-10-04T07:46:14.698Z] [INFO] SureFire Booter .................................... SUCCESS [ 10.624 s]
[2019-10-04T07:46:14.698Z] [INFO] Maven Surefire Test-Grouping Support ............... SUCCESS [  5.775 s]
[2019-10-04T07:46:14.698Z] [INFO] SureFire Providers ................................. SUCCESS [  0.746 s]
[2019-10-04T07:46:14.698Z] [INFO] Shared JUnit3 Provider Code ........................ SUCCESS [  2.459 s]
[2019-10-04T07:46:14.698Z] [INFO] Shared Java 5 Provider Base ........................ SUCCESS [  3.362 s]
[2019-10-04T07:46:14.698Z] [INFO] Shared JUnit4 Provider Code ........................ SUCCESS [  3.249 s]
[2019-10-04T07:46:14.698Z] [INFO] Shared JUnit48 Provider Code ....................... SUCCESS [  3.722 s]
[2019-10-04T07:46:14.698Z] [INFO] SureFire JUnit Runner .............................. SUCCESS [  2.683 s]
[2019-10-04T07:46:14.698Z] [INFO] SureFire JUnit4 Runner ............................. SUCCESS [  2.922 s]
[2019-10-04T07:46:14.698Z] [INFO] Maven Surefire Common .............................. SUCCESS [ 21.188 s]
[2019-10-04T07:46:14.698Z] [INFO] SureFire JUnitCore Runner .......................... SUCCESS [02:09 min]
[2019-10-04T07:46:14.698Z] [INFO] SureFire JUnit Platform Runner ..................... FAILURE [  6.353 s]
[2019-10-04T07:46:14.698Z] [INFO] SureFire TestNG Utils .............................. SKIPPED
[2019-10-04T07:46:14.699Z] [INFO] SureFire TestNG Runner ............................. SKIPPED
[2019-10-04T07:46:14.699Z] [INFO] ShadeFire JUnit3 Provider .......................... SKIPPED
[2019-10-04T07:46:14.699Z] [INFO] Surefire Report Parser ............................. SKIPPED
[2019-10-04T07:46:14.699Z] [INFO] Maven Surefire Plugin .............................. SKIPPED
[2019-10-04T07:46:14.699Z] [INFO] Maven Failsafe Plugin .............................. SKIPPED
[2019-10-04T07:46:14.699Z] [INFO] Maven Surefire Report Plugin ....................... SKIPPED
[2019-10-04T07:46:14.699Z] [INFO] Maven Surefire Integration Tests 3.0.0-M2-SNAPSHOT . SKIPPED
[2019-10-04T07:46:14.699Z] [INFO] ------------------------------------------------------------------------
[2019-10-04T07:46:14.699Z] [INFO] BUILD FAILURE
[2019-10-04T07:46:14.699Z] [INFO] ------------------------------------------------------------------------
[2019-10-04T07:46:14.699Z] [INFO] Total time: 04:10 min
[2019-10-04T07:46:14.699Z] [INFO] Finished at: 2019-10-04T07:46:14Z
[2019-10-04T07:46:14.699Z] [INFO] ------------------------------------------------------------------------
[2019-10-04T07:46:14.699Z] [ERROR] Failed to execute goal org.apache.maven.plugins:maven-checkstyle-plugin:3.0.0:check (checkstyle-check) on project surefire-junit-platform: You have 2 Checkstyle violations. -> [Help 1]
[2019-10-04T07:46:14.699Z] org.apache.maven.lifecycle.LifecycleExecutionException: Failed to execute goal org.apache.maven.plugins:maven-checkstyle-plugin:3.0.0:check (checkstyle-check) on project surefire-junit-platform: You have 2 Checkstyle violations.
[2019-10-04T07:46:14.699Z]     at org.apache.maven.lifecycle.internal.MojoExecutor.execute (MojoExecutor.java:213)
[2019-10-04T07:46:14.699Z]     at org.apache.maven.lifecycle.internal.MojoExecutor.execute (MojoExecutor.java:154)
[2019-10-04T07:46:14.699Z]     at org.apache.maven.lifecycle.internal.MojoExecutor.execute (MojoExecutor.java:146)
[2019-10-04T07:46:14.699Z]     at org.apache.maven.lifecycle.internal.LifecycleModuleBuilder.buildProject (LifecycleModuleBuilder.java:117)
[2019-10-04T07:46:14.699Z]     at org.apache.maven.lifecycle.internal.LifecycleModuleBuilder.buildProject (LifecycleModuleBuilder.java:81)
[2019-10-04T07:46:14.699Z]     at org.apache.maven.lifecycle.internal.builder.singlethreaded.SingleThreadedBuilder.build (SingleThreadedBuilder.java:56)
[2019-10-04T07:46:14.699Z]     at org.apache.maven.lifecycle.internal.LifecycleStarter.execute (LifecycleStarter.java:128)
[2019-10-04T07:46:14.699Z]     at org.apache.maven.DefaultMaven.doExecute (DefaultMaven.java:305)
[2019-10-04T07:46:14.699Z]     at org.apache.maven.DefaultMaven.doExecute (DefaultMaven.java:192)
[2019-10-04T07:46:14.699Z]     at org.apache.maven.DefaultMaven.execute (DefaultMaven.java:105)
[2019-10-04T07:46:14.699Z]     at org.apache.maven.cli.MavenCli.execute (MavenCli.java:954)
[2019-10-04T07:46:14.699Z]     at org.apache.maven.cli.MavenCli.doMain (MavenCli.java:288)
[2019-10-04T07:46:14.699Z]     at org.apache.maven.cli.MavenCli.main (MavenCli.java:192)
[2019-10-04T07:46:14.699Z]     at sun.reflect.NativeMethodAccessorImpl.invoke0 (Native Method)
[2019-10-04T07:46:14.699Z]     at sun.reflect.NativeMethodAccessorImpl.invoke (NativeMethodAccessorImpl.java:62)
[2019-10-04T07:46:14.699Z]     at sun.reflect.DelegatingMethodAccessorImpl.invoke (DelegatingMethodAccessorImpl.java:43)
[2019-10-04T07:46:14.699Z]     at java.lang.reflect.Method.invoke (Method.java:498)
[2019-10-04T07:46:14.699Z]     at org.codehaus.plexus.classworlds.launcher.Launcher.launchEnhanced (Launcher.java:289)
[2019-10-04T07:46:14.699Z]     at org.codehaus.plexus.classworlds.launcher.Launcher.launch (Launcher.java:229)
[2019-10-04T07:46:14.699Z]     at org.codehaus.plexus.classworlds.launcher.Launcher.mainWithExitCode (Launcher.java:415)
[2019-10-04T07:46:14.699Z]     at org.codehaus.plexus.classworlds.launcher.Launcher.main (Launcher.java:356)
[2019-10-04T07:46:14.699Z] Caused by: org.apache.maven.plugin.MojoFailureException: You have 2 Checkstyle violations.
[2019-10-04T07:46:14.699Z]     at org.apache.maven.plugins.checkstyle.CheckstyleViolationCheckMojo.execute (CheckstyleViolationCheckMojo.java:576)
[2019-10-04T07:46:14.699Z]     at org.apache.maven.plugin.DefaultBuildPluginManager.executeMojo (DefaultBuildPluginManager.java:137)
[2019-10-04T07:46:14.699Z]     at org.apache.maven.lifecycle.internal.MojoExecutor.execute (MojoExecutor.java:208)
[2019-10-04T07:46:14.699Z]     at org.apache.maven.lifecycle.internal.MojoExecutor.execute (MojoExecutor.java:154)
[2019-10-04T07:46:14.699Z]     at org.apache.maven.lifecycle.internal.MojoExecutor.execute (MojoExecutor.java:146)
[2019-10-04T07:46:14.699Z]     at org.apache.maven.lifecycle.internal.LifecycleModuleBuilder.buildProject (LifecycleModuleBuilder.java:117)
[2019-10-04T07:46:14.699Z]     at org.apache.maven.lifecycle.internal.LifecycleModuleBuilder.buildProject (LifecycleModuleBuilder.java:81)
[2019-10-04T07:46:14.699Z]     at org.apache.maven.lifecycle.internal.builder.singlethreaded.SingleThreadedBuilder.build (SingleThreadedBuilder.java:56)
[2019-10-04T07:46:14.699Z]     at org.apache.maven.lifecycle.internal.LifecycleStarter.execute (LifecycleStarter.java:128)
[2019-10-04T07:46:14.699Z]     at org.apache.maven.DefaultMaven.doExecute (DefaultMaven.java:305)
[2019-10-04T07:46:14.699Z]     at org.apache.maven.DefaultMaven.doExecute (DefaultMaven.java:192)
[2019-10-04T07:46:14.699Z]     at org.apache.maven.DefaultMaven.execute (DefaultMaven.java:105)
[2019-10-04T07:46:14.699Z]     at org.apache.maven.cli.MavenCli.execute (MavenCli.java:954)
[2019-10-04T07:46:14.699Z]     at org.apache.maven.cli.MavenCli.doMain (MavenCli.java:288)
[2019-10-04T07:46:14.699Z]     at org.apache.maven.cli.MavenCli.main (MavenCli.java:192)
[2019-10-04T07:46:14.699Z]     at sun.reflect.NativeMethodAccessorImpl.invoke0 (Native Method)
[2019-10-04T07:46:14.699Z]     at sun.reflect.NativeMethodAccessorImpl.invoke (NativeMethodAccessorImpl.java:62)
[2019-10-04T07:46:14.699Z]     at sun.reflect.DelegatingMethodAccessorImpl.invoke (DelegatingMethodAccessorImpl.java:43)
[2019-10-04T07:46:14.699Z]     at java.lang.reflect.Method.invoke (Method.java:498)
[2019-10-04T07:46:14.699Z]     at org.codehaus.plexus.classworlds.launcher.Launcher.launchEnhanced (Launcher.java:289)
[2019-10-04T07:46:14.699Z]     at org.codehaus.plexus.classworlds.launcher.Launcher.launch (Launcher.java:229)
[2019-10-04T07:46:14.699Z]     at org.codehaus.plexus.classworlds.launcher.Launcher.mainWithExitCode (Launcher.java:415)
[2019-10-04T07:46:14.699Z]     at org.codehaus.plexus.classworlds.launcher.Launcher.main (Launcher.java:356)
[2019-10-04T07:46:14.699Z] [ERROR]
[2019-10-04T07:46:14.699Z] [ERROR] Re-run Maven using the -X switch to enable full debug logging.
[2019-10-04T07:46:14.699Z] [ERROR]
[2019-10-04T07:46:14.699Z] [ERROR] For more information about the errors and possible solutions, please read the following articles:
[2019-10-04T07:46:14.699Z] [ERROR] [Help 1] http://cwiki.apache.org/confluence/display/MAVEN/MojoFailureException
[2019-10-04T07:46:14.699Z] [ERROR]
[2019-10-04T07:46:14.699Z] [ERROR] After correcting the problems, you can resume the build with the command
[2019-10-04T07:46:14.699Z] [ERROR]   mvn <goals> -rf :surefire-junit-platform
[Pipeline] }
[Pipeline] // withEnv
[Pipeline] }
[Pipeline] // stage
[Pipeline] stage
[Pipeline] { (reporting linux-jdk7-maven3.5.x)
[Pipeline] fileExists
[Pipeline] fileExists
[Pipeline] archiveArtifacts
[2019-10-04T07:46:15.633Z] Archiving artifacts
[2019-10-04T07:46:16.131Z] ‘*--linux-jdk7-maven3.5.x.zip’ doesn’t match anything
[2019-10-04T07:46:16.132Z] No artifacts found that match the file pattern "*--linux-jdk7-maven3.5.x.zip". Configuration error?
[Pipeline] }
[Pipeline] // stage
[Pipeline] stage
[Pipeline] { (cleanup linux-jdk7-maven3.5.x)
[Pipeline] cleanWs
[2019-10-04T07:46:16.526Z] [WS-CLEANUP] Deleting project workspace...
[2019-10-04T07:46:16.527Z] [WS-CLEANUP] Deferred wipeout is used...
[2019-10-04T07:46:16.836Z] [WS-CLEANUP] done
[Pipeline] }
[Pipeline] // stage
[Pipeline] }
[Pipeline] // timestamps
[Pipeline] }
[Pipeline] // node
[Pipeline] }
Failed in branch linux-jdk7-maven3.5.x
[Pipeline] // parallel
[Pipeline] echo
hudson.AbortException: hudson.AbortException: script returned exit code 1
[Pipeline] stage
[Pipeline] { (notifications)
[Pipeline] echo
Build result: FAILURE
[Pipeline] jiraIssueSelector
[Pipeline] echo
The authors of changes [].
[Pipeline] echo
Sending email ...
[Pipeline] emailext
Reply | Threaded
Open this post in threaded view
|

Build failed in Jenkins: Maven TLP » maven-surefire » SUREFIRE-1603 #15

Apache Jenkins Server-2
See https://builds.apache.org/job/maven-box/job/maven-surefire/job/SUREFIRE-1603/15/

Changes:

* [INFRA-19273] Maven 3.6.0 dropped, update to 3.6.2

All tests passed

Build log:
[...truncated 24271 lines...]
[2019-10-26T16:46:36.805Z] [INFO] Downloading from central: https://repo.maven.apache.org/maven2/org/opentest4j/opentest4j/1.1.1/opentest4j-1.1.1.jar
[2019-10-26T16:46:36.806Z] [INFO] Downloaded from central: https://repo.maven.apache.org/maven2/org/junit/platform/junit-platform-commons/1.3.1/junit-platform-commons-1.3.1.jar (78 kB at 1.5 MB/s)
[2019-10-26T16:46:36.806Z] [INFO] Downloading from central: https://repo.maven.apache.org/maven2/org/junit/jupiter/junit-jupiter-engine/5.3.1/junit-jupiter-engine-5.3.1.jar
[2019-10-26T16:46:36.806Z] [INFO] Downloaded from central: https://repo.maven.apache.org/maven2/org/junit/platform/junit-platform-launcher/1.3.1/junit-platform-launcher-1.3.1.jar (95 kB at 1.7 MB/s)
[2019-10-26T16:46:36.806Z] [INFO] Downloading from central: https://repo.maven.apache.org/maven2/org/junit/jupiter/junit-jupiter-api/5.3.1/junit-jupiter-api-5.3.1.jar
[2019-10-26T16:46:36.806Z] [INFO] Downloaded from central: https://repo.maven.apache.org/maven2/org/junit/platform/junit-platform-engine/1.3.1/junit-platform-engine-1.3.1.jar (135 kB at 2.3 MB/s)
[2019-10-26T16:46:36.806Z] [INFO] Downloading from central: https://repo.maven.apache.org/maven2/org/assertj/assertj-core/3.9.1/assertj-core-3.9.1.jar
[2019-10-26T16:46:36.806Z] [INFO] Downloaded from central: https://repo.maven.apache.org/maven2/org/apiguardian/apiguardian-api/1.0.0/apiguardian-api-1.0.0.jar (2.2 kB at 25 kB/s)
[2019-10-26T16:46:36.806Z] [INFO] Downloaded from central: https://repo.maven.apache.org/maven2/org/junit/jupiter/junit-jupiter-api/5.3.1/junit-jupiter-api-5.3.1.jar (115 kB at 942 kB/s)
[2019-10-26T16:46:36.806Z] [INFO] Downloaded from central: https://repo.maven.apache.org/maven2/org/junit/jupiter/junit-jupiter-engine/5.3.1/junit-jupiter-engine-5.3.1.jar (150 kB at 1.2 MB/s)
[2019-10-26T16:46:36.806Z] [INFO] Downloaded from central: https://repo.maven.apache.org/maven2/org/opentest4j/opentest4j/1.1.1/opentest4j-1.1.1.jar (7.1 kB at 50 kB/s)
[2019-10-26T16:46:36.806Z] [INFO] Downloaded from central: https://repo.maven.apache.org/maven2/org/assertj/assertj-core/3.9.1/assertj-core-3.9.1.jar (3.9 MB at 7.6 MB/s)
[2019-10-26T16:46:36.806Z] [INFO]
[2019-10-26T16:46:36.806Z] [INFO] --- maven-clean-plugin:3.1.0:clean (default-clean) @ surefire-junit-platform ---
[2019-10-26T16:46:36.806Z] [INFO]
[2019-10-26T16:46:36.806Z] [INFO] --- maven-enforcer-plugin:3.0.0-M2:enforce (enforce-maven-version) @ surefire-junit-platform ---
[2019-10-26T16:46:36.806Z] [INFO]
[2019-10-26T16:46:36.806Z] [INFO] --- maven-enforcer-plugin:3.0.0-M2:enforce (enforce-bytecode-version) @ surefire-junit-platform ---
[2019-10-26T16:46:36.806Z] [INFO]
[2019-10-26T16:46:36.806Z] [INFO] --- maven-enforcer-plugin:3.0.0-M2:enforce (ban-known-bad-maven-versions) @ surefire-junit-platform ---
[2019-10-26T16:46:36.806Z] [INFO]
[2019-10-26T16:46:36.806Z] [INFO] --- maven-enforcer-plugin:3.0.0-M2:enforce (enforce-java) @ surefire-junit-platform ---
[2019-10-26T16:46:36.806Z] [INFO]
[2019-10-26T16:46:36.806Z] [INFO] --- maven-enforcer-plugin:3.0.0-M2:enforce (enforce-maven) @ surefire-junit-platform ---
[2019-10-26T16:46:36.806Z] [INFO]
[2019-10-26T16:46:36.806Z] [INFO] --- apache-rat-plugin:0.12:check (rat-check) @ surefire-junit-platform ---
[2019-10-26T16:46:36.806Z] [INFO] Enabled default license matchers.
[2019-10-26T16:46:36.806Z] [INFO] Will parse SCM ignores for exclusions...
[2019-10-26T16:46:36.806Z] [INFO] Finished adding exclusions from SCM ignore files.
[2019-10-26T16:46:36.806Z] [INFO] 61 implicit excludes (use -debug for more details).
[2019-10-26T16:46:36.806Z] [INFO] Exclude: .repository/**
[2019-10-26T16:46:36.806Z] [INFO] Exclude: .maven/spy.log
[2019-10-26T16:46:36.806Z] [INFO] Exclude: dependency-reduced-pom.xml
[2019-10-26T16:46:36.806Z] [INFO] Exclude: .java-version
[2019-10-26T16:46:36.806Z] [INFO] Exclude: Jenkinsfile
[2019-10-26T16:46:36.806Z] [INFO] Exclude: README.md
[2019-10-26T16:46:36.806Z] [INFO] Exclude: .gitignore
[2019-10-26T16:46:36.806Z] [INFO] Exclude: .git/**/*
[2019-10-26T16:46:36.806Z] [INFO] Exclude: **/.idea
[2019-10-26T16:46:36.806Z] [INFO] Exclude: **/.svn/**/*
[2019-10-26T16:46:36.806Z] [INFO] Exclude: **/*.iml
[2019-10-26T16:46:36.806Z] [INFO] Exclude: **/*.ipr
[2019-10-26T16:46:36.806Z] [INFO] Exclude: **/*.iws
[2019-10-26T16:46:36.806Z] [INFO] Exclude: **/*.versionsBackup
[2019-10-26T16:46:36.806Z] [INFO] Exclude: **/dependency-reduced-pom.xml
[2019-10-26T16:46:36.806Z] [INFO] Exclude: .repository/**
[2019-10-26T16:46:36.806Z] [INFO] Exclude: src/test/resources/**/*
[2019-10-26T16:46:36.806Z] [INFO] Exclude: src/test/resources/**/*.css
[2019-10-26T16:46:36.806Z] [INFO] Exclude: **/*.jj
[2019-10-26T16:46:36.806Z] [INFO] Exclude: src/main/resources/META-INF/services/org.apache.maven.surefire.providerapi.SurefireProvider
[2019-10-26T16:46:36.806Z] [INFO] Exclude: DEPENDENCIES
[2019-10-26T16:46:36.806Z] [INFO] Exclude: .m2/**
[2019-10-26T16:46:36.806Z] [INFO] Exclude: .m2
[2019-10-26T16:46:36.806Z] [INFO] Exclude: .travis.yml
[2019-10-26T16:46:36.806Z] [INFO] 9 resources included (use -debug for more details)
[2019-10-26T16:46:36.806Z] [INFO] Rat check: Summary over all files. Unapproved: 0, unknown: 0, generated: 0, approved: 9 licenses.
[2019-10-26T16:46:36.806Z] [INFO]
[2019-10-26T16:46:36.806Z] [INFO] --- jacoco-maven-plugin:0.8.2:prepare-agent (jacoco-agent) @ surefire-junit-platform ---
[2019-10-26T16:46:36.806Z] [INFO] Skipping JaCoCo execution because property jacoco.skip is set.
[2019-10-26T16:46:36.806Z] [INFO] jacoco.agent set to empty
[2019-10-26T16:46:36.806Z] [INFO]
[2019-10-26T16:46:36.806Z] [INFO] --- maven-compiler-plugin:3.7.0:compile (compile-generated) @ surefire-junit-platform ---
[2019-10-26T16:46:36.806Z] [INFO] Nothing to compile - all classes are up to date
[2019-10-26T16:46:36.806Z] [INFO]
[2019-10-26T16:46:36.806Z] [INFO] --- maven-remote-resources-plugin:1.5:process (process-resource-bundles) @ surefire-junit-platform ---
[2019-10-26T16:46:36.806Z] [INFO]
[2019-10-26T16:46:36.806Z] [INFO] --- maven-resources-plugin:3.1.0:resources (default-resources) @ surefire-junit-platform ---
[2019-10-26T16:46:36.806Z] [INFO] Using 'UTF-8' encoding to copy filtered resources.
[2019-10-26T16:46:36.806Z] [INFO] Copying 1 resource
[2019-10-26T16:46:36.806Z] [INFO] Copying 3 resources
[2019-10-26T16:46:36.806Z] [INFO]
[2019-10-26T16:46:36.806Z] [INFO] --- maven-compiler-plugin:3.7.0:compile (default-compile) @ surefire-junit-platform ---
[2019-10-26T16:46:36.807Z] [INFO] Changes detected - recompiling the module!
[2019-10-26T16:46:36.807Z] [INFO] Compiling 4 source files to F:\jenkins\jenkins-slave\workspace\box_maven-surefire_SUREFIRE-1603\surefire-providers\surefire-junit-platform\target\classes
[2019-10-26T16:46:36.807Z] [INFO]
[2019-10-26T16:46:36.807Z] [INFO] --- animal-sniffer-maven-plugin:1.17:check (signature-check) @ surefire-junit-platform ---
[2019-10-26T16:46:36.807Z] [INFO] Checking unresolved references to org.codehaus.mojo.signature:java18:1.0
[2019-10-26T16:46:36.807Z] [INFO] Downloading from central: https://repo.maven.apache.org/maven2/org/codehaus/mojo/signature/java18/1.0/java18-1.0.signature
[2019-10-26T16:46:36.807Z] [INFO] Downloaded from central: https://repo.maven.apache.org/maven2/org/codehaus/mojo/signature/java18/1.0/java18-1.0.signature (2.0 MB at 9.1 MB/s)
[2019-10-26T16:46:36.807Z] [INFO]
[2019-10-26T16:46:36.807Z] [INFO] --- maven-resources-plugin:3.1.0:testResources (default-testResources) @ surefire-junit-platform ---
[2019-10-26T16:46:36.807Z] [INFO] Using 'UTF-8' encoding to copy filtered resources.
[2019-10-26T16:46:36.807Z] [INFO] skip non existing resourceDirectory F:\jenkins\jenkins-slave\workspace\box_maven-surefire_SUREFIRE-1603\surefire-providers\surefire-junit-platform\src\test\resources
[2019-10-26T16:46:36.807Z] [INFO] Copying 3 resources
[2019-10-26T16:46:36.807Z] [INFO]
[2019-10-26T16:46:36.807Z] [INFO] --- maven-compiler-plugin:3.7.0:testCompile (default-testCompile) @ surefire-junit-platform ---
[2019-10-26T16:46:36.807Z] [INFO] Changes detected - recompiling the module!
[2019-10-26T16:46:36.807Z] [INFO] Compiling 4 source files to F:\jenkins\jenkins-slave\workspace\box_maven-surefire_SUREFIRE-1603\surefire-providers\surefire-junit-platform\target\test-classes
[2019-10-26T16:46:36.807Z] [INFO]
[2019-10-26T16:46:36.807Z] [INFO] --- maven-surefire-plugin:2.12.4:test (default-test) @ surefire-junit-platform ---
[2019-10-26T16:46:36.807Z] [INFO] Surefire report directory: F:\jenkins\jenkins-slave\workspace\box_maven-surefire_SUREFIRE-1603\surefire-providers\surefire-junit-platform\target\surefire-reports
[2019-10-26T16:46:36.807Z] [INFO] Using configured provider org.apache.maven.surefire.shadefire.junit.JUnit3Provider
[2019-10-26T16:46:36.807Z]
[2019-10-26T16:46:36.807Z] -------------------------------------------------------
[2019-10-26T16:46:36.807Z]  T E S T S
[2019-10-26T16:46:36.807Z] -------------------------------------------------------
[2019-10-26T16:46:36.807Z] Running org.apache.maven.surefire.junitplatform.JUnitPlatformProviderTest
[2019-10-26T16:46:36.807Z] Tests run: 0, Failures: 0, Errors: 0, Skipped: 0, Time elapsed: 0.001 sec
[2019-10-26T16:46:36.807Z] Running org.apache.maven.surefire.junitplatform.RunListenerAdapterTest
[2019-10-26T16:46:36.807Z] Tests run: 0, Failures: 0, Errors: 0, Skipped: 0, Time elapsed: 0 sec
[2019-10-26T16:46:36.807Z] Running org.apache.maven.surefire.junitplatform.TestMethodFilterTest
[2019-10-26T16:46:36.807Z] Tests run: 0, Failures: 0, Errors: 0, Skipped: 0, Time elapsed: 0 sec
[2019-10-26T16:46:36.807Z] Running org.apache.maven.surefire.junitplatform.TestPlanScannerFilterTest
[2019-10-26T16:46:36.807Z] Tests run: 0, Failures: 0, Errors: 0, Skipped: 0, Time elapsed: 0 sec
[2019-10-26T16:46:36.807Z]
[2019-10-26T16:46:36.807Z] Results :
[2019-10-26T16:46:36.807Z]
[2019-10-26T16:46:36.807Z] Tests run: 0, Failures: 0, Errors: 0, Skipped: 0
[2019-10-26T16:46:36.807Z]
[2019-10-26T16:46:36.807Z] [INFO]
[2019-10-26T16:46:36.807Z] [INFO] --- maven-jar-plugin:3.1.0:jar (default-jar) @ surefire-junit-platform ---
[2019-10-26T16:46:36.807Z] [INFO] Building jar: F:\jenkins\jenkins-slave\workspace\box_maven-surefire_SUREFIRE-1603\surefire-providers\surefire-junit-platform\target\surefire-junit-platform-3.0.0-M2-SNAPSHOT.jar
[2019-10-26T16:46:36.807Z] [INFO]
[2019-10-26T16:46:36.807Z] [INFO] --- maven-site-plugin:3.7.1:attach-descriptor (attach-descriptor) @ surefire-junit-platform ---
[2019-10-26T16:46:36.807Z] [INFO] Skipping because packaging 'jar' is not pom.
[2019-10-26T16:46:36.807Z] [INFO]
[2019-10-26T16:46:36.807Z] [INFO] --- maven-checkstyle-plugin:3.0.0:check (checkstyle-check) @ surefire-junit-platform ---
[2019-10-26T16:46:36.807Z] [INFO] There are 2 errors reported by Checkstyle 6.18 with config/maven_checks.xml ruleset.
[2019-10-26T16:46:36.807Z] [ERROR] src\main\java\org\apache\maven\surefire\junitplatform\RunListenerAdapter.java:[206,13] (whitespace) ParenPad: '(' is not followed by whitespace.
[2019-10-26T16:46:36.807Z] [ERROR] src\main\java\org\apache\maven\surefire\junitplatform\RunListenerAdapter.java:[206,28] (whitespace) ParenPad: ')' is not preceded with whitespace.
[2019-10-26T16:46:36.807Z] [INFO] ------------------------------------------------------------------------
[2019-10-26T16:46:36.807Z] [INFO] Reactor Summary:
[2019-10-26T16:46:36.807Z] [INFO]
[2019-10-26T16:46:36.807Z] [INFO] Apache Maven Surefire .............................. SUCCESS [ 46.745 s]
[2019-10-26T16:46:36.807Z] [INFO] SureFire Logger API ................................ SUCCESS [  9.295 s]
[2019-10-26T16:46:36.807Z] [INFO] SureFire API ....................................... SUCCESS [ 15.968 s]
[2019-10-26T16:46:36.807Z] [INFO] SureFire Booter .................................... SUCCESS [ 15.334 s]
[2019-10-26T16:46:36.807Z] [INFO] Maven Surefire Test-Grouping Support ............... SUCCESS [  9.732 s]
[2019-10-26T16:46:36.807Z] [INFO] SureFire Providers ................................. SUCCESS [  1.167 s]
[2019-10-26T16:46:36.807Z] [INFO] Shared JUnit3 Provider Code ........................ SUCCESS [  3.912 s]
[2019-10-26T16:46:36.807Z] [INFO] Shared Java 5 Provider Base ........................ SUCCESS [  5.406 s]
[2019-10-26T16:46:36.807Z] [INFO] Shared JUnit4 Provider Code ........................ SUCCESS [  5.379 s]
[2019-10-26T16:46:36.807Z] [INFO] Shared JUnit48 Provider Code ....................... SUCCESS [  6.342 s]
[2019-10-26T16:46:36.807Z] [INFO] SureFire JUnit Runner .............................. SUCCESS [  4.523 s]
[2019-10-26T16:46:36.807Z] [INFO] SureFire JUnit4 Runner ............................. SUCCESS [  4.644 s]
[2019-10-26T16:46:36.807Z] [INFO] Maven Surefire Common .............................. SUCCESS [ 28.782 s]
[2019-10-26T16:46:36.808Z] [INFO] SureFire JUnitCore Runner .......................... SUCCESS [02:23 min]
[2019-10-26T16:46:36.808Z] [INFO] SureFire JUnit Platform Runner ..................... FAILURE [  8.835 s]
[2019-10-26T16:46:36.808Z] [INFO] SureFire TestNG Utils .............................. SKIPPED
[2019-10-26T16:46:36.808Z] [INFO] SureFire TestNG Runner ............................. SKIPPED
[2019-10-26T16:46:36.808Z] [INFO] ShadeFire JUnit3 Provider .......................... SKIPPED
[2019-10-26T16:46:36.808Z] [INFO] Surefire Report Parser ............................. SKIPPED
[2019-10-26T16:46:36.808Z] [INFO] Maven Surefire Plugin .............................. SKIPPED
[2019-10-26T16:46:36.808Z] [INFO] Maven Failsafe Plugin .............................. SKIPPED
[2019-10-26T16:46:36.808Z] [INFO] Maven Surefire Report Plugin ....................... SKIPPED
[2019-10-26T16:46:36.808Z] [INFO] Maven Surefire Integration Tests ................... SKIPPED
[2019-10-26T16:46:36.808Z] [INFO] ------------------------------------------------------------------------
[2019-10-26T16:46:36.808Z] [INFO] BUILD FAILURE
[2019-10-26T16:46:36.808Z] [INFO] ------------------------------------------------------------------------
[2019-10-26T16:46:36.808Z] [INFO] Total time: 05:12 min
[2019-10-26T16:46:36.808Z] [INFO] Finished at: 2019-10-26T09:46:34-07:00
[2019-10-26T16:46:36.808Z] [INFO] Final Memory: 39M/130M
[2019-10-26T16:46:36.808Z] [INFO] ------------------------------------------------------------------------
[2019-10-26T16:46:36.808Z] [ERROR] Failed to execute goal org.apache.maven.plugins:maven-checkstyle-plugin:3.0.0:check (checkstyle-check) on project surefire-junit-platform: You have 2 Checkstyle violations. -> [Help 1]
[2019-10-26T16:46:36.808Z] org.apache.maven.lifecycle.LifecycleExecutionException: Failed to execute goal org.apache.maven.plugins:maven-checkstyle-plugin:3.0.0:check (checkstyle-check) on project surefire-junit-platform: You have 2 Checkstyle violations.
[2019-10-26T16:46:36.808Z]     at org.apache.maven.lifecycle.internal.MojoExecutor.execute (MojoExecutor.java:213)
[2019-10-26T16:46:36.808Z]     at org.apache.maven.lifecycle.internal.MojoExecutor.execute (MojoExecutor.java:154)
[2019-10-26T16:46:36.808Z]     at org.apache.maven.lifecycle.internal.MojoExecutor.execute (MojoExecutor.java:146)
[2019-10-26T16:46:36.808Z]     at org.apache.maven.lifecycle.internal.LifecycleModuleBuilder.buildProject (LifecycleModuleBuilder.java:117)
[2019-10-26T16:46:36.808Z]     at org.apache.maven.lifecycle.internal.LifecycleModuleBuilder.buildProject (LifecycleModuleBuilder.java:81)
[2019-10-26T16:46:36.808Z]     at org.apache.maven.lifecycle.internal.builder.singlethreaded.SingleThreadedBuilder.build (SingleThreadedBuilder.java:51)
[2019-10-26T16:46:36.808Z]     at org.apache.maven.lifecycle.internal.LifecycleStarter.execute (LifecycleStarter.java:128)
[2019-10-26T16:46:36.808Z]     at org.apache.maven.DefaultMaven.doExecute (DefaultMaven.java:309)
[2019-10-26T16:46:36.808Z]     at org.apache.maven.DefaultMaven.doExecute (DefaultMaven.java:194)
[2019-10-26T16:46:36.808Z]     at org.apache.maven.DefaultMaven.execute (DefaultMaven.java:107)
[2019-10-26T16:46:36.808Z]     at org.apache.maven.cli.MavenCli.execute (MavenCli.java:955)
[2019-10-26T16:46:36.808Z]     at org.apache.maven.cli.MavenCli.doMain (MavenCli.java:290)
[2019-10-26T16:46:36.808Z]     at org.apache.maven.cli.MavenCli.main (MavenCli.java:194)
[2019-10-26T16:46:36.808Z]     at sun.reflect.NativeMethodAccessorImpl.invoke0 (Native Method)
[2019-10-26T16:46:36.808Z]     at sun.reflect.NativeMethodAccessorImpl.invoke (NativeMethodAccessorImpl.java:62)
[2019-10-26T16:46:36.808Z]     at sun.reflect.DelegatingMethodAccessorImpl.invoke (DelegatingMethodAccessorImpl.java:43)
[2019-10-26T16:46:36.808Z]     at java.lang.reflect.Method.invoke (Method.java:498)
[2019-10-26T16:46:36.808Z]     at org.codehaus.plexus.classworlds.launcher.Launcher.launchEnhanced (Launcher.java:289)
[2019-10-26T16:46:36.808Z]     at org.codehaus.plexus.classworlds.launcher.Launcher.launch (Launcher.java:229)
[2019-10-26T16:46:36.808Z]     at org.codehaus.plexus.classworlds.launcher.Launcher.mainWithExitCode (Launcher.java:415)
[2019-10-26T16:46:36.808Z]     at org.codehaus.plexus.classworlds.launcher.Launcher.main (Launcher.java:356)
[2019-10-26T16:46:36.808Z] Caused by: org.apache.maven.plugin.MojoFailureException: You have 2 Checkstyle violations.
[2019-10-26T16:46:36.808Z]     at org.apache.maven.plugins.checkstyle.CheckstyleViolationCheckMojo.execute (CheckstyleViolationCheckMojo.java:576)
[2019-10-26T16:46:36.808Z]     at org.apache.maven.plugin.DefaultBuildPluginManager.executeMojo (DefaultBuildPluginManager.java:134)
[2019-10-26T16:46:36.808Z]     at org.apache.maven.lifecycle.internal.MojoExecutor.execute (MojoExecutor.java:208)
[2019-10-26T16:46:36.809Z]     at org.apache.maven.lifecycle.internal.MojoExecutor.execute (MojoExecutor.java:154)
[2019-10-26T16:46:36.809Z]     at org.apache.maven.lifecycle.internal.MojoExecutor.execute (MojoExecutor.java:146)
[2019-10-26T16:46:36.809Z]     at org.apache.maven.lifecycle.internal.LifecycleModuleBuilder.buildProject (LifecycleModuleBuilder.java:117)
[2019-10-26T16:46:36.809Z]     at org.apache.maven.lifecycle.internal.LifecycleModuleBuilder.buildProject (LifecycleModuleBuilder.java:81)
[2019-10-26T16:46:36.809Z]     at org.apache.maven.lifecycle.internal.builder.singlethreaded.SingleThreadedBuilder.build (SingleThreadedBuilder.java:51)
[2019-10-26T16:46:36.809Z]     at org.apache.maven.lifecycle.internal.LifecycleStarter.execute (LifecycleStarter.java:128)
[2019-10-26T16:46:36.809Z]     at org.apache.maven.DefaultMaven.doExecute (DefaultMaven.java:309)
[2019-10-26T16:46:36.809Z]     at org.apache.maven.DefaultMaven.doExecute (DefaultMaven.java:194)
[2019-10-26T16:46:36.809Z]     at org.apache.maven.DefaultMaven.execute (DefaultMaven.java:107)
[2019-10-26T16:46:36.809Z]     at org.apache.maven.cli.MavenCli.execute (MavenCli.java:955)
[2019-10-26T16:46:36.809Z]     at org.apache.maven.cli.MavenCli.doMain (MavenCli.java:290)
[2019-10-26T16:46:36.809Z]     at org.apache.maven.cli.MavenCli.main (MavenCli.java:194)
[2019-10-26T16:46:36.809Z]     at sun.reflect.NativeMethodAccessorImpl.invoke0 (Native Method)
[2019-10-26T16:46:36.809Z]     at sun.reflect.NativeMethodAccessorImpl.invoke (NativeMethodAccessorImpl.java:62)
[2019-10-26T16:46:36.809Z]     at sun.reflect.DelegatingMethodAccessorImpl.invoke (DelegatingMethodAccessorImpl.java:43)
[2019-10-26T16:46:36.809Z]     at java.lang.reflect.Method.invoke (Method.java:498)
[2019-10-26T16:46:36.809Z]     at org.codehaus.plexus.classworlds.launcher.Launcher.launchEnhanced (Launcher.java:289)
[2019-10-26T16:46:36.809Z]     at org.codehaus.plexus.classworlds.launcher.Launcher.launch (Launcher.java:229)
[2019-10-26T16:46:36.809Z]     at org.codehaus.plexus.classworlds.launcher.Launcher.mainWithExitCode (Launcher.java:415)
[2019-10-26T16:46:36.809Z]     at org.codehaus.plexus.classworlds.launcher.Launcher.main (Launcher.java:356)
[2019-10-26T16:46:36.809Z] [ERROR]
[2019-10-26T16:46:36.809Z] [ERROR] Re-run Maven using the -X switch to enable full debug logging.
[2019-10-26T16:46:36.809Z] [ERROR]
[2019-10-26T16:46:36.809Z] [ERROR] For more information about the errors and possible solutions, please read the following articles:
[2019-10-26T16:46:36.809Z] [ERROR] [Help 1] http://cwiki.apache.org/confluence/display/MAVEN/MojoFailureException
[2019-10-26T16:46:36.809Z] [ERROR]
[2019-10-26T16:46:36.809Z] [ERROR] After correcting the problems, you can resume the build with the command
[2019-10-26T16:46:36.809Z] [ERROR]   mvn <goals> -rf :surefire-junit-platform
[Pipeline] }
[Pipeline] // withEnv
[Pipeline] }
[Pipeline] // stage
[Pipeline] stage
[Pipeline] { (reporting windows-jdk7-maven3.5.x)
[Pipeline] fileExists
[Pipeline] fileExists
[Pipeline] archiveArtifacts
[2019-10-26T16:46:37.069Z] Archiving artifacts
[2019-10-26T16:46:37.707Z] ‘*--windows-jdk7-maven3.5.x.zip’ doesn’t match anything
[2019-10-26T16:46:37.707Z] No artifacts found that match the file pattern "*--windows-jdk7-maven3.5.x.zip". Configuration error?
[Pipeline] }
[Pipeline] // stage
[Pipeline] stage
[Pipeline] { (cleanup windows-jdk7-maven3.5.x)
[Pipeline] cleanWs
[2019-10-26T16:46:37.807Z] [WS-CLEANUP] Deleting project workspace...
[2019-10-26T16:46:37.807Z] [WS-CLEANUP] Deferred wipeout is used...
[2019-10-26T16:46:37.843Z] [WS-CLEANUP] done
[Pipeline] }
[Pipeline] // stage
[Pipeline] }
[Pipeline] // timestamps
[Pipeline] }
[Pipeline] // node
[Pipeline] }
Failed in branch windows-jdk7-maven3.5.x
[Pipeline] // parallel
[Pipeline] echo
hudson.AbortException: hudson.AbortException: script returned exit code 1
[Pipeline] stage
[Pipeline] { (notifications)
[Pipeline] echo
Build result: FAILURE
[Pipeline] jiraIssueSelector
[Pipeline] echo
The authors of changes [rfscholte].
[Pipeline] echo
Sending email ...
[Pipeline] emailext
Reply | Threaded
Open this post in threaded view
|

Build failed in Jenkins: Maven TLP » maven-surefire » SUREFIRE-1603 #16

Apache Jenkins Server-2
See https://builds.apache.org/job/maven-box/job/maven-surefire/job/SUREFIRE-1603/16/

Changes:

* H31 gives OOME (let's see if others are stable again...)
* echo NODE_NAME

All tests passed

Build log:
[...truncated 24271 lines...]
[2019-11-27T14:02:56.843Z] [INFO] Downloading from central: https://repo.maven.apache.org/maven2/org/opentest4j/opentest4j/1.1.1/opentest4j-1.1.1.jar
[2019-11-27T14:02:56.843Z] [INFO] Downloaded from central: https://repo.maven.apache.org/maven2/org/junit/platform/junit-platform-launcher/1.3.1/junit-platform-launcher-1.3.1.jar (95 kB at 2.1 MB/s)
[2019-11-27T14:02:56.843Z] [INFO] Downloading from central: https://repo.maven.apache.org/maven2/org/junit/jupiter/junit-jupiter-engine/5.3.1/junit-jupiter-engine-5.3.1.jar
[2019-11-27T14:02:56.843Z] [INFO] Downloaded from central: https://repo.maven.apache.org/maven2/org/junit/platform/junit-platform-commons/1.3.1/junit-platform-commons-1.3.1.jar (78 kB at 1.5 MB/s)
[2019-11-27T14:02:56.843Z] [INFO] Downloading from central: https://repo.maven.apache.org/maven2/org/junit/jupiter/junit-jupiter-api/5.3.1/junit-jupiter-api-5.3.1.jar
[2019-11-27T14:02:56.843Z] [INFO] Downloaded from central: https://repo.maven.apache.org/maven2/org/junit/platform/junit-platform-engine/1.3.1/junit-platform-engine-1.3.1.jar (135 kB at 2.3 MB/s)
[2019-11-27T14:02:56.843Z] [INFO] Downloading from central: https://repo.maven.apache.org/maven2/org/assertj/assertj-core/3.9.1/assertj-core-3.9.1.jar
[2019-11-27T14:02:56.843Z] [INFO] Downloaded from central: https://repo.maven.apache.org/maven2/org/apiguardian/apiguardian-api/1.0.0/apiguardian-api-1.0.0.jar (2.2 kB at 28 kB/s)
[2019-11-27T14:02:56.843Z] [INFO] Downloaded from central: https://repo.maven.apache.org/maven2/org/junit/jupiter/junit-jupiter-api/5.3.1/junit-jupiter-api-5.3.1.jar (115 kB at 1.1 MB/s)
[2019-11-27T14:02:56.843Z] [INFO] Downloaded from central: https://repo.maven.apache.org/maven2/org/junit/jupiter/junit-jupiter-engine/5.3.1/junit-jupiter-engine-5.3.1.jar (150 kB at 1.4 MB/s)
[2019-11-27T14:02:56.843Z] [INFO] Downloaded from central: https://repo.maven.apache.org/maven2/org/opentest4j/opentest4j/1.1.1/opentest4j-1.1.1.jar (7.1 kB at 50 kB/s)
[2019-11-27T14:02:56.843Z] [INFO] Downloaded from central: https://repo.maven.apache.org/maven2/org/assertj/assertj-core/3.9.1/assertj-core-3.9.1.jar (3.9 MB at 8.0 MB/s)
[2019-11-27T14:02:56.843Z] [INFO]
[2019-11-27T14:02:56.843Z] [INFO] --- maven-clean-plugin:3.1.0:clean (default-clean) @ surefire-junit-platform ---
[2019-11-27T14:02:56.843Z] [INFO]
[2019-11-27T14:02:56.843Z] [INFO] --- maven-enforcer-plugin:3.0.0-M2:enforce (enforce-maven-version) @ surefire-junit-platform ---
[2019-11-27T14:02:56.843Z] [INFO]
[2019-11-27T14:02:56.843Z] [INFO] --- maven-enforcer-plugin:3.0.0-M2:enforce (enforce-bytecode-version) @ surefire-junit-platform ---
[2019-11-27T14:02:56.843Z] [INFO]
[2019-11-27T14:02:56.843Z] [INFO] --- maven-enforcer-plugin:3.0.0-M2:enforce (ban-known-bad-maven-versions) @ surefire-junit-platform ---
[2019-11-27T14:02:56.843Z] [INFO]
[2019-11-27T14:02:56.843Z] [INFO] --- maven-enforcer-plugin:3.0.0-M2:enforce (enforce-java) @ surefire-junit-platform ---
[2019-11-27T14:02:56.843Z] [INFO]
[2019-11-27T14:02:56.843Z] [INFO] --- maven-enforcer-plugin:3.0.0-M2:enforce (enforce-maven) @ surefire-junit-platform ---
[2019-11-27T14:02:56.843Z] [INFO]
[2019-11-27T14:02:56.843Z] [INFO] --- apache-rat-plugin:0.12:check (rat-check) @ surefire-junit-platform ---
[2019-11-27T14:02:56.843Z] [INFO] Enabled default license matchers.
[2019-11-27T14:02:56.843Z] [INFO] Will parse SCM ignores for exclusions...
[2019-11-27T14:02:56.843Z] [INFO] Finished adding exclusions from SCM ignore files.
[2019-11-27T14:02:56.844Z] [INFO] 61 implicit excludes (use -debug for more details).
[2019-11-27T14:02:56.844Z] [INFO] Exclude: .repository/**
[2019-11-27T14:02:56.844Z] [INFO] Exclude: .maven/spy.log
[2019-11-27T14:02:56.844Z] [INFO] Exclude: dependency-reduced-pom.xml
[2019-11-27T14:02:56.844Z] [INFO] Exclude: .java-version
[2019-11-27T14:02:56.844Z] [INFO] Exclude: Jenkinsfile
[2019-11-27T14:02:56.844Z] [INFO] Exclude: README.md
[2019-11-27T14:02:56.844Z] [INFO] Exclude: .gitignore
[2019-11-27T14:02:56.844Z] [INFO] Exclude: .git/**/*
[2019-11-27T14:02:56.844Z] [INFO] Exclude: **/.idea
[2019-11-27T14:02:56.844Z] [INFO] Exclude: **/.svn/**/*
[2019-11-27T14:02:56.844Z] [INFO] Exclude: **/*.iml
[2019-11-27T14:02:56.844Z] [INFO] Exclude: **/*.ipr
[2019-11-27T14:02:56.844Z] [INFO] Exclude: **/*.iws
[2019-11-27T14:02:56.844Z] [INFO] Exclude: **/*.versionsBackup
[2019-11-27T14:02:56.844Z] [INFO] Exclude: **/dependency-reduced-pom.xml
[2019-11-27T14:02:56.844Z] [INFO] Exclude: .repository/**
[2019-11-27T14:02:56.844Z] [INFO] Exclude: src/test/resources/**/*
[2019-11-27T14:02:56.844Z] [INFO] Exclude: src/test/resources/**/*.css
[2019-11-27T14:02:56.844Z] [INFO] Exclude: **/*.jj
[2019-11-27T14:02:56.844Z] [INFO] Exclude: src/main/resources/META-INF/services/org.apache.maven.surefire.providerapi.SurefireProvider
[2019-11-27T14:02:56.844Z] [INFO] Exclude: DEPENDENCIES
[2019-11-27T14:02:56.844Z] [INFO] Exclude: .m2/**
[2019-11-27T14:02:56.844Z] [INFO] Exclude: .m2
[2019-11-27T14:02:56.844Z] [INFO] Exclude: .travis.yml
[2019-11-27T14:02:56.844Z] [INFO] 9 resources included (use -debug for more details)
[2019-11-27T14:02:56.844Z] [INFO] Rat check: Summary over all files. Unapproved: 0, unknown: 0, generated: 0, approved: 9 licenses.
[2019-11-27T14:02:56.844Z] [INFO]
[2019-11-27T14:02:56.844Z] [INFO] --- jacoco-maven-plugin:0.8.2:prepare-agent (jacoco-agent) @ surefire-junit-platform ---
[2019-11-27T14:02:56.844Z] [INFO] Skipping JaCoCo execution because property jacoco.skip is set.
[2019-11-27T14:02:56.844Z] [INFO] jacoco.agent set to empty
[2019-11-27T14:02:56.844Z] [INFO]
[2019-11-27T14:02:56.844Z] [INFO] --- maven-compiler-plugin:3.7.0:compile (compile-generated) @ surefire-junit-platform ---
[2019-11-27T14:02:56.844Z] [INFO] Nothing to compile - all classes are up to date
[2019-11-27T14:02:56.844Z] [INFO]
[2019-11-27T14:02:56.844Z] [INFO] --- maven-remote-resources-plugin:1.5:process (process-resource-bundles) @ surefire-junit-platform ---
[2019-11-27T14:02:56.844Z] [INFO]
[2019-11-27T14:02:56.844Z] [INFO] --- maven-resources-plugin:3.1.0:resources (default-resources) @ surefire-junit-platform ---
[2019-11-27T14:02:56.844Z] [INFO] Using 'UTF-8' encoding to copy filtered resources.
[2019-11-27T14:02:56.844Z] [INFO] Copying 1 resource
[2019-11-27T14:02:56.844Z] [INFO] Copying 3 resources
[2019-11-27T14:02:56.844Z] [INFO]
[2019-11-27T14:02:56.844Z] [INFO] --- maven-compiler-plugin:3.7.0:compile (default-compile) @ surefire-junit-platform ---
[2019-11-27T14:02:56.844Z] [INFO] Changes detected - recompiling the module!
[2019-11-27T14:02:56.844Z] [INFO] Compiling 4 source files to F:\jenkins\jenkins-slave\workspace\box_maven-surefire_SUREFIRE-1603\surefire-providers\surefire-junit-platform\target\classes
[2019-11-27T14:02:56.844Z] [INFO]
[2019-11-27T14:02:56.844Z] [INFO] --- animal-sniffer-maven-plugin:1.17:check (signature-check) @ surefire-junit-platform ---
[2019-11-27T14:02:56.844Z] [INFO] Checking unresolved references to org.codehaus.mojo.signature:java18:1.0
[2019-11-27T14:02:56.844Z] [INFO] Downloading from central: https://repo.maven.apache.org/maven2/org/codehaus/mojo/signature/java18/1.0/java18-1.0.signature
[2019-11-27T14:02:56.844Z] [INFO] Downloaded from central: https://repo.maven.apache.org/maven2/org/codehaus/mojo/signature/java18/1.0/java18-1.0.signature (2.0 MB at 7.9 MB/s)
[2019-11-27T14:02:56.844Z] [INFO]
[2019-11-27T14:02:56.844Z] [INFO] --- maven-resources-plugin:3.1.0:testResources (default-testResources) @ surefire-junit-platform ---
[2019-11-27T14:02:56.844Z] [INFO] Using 'UTF-8' encoding to copy filtered resources.
[2019-11-27T14:02:56.844Z] [INFO] skip non existing resourceDirectory F:\jenkins\jenkins-slave\workspace\box_maven-surefire_SUREFIRE-1603\surefire-providers\surefire-junit-platform\src\test\resources
[2019-11-27T14:02:56.844Z] [INFO] Copying 3 resources
[2019-11-27T14:02:56.844Z] [INFO]
[2019-11-27T14:02:56.844Z] [INFO] --- maven-compiler-plugin:3.7.0:testCompile (default-testCompile) @ surefire-junit-platform ---
[2019-11-27T14:02:56.844Z] [INFO] Changes detected - recompiling the module!
[2019-11-27T14:02:56.844Z] [INFO] Compiling 4 source files to F:\jenkins\jenkins-slave\workspace\box_maven-surefire_SUREFIRE-1603\surefire-providers\surefire-junit-platform\target\test-classes
[2019-11-27T14:02:56.844Z] [INFO]
[2019-11-27T14:02:56.844Z] [INFO] --- maven-surefire-plugin:2.12.4:test (default-test) @ surefire-junit-platform ---
[2019-11-27T14:02:56.844Z] [INFO] Surefire report directory: F:\jenkins\jenkins-slave\workspace\box_maven-surefire_SUREFIRE-1603\surefire-providers\surefire-junit-platform\target\surefire-reports
[2019-11-27T14:02:56.844Z] [INFO] Using configured provider org.apache.maven.surefire.shadefire.junit.JUnit3Provider
[2019-11-27T14:02:56.844Z]
[2019-11-27T14:02:56.844Z] -------------------------------------------------------
[2019-11-27T14:02:56.844Z]  T E S T S
[2019-11-27T14:02:56.844Z] -------------------------------------------------------
[2019-11-27T14:02:56.844Z] Running org.apache.maven.surefire.junitplatform.JUnitPlatformProviderTest
[2019-11-27T14:02:56.845Z] Tests run: 0, Failures: 0, Errors: 0, Skipped: 0, Time elapsed: 0.001 sec
[2019-11-27T14:02:56.845Z] Running org.apache.maven.surefire.junitplatform.RunListenerAdapterTest
[2019-11-27T14:02:56.845Z] Tests run: 0, Failures: 0, Errors: 0, Skipped: 0, Time elapsed: 0 sec
[2019-11-27T14:02:56.845Z] Running org.apache.maven.surefire.junitplatform.TestMethodFilterTest
[2019-11-27T14:02:56.845Z] Tests run: 0, Failures: 0, Errors: 0, Skipped: 0, Time elapsed: 0 sec
[2019-11-27T14:02:56.845Z] Running org.apache.maven.surefire.junitplatform.TestPlanScannerFilterTest
[2019-11-27T14:02:56.845Z] Tests run: 0, Failures: 0, Errors: 0, Skipped: 0, Time elapsed: 0 sec
[2019-11-27T14:02:56.845Z]
[2019-11-27T14:02:56.845Z] Results :
[2019-11-27T14:02:56.845Z]
[2019-11-27T14:02:56.845Z] Tests run: 0, Failures: 0, Errors: 0, Skipped: 0
[2019-11-27T14:02:56.845Z]
[2019-11-27T14:02:56.845Z] [INFO]
[2019-11-27T14:02:56.845Z] [INFO] --- maven-jar-plugin:3.1.0:jar (default-jar) @ surefire-junit-platform ---
[2019-11-27T14:02:56.845Z] [INFO] Building jar: F:\jenkins\jenkins-slave\workspace\box_maven-surefire_SUREFIRE-1603\surefire-providers\surefire-junit-platform\target\surefire-junit-platform-3.0.0-M2-SNAPSHOT.jar
[2019-11-27T14:02:56.845Z] [INFO]
[2019-11-27T14:02:56.845Z] [INFO] --- maven-site-plugin:3.7.1:attach-descriptor (attach-descriptor) @ surefire-junit-platform ---
[2019-11-27T14:02:56.845Z] [INFO] Skipping because packaging 'jar' is not pom.
[2019-11-27T14:02:56.845Z] [INFO]
[2019-11-27T14:02:56.845Z] [INFO] --- maven-checkstyle-plugin:3.0.0:check (checkstyle-check) @ surefire-junit-platform ---
[2019-11-27T14:02:56.845Z] [INFO] There are 2 errors reported by Checkstyle 6.18 with config/maven_checks.xml ruleset.
[2019-11-27T14:02:56.845Z] [ERROR] src\main\java\org\apache\maven\surefire\junitplatform\RunListenerAdapter.java:[206,13] (whitespace) ParenPad: '(' is not followed by whitespace.
[2019-11-27T14:02:56.845Z] [ERROR] src\main\java\org\apache\maven\surefire\junitplatform\RunListenerAdapter.java:[206,28] (whitespace) ParenPad: ')' is not preceded with whitespace.
[2019-11-27T14:02:56.845Z] [INFO] ------------------------------------------------------------------------
[2019-11-27T14:02:56.845Z] [INFO] Reactor Summary:
[2019-11-27T14:02:56.845Z] [INFO]
[2019-11-27T14:02:56.845Z] [INFO] Apache Maven Surefire .............................. SUCCESS [ 46.376 s]
[2019-11-27T14:02:56.845Z] [INFO] SureFire Logger API ................................ SUCCESS [  8.860 s]
[2019-11-27T14:02:56.845Z] [INFO] SureFire API ....................................... SUCCESS [ 14.784 s]
[2019-11-27T14:02:56.845Z] [INFO] SureFire Booter .................................... SUCCESS [ 15.411 s]
[2019-11-27T14:02:56.845Z] [INFO] Maven Surefire Test-Grouping Support ............... SUCCESS [  7.730 s]
[2019-11-27T14:02:56.845Z] [INFO] SureFire Providers ................................. SUCCESS [  1.188 s]
[2019-11-27T14:02:56.845Z] [INFO] Shared JUnit3 Provider Code ........................ SUCCESS [  3.934 s]
[2019-11-27T14:02:56.845Z] [INFO] Shared Java 5 Provider Base ........................ SUCCESS [  5.154 s]
[2019-11-27T14:02:56.845Z] [INFO] Shared JUnit4 Provider Code ........................ SUCCESS [  5.714 s]
[2019-11-27T14:02:56.845Z] [INFO] Shared JUnit48 Provider Code ....................... SUCCESS [  5.867 s]
[2019-11-27T14:02:56.845Z] [INFO] SureFire JUnit Runner .............................. SUCCESS [  4.345 s]
[2019-11-27T14:02:56.845Z] [INFO] SureFire JUnit4 Runner ............................. SUCCESS [  4.545 s]
[2019-11-27T14:02:56.845Z] [INFO] Maven Surefire Common .............................. SUCCESS [ 32.600 s]
[2019-11-27T14:02:56.845Z] [INFO] SureFire JUnitCore Runner .......................... SUCCESS [02:23 min]
[2019-11-27T14:02:56.845Z] [INFO] SureFire JUnit Platform Runner ..................... FAILURE [  8.262 s]
[2019-11-27T14:02:56.845Z] [INFO] SureFire TestNG Utils .............................. SKIPPED
[2019-11-27T14:02:56.845Z] [INFO] SureFire TestNG Runner ............................. SKIPPED
[2019-11-27T14:02:56.845Z] [INFO] ShadeFire JUnit3 Provider .......................... SKIPPED
[2019-11-27T14:02:56.845Z] [INFO] Surefire Report Parser ............................. SKIPPED
[2019-11-27T14:02:56.845Z] [INFO] Maven Surefire Plugin .............................. SKIPPED
[2019-11-27T14:02:56.845Z] [INFO] Maven Failsafe Plugin .............................. SKIPPED
[2019-11-27T14:02:56.845Z] [INFO] Maven Surefire Report Plugin ....................... SKIPPED
[2019-11-27T14:02:56.845Z] [INFO] Maven Surefire Integration Tests ................... SKIPPED
[2019-11-27T14:02:56.845Z] [INFO] ------------------------------------------------------------------------
[2019-11-27T14:02:56.845Z] [INFO] BUILD FAILURE
[2019-11-27T14:02:56.845Z] [INFO] ------------------------------------------------------------------------
[2019-11-27T14:02:56.845Z] [INFO] Total time: 05:10 min
[2019-11-27T14:02:56.845Z] [INFO] Finished at: 2019-11-27T06:02:53-08:00
[2019-11-27T14:02:56.845Z] [INFO] Final Memory: 39M/130M
[2019-11-27T14:02:56.845Z] [INFO] ------------------------------------------------------------------------
[2019-11-27T14:02:56.845Z] [ERROR] Failed to execute goal org.apache.maven.plugins:maven-checkstyle-plugin:3.0.0:check (checkstyle-check) on project surefire-junit-platform: You have 2 Checkstyle violations. -> [Help 1]
[2019-11-27T14:02:56.845Z] org.apache.maven.lifecycle.LifecycleExecutionException: Failed to execute goal org.apache.maven.plugins:maven-checkstyle-plugin:3.0.0:check (checkstyle-check) on project surefire-junit-platform: You have 2 Checkstyle violations.
[2019-11-27T14:02:56.845Z]     at org.apache.maven.lifecycle.internal.MojoExecutor.execute (MojoExecutor.java:213)
[2019-11-27T14:02:56.845Z]     at org.apache.maven.lifecycle.internal.MojoExecutor.execute (MojoExecutor.java:154)
[2019-11-27T14:02:56.845Z]     at org.apache.maven.lifecycle.internal.MojoExecutor.execute (MojoExecutor.java:146)
[2019-11-27T14:02:56.845Z]     at org.apache.maven.lifecycle.internal.LifecycleModuleBuilder.buildProject (LifecycleModuleBuilder.java:117)
[2019-11-27T14:02:56.846Z]     at org.apache.maven.lifecycle.internal.LifecycleModuleBuilder.buildProject (LifecycleModuleBuilder.java:81)
[2019-11-27T14:02:56.846Z]     at org.apache.maven.lifecycle.internal.builder.singlethreaded.SingleThreadedBuilder.build (SingleThreadedBuilder.java:51)
[2019-11-27T14:02:56.846Z]     at org.apache.maven.lifecycle.internal.LifecycleStarter.execute (LifecycleStarter.java:128)
[2019-11-27T14:02:56.846Z]     at org.apache.maven.DefaultMaven.doExecute (DefaultMaven.java:309)
[2019-11-27T14:02:56.846Z]     at org.apache.maven.DefaultMaven.doExecute (DefaultMaven.java:194)
[2019-11-27T14:02:56.846Z]     at org.apache.maven.DefaultMaven.execute (DefaultMaven.java:107)
[2019-11-27T14:02:56.846Z]     at org.apache.maven.cli.MavenCli.execute (MavenCli.java:955)
[2019-11-27T14:02:56.846Z]     at org.apache.maven.cli.MavenCli.doMain (MavenCli.java:290)
[2019-11-27T14:02:56.846Z]     at org.apache.maven.cli.MavenCli.main (MavenCli.java:194)
[2019-11-27T14:02:56.846Z]     at sun.reflect.NativeMethodAccessorImpl.invoke0 (Native Method)
[2019-11-27T14:02:56.846Z]     at sun.reflect.NativeMethodAccessorImpl.invoke (NativeMethodAccessorImpl.java:62)
[2019-11-27T14:02:56.846Z]     at sun.reflect.DelegatingMethodAccessorImpl.invoke (DelegatingMethodAccessorImpl.java:43)
[2019-11-27T14:02:56.846Z]     at java.lang.reflect.Method.invoke (Method.java:498)
[2019-11-27T14:02:56.846Z]     at org.codehaus.plexus.classworlds.launcher.Launcher.launchEnhanced (Launcher.java:289)
[2019-11-27T14:02:56.846Z]     at org.codehaus.plexus.classworlds.launcher.Launcher.launch (Launcher.java:229)
[2019-11-27T14:02:56.846Z]     at org.codehaus.plexus.classworlds.launcher.Launcher.mainWithExitCode (Launcher.java:415)
[2019-11-27T14:02:56.846Z]     at org.codehaus.plexus.classworlds.launcher.Launcher.main (Launcher.java:356)
[2019-11-27T14:02:56.846Z] Caused by: org.apache.maven.plugin.MojoFailureException: You have 2 Checkstyle violations.
[2019-11-27T14:02:56.846Z]     at org.apache.maven.plugins.checkstyle.CheckstyleViolationCheckMojo.execute (CheckstyleViolationCheckMojo.java:576)
[2019-11-27T14:02:56.846Z]     at org.apache.maven.plugin.DefaultBuildPluginManager.executeMojo (DefaultBuildPluginManager.java:134)
[2019-11-27T14:02:56.846Z]     at org.apache.maven.lifecycle.internal.MojoExecutor.execute (MojoExecutor.java:208)
[2019-11-27T14:02:56.846Z]     at org.apache.maven.lifecycle.internal.MojoExecutor.execute (MojoExecutor.java:154)
[2019-11-27T14:02:56.846Z]     at org.apache.maven.lifecycle.internal.MojoExecutor.execute (MojoExecutor.java:146)
[2019-11-27T14:02:56.846Z]     at org.apache.maven.lifecycle.internal.LifecycleModuleBuilder.buildProject (LifecycleModuleBuilder.java:117)
[2019-11-27T14:02:56.846Z]     at org.apache.maven.lifecycle.internal.LifecycleModuleBuilder.buildProject (LifecycleModuleBuilder.java:81)
[2019-11-27T14:02:56.846Z]     at org.apache.maven.lifecycle.internal.builder.singlethreaded.SingleThreadedBuilder.build (SingleThreadedBuilder.java:51)
[2019-11-27T14:02:56.846Z]     at org.apache.maven.lifecycle.internal.LifecycleStarter.execute (LifecycleStarter.java:128)
[2019-11-27T14:02:56.846Z]     at org.apache.maven.DefaultMaven.doExecute (DefaultMaven.java:309)
[2019-11-27T14:02:56.846Z]     at org.apache.maven.DefaultMaven.doExecute (DefaultMaven.java:194)
[2019-11-27T14:02:56.846Z]     at org.apache.maven.DefaultMaven.execute (DefaultMaven.java:107)
[2019-11-27T14:02:56.846Z]     at org.apache.maven.cli.MavenCli.execute (MavenCli.java:955)
[2019-11-27T14:02:56.846Z]     at org.apache.maven.cli.MavenCli.doMain (MavenCli.java:290)
[2019-11-27T14:02:56.846Z]     at org.apache.maven.cli.MavenCli.main (MavenCli.java:194)
[2019-11-27T14:02:56.846Z]     at sun.reflect.NativeMethodAccessorImpl.invoke0 (Native Method)
[2019-11-27T14:02:56.846Z]     at sun.reflect.NativeMethodAccessorImpl.invoke (NativeMethodAccessorImpl.java:62)
[2019-11-27T14:02:56.846Z]     at sun.reflect.DelegatingMethodAccessorImpl.invoke (DelegatingMethodAccessorImpl.java:43)
[2019-11-27T14:02:56.846Z]     at java.lang.reflect.Method.invoke (Method.java:498)
[2019-11-27T14:02:56.846Z]     at org.codehaus.plexus.classworlds.launcher.Launcher.launchEnhanced (Launcher.java:289)
[2019-11-27T14:02:56.846Z]     at org.codehaus.plexus.classworlds.launcher.Launcher.launch (Launcher.java:229)
[2019-11-27T14:02:56.846Z]     at org.codehaus.plexus.classworlds.launcher.Launcher.mainWithExitCode (Launcher.java:415)
[2019-11-27T14:02:56.846Z]     at org.codehaus.plexus.classworlds.launcher.Launcher.main (Launcher.java:356)
[2019-11-27T14:02:56.846Z] [ERROR]
[2019-11-27T14:02:56.846Z] [ERROR] Re-run Maven using the -X switch to enable full debug logging.
[2019-11-27T14:02:56.846Z] [ERROR]
[2019-11-27T14:02:56.847Z] [ERROR] For more information about the errors and possible solutions, please read the following articles:
[2019-11-27T14:02:56.847Z] [ERROR] [Help 1] http://cwiki.apache.org/confluence/display/MAVEN/MojoFailureException
[2019-11-27T14:02:56.847Z] [ERROR]
[2019-11-27T14:02:56.847Z] [ERROR] After correcting the problems, you can resume the build with the command
[2019-11-27T14:02:56.847Z] [ERROR]   mvn <goals> -rf :surefire-junit-platform
[Pipeline] }
[Pipeline] // withEnv
[Pipeline] }
[Pipeline] // stage
[Pipeline] stage
[Pipeline] { (reporting windows-jdk7-maven3.5.x)
[Pipeline] fileExists
[Pipeline] fileExists
[Pipeline] archiveArtifacts
[2019-11-27T14:02:57.165Z] Archiving artifacts
[2019-11-27T14:02:57.602Z] ‘*--windows-jdk7-maven3.5.x.zip’ doesn’t match anything
[2019-11-27T14:02:57.602Z] No artifacts found that match the file pattern "*--windows-jdk7-maven3.5.x.zip". Configuration error?
[Pipeline] }
[Pipeline] // stage
[Pipeline] stage
[Pipeline] { (cleanup windows-jdk7-maven3.5.x)
[Pipeline] cleanWs
[2019-11-27T14:02:57.758Z] [WS-CLEANUP] Deleting project workspace...
[2019-11-27T14:02:57.758Z] [WS-CLEANUP] Deferred wipeout is used...
[2019-11-27T14:02:57.791Z] [WS-CLEANUP] done
[Pipeline] }
[Pipeline] // stage
[Pipeline] }
[Pipeline] // timestamps
[Pipeline] }
[Pipeline] // node
[Pipeline] }
Failed in branch windows-jdk7-maven3.5.x
[Pipeline] // parallel
[Pipeline] echo
hudson.AbortException: hudson.AbortException: script returned exit code 1
[Pipeline] stage
[Pipeline] { (notifications)
[Pipeline] echo
Build result: FAILURE
[Pipeline] jiraIssueSelector
[Pipeline] echo
The authors of changes [rfscholte, hboutemy].
[Pipeline] echo
Sending email ...
[Pipeline] emailext