Build failed in Jenkins: Maven TLP » maven-surefire » SUREFIRE-1603 #1

classic Classic list List threaded Threaded
8 messages Options
Reply | Threaded
Open this post in threaded view
|

Build failed in Jenkins: Maven TLP » maven-surefire » SUREFIRE-1603 #1

Apache Jenkins Server-2
See https://builds.apache.org/job/maven-box/job/maven-surefire/job/SUREFIRE-1603/1/

No changes.

All tests passed

Build log:
[...truncated 10.84 MB...]
[windows-jdk9-maven3.5.x] org.apache.maven.lifecycle.LifecycleExecutionException: Failed to execute goal org.apache.maven.plugins:maven-checkstyle-plugin:3.0.0:check (checkstyle-check) on project surefire-junit-platform: You have 2 Checkstyle violations.
[windows-jdk9-maven3.5.x]     at org.apache.maven.lifecycle.internal.MojoExecutor.execute (MojoExecutor.java:213)
[windows-jdk9-maven3.5.x]     at org.apache.maven.lifecycle.internal.MojoExecutor.execute (MojoExecutor.java:154)
[windows-jdk9-maven3.5.x]     at org.apache.maven.lifecycle.internal.MojoExecutor.execute (MojoExecutor.java:146)
[windows-jdk9-maven3.5.x]     at org.apache.maven.lifecycle.internal.LifecycleModuleBuilder.buildProject (LifecycleModuleBuilder.java:117)
[windows-jdk9-maven3.5.x]     at org.apache.maven.lifecycle.internal.LifecycleModuleBuilder.buildProject (LifecycleModuleBuilder.java:81)
[windows-jdk9-maven3.5.x]     at org.apache.maven.lifecycle.internal.builder.singlethreaded.SingleThreadedBuilder.build (SingleThreadedBuilder.java:51)
[windows-jdk9-maven3.5.x]     at org.apache.maven.lifecycle.internal.LifecycleStarter.execute (LifecycleStarter.java:128)
[windows-jdk9-maven3.5.x]     at org.apache.maven.DefaultMaven.doExecute (DefaultMaven.java:309)
[windows-jdk9-maven3.5.x]     at org.apache.maven.DefaultMaven.doExecute (DefaultMaven.java:194)
[windows-jdk9-maven3.5.x]     at org.apache.maven.DefaultMaven.execute (DefaultMaven.java:107)
[windows-jdk9-maven3.5.x]     at org.apache.maven.cli.MavenCli.execute (MavenCli.java:955)
[windows-jdk9-maven3.5.x]     at org.apache.maven.cli.MavenCli.doMain (MavenCli.java:290)
[windows-jdk9-maven3.5.x]     at org.apache.maven.cli.MavenCli.main (MavenCli.java:194)
[windows-jdk9-maven3.5.x]     at sun.reflect.NativeMethodAccessorImpl.invoke0 (Native Method)
[windows-jdk9-maven3.5.x]     at sun.reflect.NativeMethodAccessorImpl.invoke (NativeMethodAccessorImpl.java:62)
[windows-jdk9-maven3.5.x]     at sun.reflect.DelegatingMethodAccessorImpl.invoke (DelegatingMethodAccessorImpl.java:43)
[windows-jdk9-maven3.5.x]     at java.lang.reflect.Method.invoke (Method.java:498)
[windows-jdk9-maven3.5.x]     at org.codehaus.plexus.classworlds.launcher.Launcher.launchEnhanced (Launcher.java:289)
[windows-jdk9-maven3.5.x]     at org.codehaus.plexus.classworlds.launcher.Launcher.launch (Launcher.java:229)
[windows-jdk9-maven3.5.x]     at org.codehaus.plexus.classworlds.launcher.Launcher.mainWithExitCode (Launcher.java:415)
[windows-jdk9-maven3.5.x]     at org.codehaus.plexus.classworlds.launcher.Launcher.main (Launcher.java:356)
[windows-jdk9-maven3.5.x] Caused by: org.apache.maven.plugin.MojoFailureException: You have 2 Checkstyle violations.
[windows-jdk9-maven3.5.x]     at org.apache.maven.plugins.checkstyle.CheckstyleViolationCheckMojo.execute (CheckstyleViolationCheckMojo.java:576)
[windows-jdk9-maven3.5.x]     at org.apache.maven.plugin.DefaultBuildPluginManager.executeMojo (DefaultBuildPluginManager.java:134)
[windows-jdk9-maven3.5.x]     at org.apache.maven.lifecycle.internal.MojoExecutor.execute (MojoExecutor.java:208)
[windows-jdk9-maven3.5.x]     at org.apache.maven.lifecycle.internal.MojoExecutor.execute (MojoExecutor.java:154)
[windows-jdk9-maven3.5.x]     at org.apache.maven.lifecycle.internal.MojoExecutor.execute (MojoExecutor.java:146)
[windows-jdk9-maven3.5.x]     at org.apache.maven.lifecycle.internal.LifecycleModuleBuilder.buildProject (LifecycleModuleBuilder.java:117)
[windows-jdk9-maven3.5.x]     at org.apache.maven.lifecycle.internal.LifecycleModuleBuilder.buildProject (LifecycleModuleBuilder.java:81)
[windows-jdk9-maven3.5.x]     at org.apache.maven.lifecycle.internal.builder.singlethreaded.SingleThreadedBuilder.build (SingleThreadedBuilder.java:51)
[windows-jdk9-maven3.5.x]     at org.apache.maven.lifecycle.internal.LifecycleStarter.execute (LifecycleStarter.java:128)
[windows-jdk9-maven3.5.x]     at org.apache.maven.DefaultMaven.doExecute (DefaultMaven.java:309)
[windows-jdk9-maven3.5.x]     at org.apache.maven.DefaultMaven.doExecute (DefaultMaven.java:194)
[windows-jdk9-maven3.5.x]     at org.apache.maven.DefaultMaven.execute (DefaultMaven.java:107)
[windows-jdk9-maven3.5.x]     at org.apache.maven.cli.MavenCli.execute (MavenCli.java:955)
[windows-jdk9-maven3.5.x]     at org.apache.maven.cli.MavenCli.doMain (MavenCli.java:290)
[windows-jdk9-maven3.5.x]     at org.apache.maven.cli.MavenCli.main (MavenCli.java:194)
[windows-jdk9-maven3.5.x]     at sun.reflect.NativeMethodAccessorImpl.invoke0 (Native Method)
[windows-jdk9-maven3.5.x]     at sun.reflect.NativeMethodAccessorImpl.invoke (NativeMethodAccessorImpl.java:62)
[windows-jdk9-maven3.5.x]     at sun.reflect.DelegatingMethodAccessorImpl.invoke (DelegatingMethodAccessorImpl.java:43)
[windows-jdk9-maven3.5.x]     at java.lang.reflect.Method.invoke (Method.java:498)
[windows-jdk9-maven3.5.x]     at org.codehaus.plexus.classworlds.launcher.Launcher.launchEnhanced (Launcher.java:289)
[windows-jdk9-maven3.5.x]     at org.codehaus.plexus.classworlds.launcher.Launcher.launch (Launcher.java:229)
[windows-jdk9-maven3.5.x]     at org.codehaus.plexus.classworlds.launcher.Launcher.mainWithExitCode (Launcher.java:415)
[windows-jdk9-maven3.5.x]     at org.codehaus.plexus.classworlds.launcher.Launcher.main (Launcher.java:356)
[windows-jdk9-maven3.5.x] [ERROR]
[windows-jdk9-maven3.5.x] [ERROR] Re-run Maven using the -X switch to enable full debug logging.
[windows-jdk9-maven3.5.x] [ERROR]
[windows-jdk9-maven3.5.x] [ERROR] For more information about the errors and possible solutions, please read the following articles:
[windows-jdk9-maven3.5.x] [ERROR] [Help 1] http://cwiki.apache.org/confluence/display/MAVEN/MojoFailureException
[windows-jdk9-maven3.5.x] [ERROR]
[windows-jdk9-maven3.5.x] [ERROR] After correcting the problems, you can resume the build with the command
[windows-jdk9-maven3.5.x] [ERROR]   mvn <goals> -rf :surefire-junit-platform
[windows-jdk8-maven3.5.x] [INFO]
[windows-jdk8-maven3.5.x] [INFO] --- animal-sniffer-maven-plugin:1.17:check (signature-check) @ surefire-junit-platform ---
[windows-jdk8-maven3.5.x] [INFO] Checking unresolved references to org.codehaus.mojo.signature:java18:1.0
[windows-jdk8-maven3.5.x] [INFO] Downloading from central: https://repo.maven.apache.org/maven2/org/codehaus/mojo/signature/java18/1.0/java18-1.0.signature
[windows-jdk8-maven3.5.x] [INFO] Downloaded from central: https://repo.maven.apache.org/maven2/org/codehaus/mojo/signature/java18/1.0/java18-1.0.signature (2.0 MB at 9.1 MB/s)
[Pipeline] [windows-jdk9-maven3.5.x] }
[Pipeline] [windows-jdk9-maven3.5.x] // withEnv
[Pipeline] [windows-jdk9-maven3.5.x] }
[Pipeline] [windows-jdk9-maven3.5.x] // stage
[Pipeline] [windows-jdk9-maven3.5.x] stage
[Pipeline] [windows-jdk9-maven3.5.x] { (reporting windows-jdk9-maven3.5.x)
[Pipeline] [windows-jdk9-maven3.5.x] fileExists
[Pipeline] [windows-jdk9-maven3.5.x] fileExists
[Pipeline] [windows-jdk9-maven3.5.x] archiveArtifacts
[windows-jdk8-maven3.5.x] [INFO]
[windows-jdk8-maven3.5.x] [INFO] --- maven-resources-plugin:3.1.0:testResources (default-testResources) @ surefire-junit-platform ---
[windows-jdk8-maven3.5.x] [INFO] Using 'UTF-8' encoding to copy filtered resources.
[windows-jdk8-maven3.5.x] [INFO] skip non existing resourceDirectory F:\jenkins\jenkins-slave\workspace\aven-surefire_SUREFIRE-1603-X2STNNZLDZLTM76TZU4UXX6QPWWXCVWMPJZ7GOLZSRHWQH6QBXRA@2\surefire-providers\surefire-junit-platform\src\test\resources
[windows-jdk8-maven3.5.x] [INFO] Copying 3 resources
[windows-jdk8-maven3.5.x] [INFO]
[windows-jdk8-maven3.5.x] [INFO] --- maven-compiler-plugin:3.7.0:testCompile (default-testCompile) @ surefire-junit-platform ---
[windows-jdk8-maven3.5.x] [INFO] Changes detected - recompiling the module!
[windows-jdk8-maven3.5.x] [INFO] Compiling 4 source files to F:\jenkins\jenkins-slave\workspace\aven-surefire_SUREFIRE-1603-X2STNNZLDZLTM76TZU4UXX6QPWWXCVWMPJZ7GOLZSRHWQH6QBXRA@2\surefire-providers\surefire-junit-platform\target\test-classes
[windows-jdk9-maven3.5.x] Archiving artifacts
[windows-jdk9-maven3.5.x] ‘*--windows-jdk9-maven3.5.x.zip’ doesn’t match anything
[windows-jdk9-maven3.5.x] No artifacts found that match the file pattern "*--windows-jdk9-maven3.5.x.zip". Configuration error?
[Pipeline] [windows-jdk9-maven3.5.x] }
[Pipeline] [windows-jdk9-maven3.5.x] // stage
[Pipeline] [windows-jdk9-maven3.5.x] stage
[Pipeline] [windows-jdk9-maven3.5.x] { (cleanup windows-jdk9-maven3.5.x)
[Pipeline] [windows-jdk9-maven3.5.x] cleanWs
[windows-jdk9-maven3.5.x] [WS-CLEANUP] Deleting project workspace...[WS-CLEANUP] done
[Pipeline] [windows-jdk9-maven3.5.x] }
[Pipeline] [windows-jdk9-maven3.5.x] // stage
[Pipeline] [windows-jdk9-maven3.5.x] }
[Pipeline] [windows-jdk9-maven3.5.x] // timestamps
[Pipeline] [windows-jdk9-maven3.5.x] }
[Pipeline] [windows-jdk9-maven3.5.x] // node
[Pipeline] [windows-jdk9-maven3.5.x] }
[windows-jdk9-maven3.5.x] Failed in branch windows-jdk9-maven3.5.x
[windows-jdk8-maven3.5.x] [INFO]
[windows-jdk8-maven3.5.x] [INFO] --- maven-surefire-plugin:2.12.4:test (default-test) @ surefire-junit-platform ---
[windows-jdk8-maven3.5.x] [INFO] Surefire report directory: F:\jenkins\jenkins-slave\workspace\aven-surefire_SUREFIRE-1603-X2STNNZLDZLTM76TZU4UXX6QPWWXCVWMPJZ7GOLZSRHWQH6QBXRA@2\surefire-providers\surefire-junit-platform\target\surefire-reports
[windows-jdk8-maven3.5.x] [INFO] Using configured provider org.apache.maven.surefire.shadefire.junit.JUnit3Provider
[windows-jdk8-maven3.5.x]
[windows-jdk8-maven3.5.x] -------------------------------------------------------
[windows-jdk8-maven3.5.x]  T E S T S
[windows-jdk8-maven3.5.x] -------------------------------------------------------
[windows-jdk8-maven3.5.x] Running org.apache.maven.surefire.junitplatform.JUnitPlatformProviderTest
[windows-jdk8-maven3.5.x] Tests run: 0, Failures: 0, Errors: 0, Skipped: 0, Time elapsed: 0.001 sec
[windows-jdk8-maven3.5.x] Running org.apache.maven.surefire.junitplatform.RunListenerAdapterTest
[windows-jdk8-maven3.5.x] Tests run: 0, Failures: 0, Errors: 0, Skipped: 0, Time elapsed: 0 sec
[windows-jdk8-maven3.5.x] Running org.apache.maven.surefire.junitplatform.TestMethodFilterTest
[windows-jdk8-maven3.5.x] Tests run: 0, Failures: 0, Errors: 0, Skipped: 0, Time elapsed: 0 sec
[windows-jdk8-maven3.5.x] Running org.apache.maven.surefire.junitplatform.TestPlanScannerFilterTest
[windows-jdk8-maven3.5.x] Tests run: 0, Failures: 0, Errors: 0, Skipped: 0, Time elapsed: 0 sec
[windows-jdk8-maven3.5.x]
[windows-jdk8-maven3.5.x] Results :
[windows-jdk8-maven3.5.x]
[windows-jdk8-maven3.5.x] Tests run: 0, Failures: 0, Errors: 0, Skipped: 0
[windows-jdk8-maven3.5.x]
[windows-jdk8-maven3.5.x] [INFO]
[windows-jdk8-maven3.5.x] [INFO] --- maven-jar-plugin:3.1.0:jar (default-jar) @ surefire-junit-platform ---
[windows-jdk8-maven3.5.x] [INFO] Building jar: F:\jenkins\jenkins-slave\workspace\aven-surefire_SUREFIRE-1603-X2STNNZLDZLTM76TZU4UXX6QPWWXCVWMPJZ7GOLZSRHWQH6QBXRA@2\surefire-providers\surefire-junit-platform\target\surefire-junit-platform-3.0.0-M2-SNAPSHOT.jar
[windows-jdk8-maven3.5.x] [INFO]
[windows-jdk8-maven3.5.x] [INFO] --- maven-site-plugin:3.7.1:attach-descriptor (attach-descriptor) @ surefire-junit-platform ---
[windows-jdk8-maven3.5.x] [INFO] Skipping because packaging 'jar' is not pom.
[windows-jdk8-maven3.5.x] [INFO]
[windows-jdk8-maven3.5.x] [INFO] --- maven-checkstyle-plugin:3.0.0:check (checkstyle-check) @ surefire-junit-platform ---
[windows-jdk8-maven3.5.x] [INFO] There are 2 errors reported by Checkstyle 6.18 with config/maven_checks.xml ruleset.
[windows-jdk8-maven3.5.x] [ERROR] src\main\java\org\apache\maven\surefire\junitplatform\RunListenerAdapter.java:[206,13] (whitespace) ParenPad: '(' is not followed by whitespace.
[windows-jdk8-maven3.5.x] [ERROR] src\main\java\org\apache\maven\surefire\junitplatform\RunListenerAdapter.java:[206,28] (whitespace) ParenPad: ')' is not preceded with whitespace.
[windows-jdk8-maven3.5.x] [INFO] ------------------------------------------------------------------------
[windows-jdk8-maven3.5.x] [INFO] Reactor Summary:
[windows-jdk8-maven3.5.x] [INFO]
[windows-jdk8-maven3.5.x] [INFO] Apache Maven Surefire .............................. SUCCESS [ 50.004 s]
[windows-jdk8-maven3.5.x] [INFO] SureFire Logger API ................................ SUCCESS [ 10.193 s]
[windows-jdk8-maven3.5.x] [INFO] SureFire API ....................................... SUCCESS [ 16.459 s]
[windows-jdk8-maven3.5.x] [INFO] SureFire Booter .................................... SUCCESS [ 18.458 s]
[windows-jdk8-maven3.5.x] [INFO] Maven Surefire Test-Grouping Support ............... SUCCESS [  9.632 s]
[windows-jdk8-maven3.5.x] [INFO] SureFire Providers ................................. SUCCESS [  1.342 s]
[windows-jdk8-maven3.5.x] [INFO] Shared JUnit3 Provider Code ........................ SUCCESS [  5.095 s]
[windows-jdk8-maven3.5.x] [INFO] Shared Java 5 Provider Base ........................ SUCCESS [  6.232 s]
[windows-jdk8-maven3.5.x] [INFO] Shared JUnit4 Provider Code ........................ SUCCESS [  7.239 s]
[windows-jdk8-maven3.5.x] [INFO] Shared JUnit48 Provider Code ....................... SUCCESS [  7.369 s]
[windows-jdk8-maven3.5.x] [INFO] SureFire JUnit Runner .............................. SUCCESS [  5.457 s]
[windows-jdk8-maven3.5.x] [INFO] SureFire JUnit4 Runner ............................. SUCCESS [  5.759 s]
[windows-jdk8-maven3.5.x] [INFO] Maven Surefire Common .............................. SUCCESS [ 33.938 s]
[windows-jdk8-maven3.5.x] [INFO] SureFire JUnitCore Runner .......................... SUCCESS [02:23 min]
[windows-jdk8-maven3.5.x] [INFO] SureFire JUnit Platform Runner ..................... FAILURE [ 10.381 s]
[windows-jdk8-maven3.5.x] [INFO] SureFire TestNG Utils .............................. SKIPPED
[windows-jdk8-maven3.5.x] [INFO] SureFire TestNG Runner ............................. SKIPPED
[windows-jdk8-maven3.5.x] [INFO] ShadeFire JUnit3 Provider .......................... SKIPPED
[windows-jdk8-maven3.5.x] [INFO] Surefire Report Parser ............................. SKIPPED
[windows-jdk8-maven3.5.x] [INFO] Maven Surefire Plugin .............................. SKIPPED
[windows-jdk8-maven3.5.x] [INFO] Maven Failsafe Plugin .............................. SKIPPED
[windows-jdk8-maven3.5.x] [INFO] Maven Surefire Report Plugin ....................... SKIPPED
[windows-jdk8-maven3.5.x] [INFO] Maven Surefire Integration Tests ................... SKIPPED
[windows-jdk8-maven3.5.x] [INFO] ------------------------------------------------------------------------
[windows-jdk8-maven3.5.x] [INFO] BUILD FAILURE
[windows-jdk8-maven3.5.x] [INFO] ------------------------------------------------------------------------
[windows-jdk8-maven3.5.x] [INFO] Total time: 05:33 min
[windows-jdk8-maven3.5.x] [INFO] Finished at: 2018-12-02T09:50:37-08:00
[windows-jdk8-maven3.5.x] [INFO] Final Memory: 39M/132M
[windows-jdk8-maven3.5.x] [INFO] ------------------------------------------------------------------------
[windows-jdk8-maven3.5.x] [ERROR] Failed to execute goal org.apache.maven.plugins:maven-checkstyle-plugin:3.0.0:check (checkstyle-check) on project surefire-junit-platform: You have 2 Checkstyle violations. -> [Help 1]
[windows-jdk8-maven3.5.x] org.apache.maven.lifecycle.LifecycleExecutionException: Failed to execute goal org.apache.maven.plugins:maven-checkstyle-plugin:3.0.0:check (checkstyle-check) on project surefire-junit-platform: You have 2 Checkstyle violations.
[windows-jdk8-maven3.5.x]     at org.apache.maven.lifecycle.internal.MojoExecutor.execute (MojoExecutor.java:213)
[windows-jdk8-maven3.5.x]     at org.apache.maven.lifecycle.internal.MojoExecutor.execute (MojoExecutor.java:154)
[windows-jdk8-maven3.5.x]     at org.apache.maven.lifecycle.internal.MojoExecutor.execute (MojoExecutor.java:146)
[windows-jdk8-maven3.5.x]     at org.apache.maven.lifecycle.internal.LifecycleModuleBuilder.buildProject (LifecycleModuleBuilder.java:117)
[windows-jdk8-maven3.5.x]     at org.apache.maven.lifecycle.internal.LifecycleModuleBuilder.buildProject (LifecycleModuleBuilder.java:81)
[windows-jdk8-maven3.5.x]     at org.apache.maven.lifecycle.internal.builder.singlethreaded.SingleThreadedBuilder.build (SingleThreadedBuilder.java:51)
[windows-jdk8-maven3.5.x]     at org.apache.maven.lifecycle.internal.LifecycleStarter.execute (LifecycleStarter.java:128)
[windows-jdk8-maven3.5.x]     at org.apache.maven.DefaultMaven.doExecute (DefaultMaven.java:309)
[windows-jdk8-maven3.5.x]     at org.apache.maven.DefaultMaven.doExecute (DefaultMaven.java:194)
[windows-jdk8-maven3.5.x]     at org.apache.maven.DefaultMaven.execute (DefaultMaven.java:107)
[windows-jdk8-maven3.5.x]     at org.apache.maven.cli.MavenCli.execute (MavenCli.java:955)
[windows-jdk8-maven3.5.x]     at org.apache.maven.cli.MavenCli.doMain (MavenCli.java:290)
[windows-jdk8-maven3.5.x]     at org.apache.maven.cli.MavenCli.main (MavenCli.java:194)
[windows-jdk8-maven3.5.x]     at sun.reflect.NativeMethodAccessorImpl.invoke0 (Native Method)
[windows-jdk8-maven3.5.x]     at sun.reflect.NativeMethodAccessorImpl.invoke (NativeMethodAccessorImpl.java:62)
[windows-jdk8-maven3.5.x]     at sun.reflect.DelegatingMethodAccessorImpl.invoke (DelegatingMethodAccessorImpl.java:43)
[windows-jdk8-maven3.5.x]     at java.lang.reflect.Method.invoke (Method.java:498)
[windows-jdk8-maven3.5.x]     at org.codehaus.plexus.classworlds.launcher.Launcher.launchEnhanced (Launcher.java:289)
[windows-jdk8-maven3.5.x]     at org.codehaus.plexus.classworlds.launcher.Launcher.launch (Launcher.java:229)
[windows-jdk8-maven3.5.x]     at org.codehaus.plexus.classworlds.launcher.Launcher.mainWithExitCode (Launcher.java:415)
[windows-jdk8-maven3.5.x]     at org.codehaus.plexus.classworlds.launcher.Launcher.main (Launcher.java:356)
[windows-jdk8-maven3.5.x] Caused by: org.apache.maven.plugin.MojoFailureException: You have 2 Checkstyle violations.
[windows-jdk8-maven3.5.x]     at org.apache.maven.plugins.checkstyle.CheckstyleViolationCheckMojo.execute (CheckstyleViolationCheckMojo.java:576)
[windows-jdk8-maven3.5.x]     at org.apache.maven.plugin.DefaultBuildPluginManager.executeMojo (DefaultBuildPluginManager.java:134)
[windows-jdk8-maven3.5.x]     at org.apache.maven.lifecycle.internal.MojoExecutor.execute (MojoExecutor.java:208)
[windows-jdk8-maven3.5.x]     at org.apache.maven.lifecycle.internal.MojoExecutor.execute (MojoExecutor.java:154)
[windows-jdk8-maven3.5.x]     at org.apache.maven.lifecycle.internal.MojoExecutor.execute (MojoExecutor.java:146)
[windows-jdk8-maven3.5.x]     at org.apache.maven.lifecycle.internal.LifecycleModuleBuilder.buildProject (LifecycleModuleBuilder.java:117)
[windows-jdk8-maven3.5.x]     at org.apache.maven.lifecycle.internal.LifecycleModuleBuilder.buildProject (LifecycleModuleBuilder.java:81)
[windows-jdk8-maven3.5.x]     at org.apache.maven.lifecycle.internal.builder.singlethreaded.SingleThreadedBuilder.build (SingleThreadedBuilder.java:51)
[windows-jdk8-maven3.5.x]     at org.apache.maven.lifecycle.internal.LifecycleStarter.execute (LifecycleStarter.java:128)
[windows-jdk8-maven3.5.x]     at org.apache.maven.DefaultMaven.doExecute (DefaultMaven.java:309)
[windows-jdk8-maven3.5.x]     at org.apache.maven.DefaultMaven.doExecute (DefaultMaven.java:194)
[windows-jdk8-maven3.5.x]     at org.apache.maven.DefaultMaven.execute (DefaultMaven.java:107)
[windows-jdk8-maven3.5.x]     at org.apache.maven.cli.MavenCli.execute (MavenCli.java:955)
[windows-jdk8-maven3.5.x]     at org.apache.maven.cli.MavenCli.doMain (MavenCli.java:290)
[windows-jdk8-maven3.5.x]     at org.apache.maven.cli.MavenCli.main (MavenCli.java:194)
[windows-jdk8-maven3.5.x]     at sun.reflect.NativeMethodAccessorImpl.invoke0 (Native Method)
[windows-jdk8-maven3.5.x]     at sun.reflect.NativeMethodAccessorImpl.invoke (NativeMethodAccessorImpl.java:62)
[windows-jdk8-maven3.5.x]     at sun.reflect.DelegatingMethodAccessorImpl.invoke (DelegatingMethodAccessorImpl.java:43)
[windows-jdk8-maven3.5.x]     at java.lang.reflect.Method.invoke (Method.java:498)
[windows-jdk8-maven3.5.x]     at org.codehaus.plexus.classworlds.launcher.Launcher.launchEnhanced (Launcher.java:289)
[windows-jdk8-maven3.5.x]     at org.codehaus.plexus.classworlds.launcher.Launcher.launch (Launcher.java:229)
[windows-jdk8-maven3.5.x]     at org.codehaus.plexus.classworlds.launcher.Launcher.mainWithExitCode (Launcher.java:415)
[windows-jdk8-maven3.5.x]     at org.codehaus.plexus.classworlds.launcher.Launcher.main (Launcher.java:356)
[windows-jdk8-maven3.5.x] [ERROR]
[windows-jdk8-maven3.5.x] [ERROR] Re-run Maven using the -X switch to enable full debug logging.
[windows-jdk8-maven3.5.x] [ERROR]
[windows-jdk8-maven3.5.x] [ERROR] For more information about the errors and possible solutions, please read the following articles:
[windows-jdk8-maven3.5.x] [ERROR] [Help 1] http://cwiki.apache.org/confluence/display/MAVEN/MojoFailureException
[windows-jdk8-maven3.5.x] [ERROR]
[windows-jdk8-maven3.5.x] [ERROR] After correcting the problems, you can resume the build with the command
[windows-jdk8-maven3.5.x] [ERROR]   mvn <goals> -rf :surefire-junit-platform
[Pipeline] [windows-jdk8-maven3.5.x] }
[Pipeline] [windows-jdk8-maven3.5.x] // withEnv
[Pipeline] [windows-jdk8-maven3.5.x] }
[Pipeline] [windows-jdk8-maven3.5.x] // stage
[Pipeline] [windows-jdk8-maven3.5.x] stage
[Pipeline] [windows-jdk8-maven3.5.x] { (reporting windows-jdk8-maven3.5.x)
[Pipeline] [windows-jdk8-maven3.5.x] fileExists
[Pipeline] [windows-jdk8-maven3.5.x] fileExists
[Pipeline] [windows-jdk8-maven3.5.x] archiveArtifacts
[windows-jdk8-maven3.5.x] Archiving artifacts
[windows-jdk8-maven3.5.x] ‘*--windows-jdk8-maven3.5.x.zip’ doesn’t match anything
[windows-jdk8-maven3.5.x] No artifacts found that match the file pattern "*--windows-jdk8-maven3.5.x.zip". Configuration error?
[Pipeline] [windows-jdk8-maven3.5.x] }
[Pipeline] [windows-jdk8-maven3.5.x] // stage
[Pipeline] [windows-jdk8-maven3.5.x] stage
[Pipeline] [windows-jdk8-maven3.5.x] { (cleanup windows-jdk8-maven3.5.x)
[Pipeline] [windows-jdk8-maven3.5.x] cleanWs
[windows-jdk8-maven3.5.x] [WS-CLEANUP] Deleting project workspace...[WS-CLEANUP] done
[Pipeline] [windows-jdk8-maven3.5.x] }
[Pipeline] [windows-jdk8-maven3.5.x] // stage
[Pipeline] [windows-jdk8-maven3.5.x] }
[Pipeline] [windows-jdk8-maven3.5.x] // timestamps
[Pipeline] [windows-jdk8-maven3.5.x] }
[Pipeline] [windows-jdk8-maven3.5.x] // node
[Pipeline] [windows-jdk8-maven3.5.x] }
[windows-jdk8-maven3.5.x] Failed in branch windows-jdk8-maven3.5.x
[Pipeline] // parallel
[Pipeline] echo
hudson.AbortException: hudson.AbortException: script returned exit code 1
[Pipeline] stage
[Pipeline] { (notifications)
[Pipeline] echo
Build result: FAILURE
[Pipeline] jiraIssueSelector
[Pipeline] emailext
Reply | Threaded
Open this post in threaded view
|

Build failed in Jenkins: Maven TLP » maven-surefire » SUREFIRE-1603 #2

Apache Jenkins Server-2
See https://builds.apache.org/job/maven-box/job/maven-surefire/job/SUREFIRE-1603/2/

Changes:

* Add JDK 11 for building components.
* Drop Java 9 and 10 from default
* Drop Java 9 and 10 from default
* Should have removed 10 instead of 8

All tests passed

Build log:
[...truncated 10.82 MB...]
[windows-jdk8-maven3.5.x] [INFO] Downloading from central: https://repo.maven.apache.org/maven2/org/assertj/assertj-parent-pom/2.1.9/assertj-parent-pom-2.1.9.pom
[windows-jdk8-maven3.5.x] [INFO] Downloaded from central: https://repo.maven.apache.org/maven2/org/assertj/assertj-parent-pom/2.1.9/assertj-parent-pom-2.1.9.pom (15 kB at 553 kB/s)
[windows-jdk8-maven3.5.x] [INFO] Downloading from central: https://repo.maven.apache.org/maven2/org/junit/platform/junit-platform-launcher/1.3.1/junit-platform-launcher-1.3.1.jar
[windows-jdk8-maven3.5.x] [INFO] Downloading from central: https://repo.maven.apache.org/maven2/org/junit/platform/junit-platform-commons/1.3.1/junit-platform-commons-1.3.1.jar
[windows-jdk8-maven3.5.x] [INFO] Downloading from central: https://repo.maven.apache.org/maven2/org/junit/platform/junit-platform-engine/1.3.1/junit-platform-engine-1.3.1.jar
[windows-jdk8-maven3.5.x] [INFO] Downloading from central: https://repo.maven.apache.org/maven2/org/opentest4j/opentest4j/1.1.1/opentest4j-1.1.1.jar
[windows-jdk8-maven3.5.x] [INFO] Downloading from central: https://repo.maven.apache.org/maven2/org/apiguardian/apiguardian-api/1.0.0/apiguardian-api-1.0.0.jar
[windows-jdk8-maven3.5.x] [INFO] Downloaded from central: https://repo.maven.apache.org/maven2/org/apiguardian/apiguardian-api/1.0.0/apiguardian-api-1.0.0.jar (2.2 kB at 75 kB/s)
[windows-jdk8-maven3.5.x] [INFO] Downloading from central: https://repo.maven.apache.org/maven2/org/junit/jupiter/junit-jupiter-engine/5.3.1/junit-jupiter-engine-5.3.1.jar
[windows-jdk8-maven3.5.x] [INFO] Downloaded from central: https://repo.maven.apache.org/maven2/org/opentest4j/opentest4j/1.1.1/opentest4j-1.1.1.jar (7.1 kB at 237 kB/s)
[windows-jdk8-maven3.5.x] [INFO] Downloading from central: https://repo.maven.apache.org/maven2/org/junit/jupiter/junit-jupiter-api/5.3.1/junit-jupiter-api-5.3.1.jar
[windows-jdk8-maven3.5.x] [INFO] Downloaded from central: https://repo.maven.apache.org/maven2/org/junit/platform/junit-platform-launcher/1.3.1/junit-platform-launcher-1.3.1.jar (95 kB at 2.7 MB/s)
[windows-jdk8-maven3.5.x] [INFO] Downloading from central: https://repo.maven.apache.org/maven2/org/assertj/assertj-core/3.9.1/assertj-core-3.9.1.jar
[windows-jdk8-maven3.5.x] [INFO] Downloaded from central: https://repo.maven.apache.org/maven2/org/junit/platform/junit-platform-commons/1.3.1/junit-platform-commons-1.3.1.jar (78 kB at 1.8 MB/s)
[windows-jdk8-maven3.5.x] [INFO] Downloaded from central: https://repo.maven.apache.org/maven2/org/junit/platform/junit-platform-engine/1.3.1/junit-platform-engine-1.3.1.jar (135 kB at 2.6 MB/s)
[windows-jdk8-maven3.5.x] [INFO] Downloaded from central: https://repo.maven.apache.org/maven2/org/junit/jupiter/junit-jupiter-engine/5.3.1/junit-jupiter-engine-5.3.1.jar (150 kB at 2.5 MB/s)
[windows-jdk8-maven3.5.x] [INFO] Downloaded from central: https://repo.maven.apache.org/maven2/org/junit/jupiter/junit-jupiter-api/5.3.1/junit-jupiter-api-5.3.1.jar (115 kB at 1.6 MB/s)
[windows-jdk8-maven3.5.x] [INFO] Downloaded from central: https://repo.maven.apache.org/maven2/org/assertj/assertj-core/3.9.1/assertj-core-3.9.1.jar (3.9 MB at 7.8 MB/s)
[windows-jdk8-maven3.5.x] [INFO]
[windows-jdk8-maven3.5.x] [INFO] --- maven-clean-plugin:3.1.0:clean (default-clean) @ surefire-junit-platform ---
[windows-jdk8-maven3.5.x] [INFO]
[windows-jdk8-maven3.5.x] [INFO] --- maven-enforcer-plugin:3.0.0-M2:enforce (enforce-maven-version) @ surefire-junit-platform ---
[windows-jdk8-maven3.5.x] [INFO]
[windows-jdk8-maven3.5.x] [INFO] --- maven-enforcer-plugin:3.0.0-M2:enforce (enforce-bytecode-version) @ surefire-junit-platform ---
[windows-jdk8-maven3.5.x] [INFO]
[windows-jdk8-maven3.5.x] [INFO] --- maven-enforcer-plugin:3.0.0-M2:enforce (ban-known-bad-maven-versions) @ surefire-junit-platform ---
[windows-jdk8-maven3.5.x] [INFO]
[windows-jdk8-maven3.5.x] [INFO] --- maven-enforcer-plugin:3.0.0-M2:enforce (enforce-java) @ surefire-junit-platform ---
[windows-jdk8-maven3.5.x] [INFO]
[windows-jdk8-maven3.5.x] [INFO] --- maven-enforcer-plugin:3.0.0-M2:enforce (enforce-maven) @ surefire-junit-platform ---
[windows-jdk8-maven3.5.x] [INFO]
[windows-jdk8-maven3.5.x] [INFO] --- apache-rat-plugin:0.12:check (rat-check) @ surefire-junit-platform ---
[windows-jdk8-maven3.5.x] [INFO] Enabled default license matchers.
[windows-jdk8-maven3.5.x] [INFO] Will parse SCM ignores for exclusions...
[windows-jdk8-maven3.5.x] [INFO] Finished adding exclusions from SCM ignore files.
[windows-jdk8-maven3.5.x] [INFO] 61 implicit excludes (use -debug for more details).
[windows-jdk8-maven3.5.x] [INFO] Exclude: .repository/**
[windows-jdk8-maven3.5.x] [INFO] Exclude: .maven/spy.log
[windows-jdk8-maven3.5.x] [INFO] Exclude: dependency-reduced-pom.xml
[windows-jdk8-maven3.5.x] [INFO] Exclude: .java-version
[windows-jdk8-maven3.5.x] [INFO] Exclude: Jenkinsfile
[windows-jdk8-maven3.5.x] [INFO] Exclude: README.md
[windows-jdk8-maven3.5.x] [INFO] Exclude: .gitignore
[windows-jdk8-maven3.5.x] [INFO] Exclude: .git/**/*
[windows-jdk8-maven3.5.x] [INFO] Exclude: **/.idea
[windows-jdk8-maven3.5.x] [INFO] Exclude: **/.svn/**/*
[windows-jdk8-maven3.5.x] [INFO] Exclude: **/*.iml
[windows-jdk8-maven3.5.x] [INFO] Exclude: **/*.ipr
[windows-jdk8-maven3.5.x] [INFO] Exclude: **/*.iws
[windows-jdk8-maven3.5.x] [INFO] Exclude: **/*.versionsBackup
[windows-jdk8-maven3.5.x] [INFO] Exclude: **/dependency-reduced-pom.xml
[windows-jdk8-maven3.5.x] [INFO] Exclude: .repository/**
[windows-jdk8-maven3.5.x] [INFO] Exclude: src/test/resources/**/*
[windows-jdk8-maven3.5.x] [INFO] Exclude: src/test/resources/**/*.css
[windows-jdk8-maven3.5.x] [INFO] Exclude: **/*.jj
[windows-jdk8-maven3.5.x] [INFO] Exclude: src/main/resources/META-INF/services/org.apache.maven.surefire.providerapi.SurefireProvider
[windows-jdk8-maven3.5.x] [INFO] Exclude: DEPENDENCIES
[windows-jdk8-maven3.5.x] [INFO] Exclude: .m2/**
[windows-jdk8-maven3.5.x] [INFO] Exclude: .m2
[windows-jdk8-maven3.5.x] [INFO] Exclude: .travis.yml
[windows-jdk8-maven3.5.x] [INFO] 9 resources included (use -debug for more details)
[windows-jdk8-maven3.5.x] [INFO] Rat check: Summary over all files. Unapproved: 0, unknown: 0, generated: 0, approved: 9 licenses.
[windows-jdk8-maven3.5.x] [INFO]
[windows-jdk8-maven3.5.x] [INFO] --- jacoco-maven-plugin:0.8.2:prepare-agent (jacoco-agent) @ surefire-junit-platform ---
[windows-jdk8-maven3.5.x] [INFO] Skipping JaCoCo execution because property jacoco.skip is set.
[windows-jdk8-maven3.5.x] [INFO] jacoco.agent set to empty
[windows-jdk8-maven3.5.x] [INFO]
[windows-jdk8-maven3.5.x] [INFO] --- maven-compiler-plugin:3.7.0:compile (compile-generated) @ surefire-junit-platform ---
[windows-jdk8-maven3.5.x] [INFO] Nothing to compile - all classes are up to date
[windows-jdk8-maven3.5.x] [INFO]
[windows-jdk8-maven3.5.x] [INFO] --- maven-remote-resources-plugin:1.5:process (process-resource-bundles) @ surefire-junit-platform ---
[windows-jdk8-maven3.5.x] [INFO]
[windows-jdk8-maven3.5.x] [INFO] --- maven-resources-plugin:3.1.0:resources (default-resources) @ surefire-junit-platform ---
[windows-jdk8-maven3.5.x] [INFO] Using 'UTF-8' encoding to copy filtered resources.
[windows-jdk8-maven3.5.x] [INFO] Copying 1 resource
[windows-jdk8-maven3.5.x] [INFO] Copying 3 resources
[windows-jdk8-maven3.5.x] [INFO]
[windows-jdk8-maven3.5.x] [INFO] --- maven-compiler-plugin:3.7.0:compile (default-compile) @ surefire-junit-platform ---
[windows-jdk8-maven3.5.x] [INFO] Changes detected - recompiling the module!
[windows-jdk8-maven3.5.x] [INFO] Compiling 4 source files to F:\jenkins\jenkins-slave\workspace\aven-surefire_SUREFIRE-1603-X2STNNZLDZLTM76TZU4UXX6QPWWXCVWMPJZ7GOLZSRHWQH6QBXRA\surefire-providers\surefire-junit-platform\target\classes
[windows-jdk8-maven3.5.x] [INFO]
[windows-jdk8-maven3.5.x] [INFO] --- animal-sniffer-maven-plugin:1.17:check (signature-check) @ surefire-junit-platform ---
[windows-jdk8-maven3.5.x] [INFO] Checking unresolved references to org.codehaus.mojo.signature:java18:1.0
[windows-jdk8-maven3.5.x] [INFO] Downloading from central: https://repo.maven.apache.org/maven2/org/codehaus/mojo/signature/java18/1.0/java18-1.0.signature
[windows-jdk8-maven3.5.x] [INFO] Downloaded from central: https://repo.maven.apache.org/maven2/org/codehaus/mojo/signature/java18/1.0/java18-1.0.signature (2.0 MB at 10 MB/s)
[windows-jdk8-maven3.5.x] [INFO]
[windows-jdk8-maven3.5.x] [INFO] --- maven-resources-plugin:3.1.0:testResources (default-testResources) @ surefire-junit-platform ---
[windows-jdk8-maven3.5.x] [INFO] Using 'UTF-8' encoding to copy filtered resources.
[windows-jdk8-maven3.5.x] [INFO] skip non existing resourceDirectory F:\jenkins\jenkins-slave\workspace\aven-surefire_SUREFIRE-1603-X2STNNZLDZLTM76TZU4UXX6QPWWXCVWMPJZ7GOLZSRHWQH6QBXRA\surefire-providers\surefire-junit-platform\src\test\resources
[windows-jdk8-maven3.5.x] [INFO] Copying 3 resources
[windows-jdk8-maven3.5.x] [INFO]
[windows-jdk8-maven3.5.x] [INFO] --- maven-compiler-plugin:3.7.0:testCompile (default-testCompile) @ surefire-junit-platform ---
[windows-jdk8-maven3.5.x] [INFO] Changes detected - recompiling the module!
[windows-jdk8-maven3.5.x] [INFO] Compiling 4 source files to F:\jenkins\jenkins-slave\workspace\aven-surefire_SUREFIRE-1603-X2STNNZLDZLTM76TZU4UXX6QPWWXCVWMPJZ7GOLZSRHWQH6QBXRA\surefire-providers\surefire-junit-platform\target\test-classes
[windows-jdk8-maven3.5.x] [INFO]
[windows-jdk8-maven3.5.x] [INFO] --- maven-surefire-plugin:2.12.4:test (default-test) @ surefire-junit-platform ---
[windows-jdk8-maven3.5.x] [INFO] Surefire report directory: F:\jenkins\jenkins-slave\workspace\aven-surefire_SUREFIRE-1603-X2STNNZLDZLTM76TZU4UXX6QPWWXCVWMPJZ7GOLZSRHWQH6QBXRA\surefire-providers\surefire-junit-platform\target\surefire-reports
[windows-jdk8-maven3.5.x] [INFO] Using configured provider org.apache.maven.surefire.shadefire.junit.JUnit3Provider
[windows-jdk8-maven3.5.x]
[windows-jdk8-maven3.5.x] -------------------------------------------------------
[windows-jdk8-maven3.5.x]  T E S T S
[windows-jdk8-maven3.5.x] -------------------------------------------------------
[windows-jdk8-maven3.5.x] Running org.apache.maven.surefire.junitplatform.JUnitPlatformProviderTest
[windows-jdk8-maven3.5.x] Tests run: 0, Failures: 0, Errors: 0, Skipped: 0, Time elapsed: 0 sec
[windows-jdk8-maven3.5.x] Running org.apache.maven.surefire.junitplatform.RunListenerAdapterTest
[windows-jdk8-maven3.5.x] Tests run: 0, Failures: 0, Errors: 0, Skipped: 0, Time elapsed: 0 sec
[windows-jdk8-maven3.5.x] Running org.apache.maven.surefire.junitplatform.TestMethodFilterTest
[windows-jdk8-maven3.5.x] Tests run: 0, Failures: 0, Errors: 0, Skipped: 0, Time elapsed: 0 sec
[windows-jdk8-maven3.5.x] Running org.apache.maven.surefire.junitplatform.TestPlanScannerFilterTest
[windows-jdk8-maven3.5.x] Tests run: 0, Failures: 0, Errors: 0, Skipped: 0, Time elapsed: 0 sec
[windows-jdk8-maven3.5.x]
[windows-jdk8-maven3.5.x] Results :
[windows-jdk8-maven3.5.x]
[windows-jdk8-maven3.5.x] Tests run: 0, Failures: 0, Errors: 0, Skipped: 0
[windows-jdk8-maven3.5.x]
[windows-jdk8-maven3.5.x] [INFO]
[windows-jdk8-maven3.5.x] [INFO] --- maven-jar-plugin:3.1.0:jar (default-jar) @ surefire-junit-platform ---
[windows-jdk8-maven3.5.x] [INFO] Building jar: F:\jenkins\jenkins-slave\workspace\aven-surefire_SUREFIRE-1603-X2STNNZLDZLTM76TZU4UXX6QPWWXCVWMPJZ7GOLZSRHWQH6QBXRA\surefire-providers\surefire-junit-platform\target\surefire-junit-platform-3.0.0-M2-SNAPSHOT.jar
[windows-jdk8-maven3.5.x] [INFO]
[windows-jdk8-maven3.5.x] [INFO] --- maven-site-plugin:3.7.1:attach-descriptor (attach-descriptor) @ surefire-junit-platform ---
[windows-jdk8-maven3.5.x] [INFO] Skipping because packaging 'jar' is not pom.
[windows-jdk8-maven3.5.x] [INFO]
[windows-jdk8-maven3.5.x] [INFO] --- maven-checkstyle-plugin:3.0.0:check (checkstyle-check) @ surefire-junit-platform ---
[windows-jdk8-maven3.5.x] [INFO] There are 2 errors reported by Checkstyle 6.18 with config/maven_checks.xml ruleset.
[windows-jdk8-maven3.5.x] [ERROR] src\main\java\org\apache\maven\surefire\junitplatform\RunListenerAdapter.java:[206,13] (whitespace) ParenPad: '(' is not followed by whitespace.
[windows-jdk8-maven3.5.x] [ERROR] src\main\java\org\apache\maven\surefire\junitplatform\RunListenerAdapter.java:[206,28] (whitespace) ParenPad: ')' is not preceded with whitespace.
[windows-jdk8-maven3.5.x] [INFO] ------------------------------------------------------------------------
[windows-jdk8-maven3.5.x] [INFO] Reactor Summary:
[windows-jdk8-maven3.5.x] [INFO]
[windows-jdk8-maven3.5.x] [INFO] Apache Maven Surefire .............................. SUCCESS [ 27.053 s]
[windows-jdk8-maven3.5.x] [INFO] SureFire Logger API ................................ SUCCESS [  6.649 s]
[windows-jdk8-maven3.5.x] [INFO] SureFire API ....................................... SUCCESS [ 12.423 s]
[windows-jdk8-maven3.5.x] [INFO] SureFire Booter .................................... SUCCESS [ 15.230 s]
[windows-jdk8-maven3.5.x] [INFO] Maven Surefire Test-Grouping Support ............... SUCCESS [  8.082 s]
[windows-jdk8-maven3.5.x] [INFO] SureFire Providers ................................. SUCCESS [  1.461 s]
[windows-jdk8-maven3.5.x] [INFO] Shared JUnit3 Provider Code ........................ SUCCESS [  5.291 s]
[windows-jdk8-maven3.5.x] [INFO] Shared Java 5 Provider Base ........................ SUCCESS [  5.907 s]
[windows-jdk8-maven3.5.x] [INFO] Shared JUnit4 Provider Code ........................ SUCCESS [  6.468 s]
[windows-jdk8-maven3.5.x] [INFO] Shared JUnit48 Provider Code ....................... SUCCESS [  7.339 s]
[windows-jdk8-maven3.5.x] [INFO] SureFire JUnit Runner .............................. SUCCESS [  5.474 s]
[windows-jdk8-maven3.5.x] [INFO] SureFire JUnit4 Runner ............................. SUCCESS [  6.614 s]
[windows-jdk8-maven3.5.x] [INFO] Maven Surefire Common .............................. SUCCESS [ 32.508 s]
[windows-jdk8-maven3.5.x] [INFO] SureFire JUnitCore Runner .......................... SUCCESS [02:11 min]
[windows-jdk8-maven3.5.x] [INFO] SureFire JUnit Platform Runner ..................... FAILURE [  9.668 s]
[windows-jdk8-maven3.5.x] [INFO] SureFire TestNG Utils .............................. SKIPPED
[windows-jdk8-maven3.5.x] [INFO] SureFire TestNG Runner ............................. SKIPPED
[windows-jdk8-maven3.5.x] [INFO] ShadeFire JUnit3 Provider .......................... SKIPPED
[windows-jdk8-maven3.5.x] [INFO] Surefire Report Parser ............................. SKIPPED
[windows-jdk8-maven3.5.x] [INFO] Maven Surefire Plugin .............................. SKIPPED
[windows-jdk8-maven3.5.x] [INFO] Maven Failsafe Plugin .............................. SKIPPED
[windows-jdk8-maven3.5.x] [INFO] Maven Surefire Report Plugin ....................... SKIPPED
[windows-jdk8-maven3.5.x] [INFO] Maven Surefire Integration Tests ................... SKIPPED
[windows-jdk8-maven3.5.x] [INFO] ------------------------------------------------------------------------
[windows-jdk8-maven3.5.x] [INFO] BUILD FAILURE
[windows-jdk8-maven3.5.x] [INFO] ------------------------------------------------------------------------
[windows-jdk8-maven3.5.x] [INFO] Total time: 04:43 min
[windows-jdk8-maven3.5.x] [INFO] Finished at: 2018-12-26T11:45:18Z
[windows-jdk8-maven3.5.x] [INFO] Final Memory: 40M/133M
[windows-jdk8-maven3.5.x] [INFO] ------------------------------------------------------------------------
[windows-jdk8-maven3.5.x] [ERROR] Failed to execute goal org.apache.maven.plugins:maven-checkstyle-plugin:3.0.0:check (checkstyle-check) on project surefire-junit-platform: You have 2 Checkstyle violations. -> [Help 1]
[windows-jdk8-maven3.5.x] org.apache.maven.lifecycle.LifecycleExecutionException: Failed to execute goal org.apache.maven.plugins:maven-checkstyle-plugin:3.0.0:check (checkstyle-check) on project surefire-junit-platform: You have 2 Checkstyle violations.
[windows-jdk8-maven3.5.x]     at org.apache.maven.lifecycle.internal.MojoExecutor.execute (MojoExecutor.java:213)
[windows-jdk8-maven3.5.x]     at org.apache.maven.lifecycle.internal.MojoExecutor.execute (MojoExecutor.java:154)
[windows-jdk8-maven3.5.x]     at org.apache.maven.lifecycle.internal.MojoExecutor.execute (MojoExecutor.java:146)
[windows-jdk8-maven3.5.x]     at org.apache.maven.lifecycle.internal.LifecycleModuleBuilder.buildProject (LifecycleModuleBuilder.java:117)
[windows-jdk8-maven3.5.x]     at org.apache.maven.lifecycle.internal.LifecycleModuleBuilder.buildProject (LifecycleModuleBuilder.java:81)
[windows-jdk8-maven3.5.x]     at org.apache.maven.lifecycle.internal.builder.singlethreaded.SingleThreadedBuilder.build (SingleThreadedBuilder.java:51)
[windows-jdk8-maven3.5.x]     at org.apache.maven.lifecycle.internal.LifecycleStarter.execute (LifecycleStarter.java:128)
[windows-jdk8-maven3.5.x]     at org.apache.maven.DefaultMaven.doExecute (DefaultMaven.java:309)
[windows-jdk8-maven3.5.x]     at org.apache.maven.DefaultMaven.doExecute (DefaultMaven.java:194)
[windows-jdk8-maven3.5.x]     at org.apache.maven.DefaultMaven.execute (DefaultMaven.java:107)
[windows-jdk8-maven3.5.x]     at org.apache.maven.cli.MavenCli.execute (MavenCli.java:955)
[windows-jdk8-maven3.5.x]     at org.apache.maven.cli.MavenCli.doMain (MavenCli.java:290)
[windows-jdk8-maven3.5.x]     at org.apache.maven.cli.MavenCli.main (MavenCli.java:194)
[windows-jdk8-maven3.5.x]     at sun.reflect.NativeMethodAccessorImpl.invoke0 (Native Method)
[windows-jdk8-maven3.5.x]     at sun.reflect.NativeMethodAccessorImpl.invoke (NativeMethodAccessorImpl.java:62)
[windows-jdk8-maven3.5.x]     at sun.reflect.DelegatingMethodAccessorImpl.invoke (DelegatingMethodAccessorImpl.java:43)
[windows-jdk8-maven3.5.x]     at java.lang.reflect.Method.invoke (Method.java:498)
[windows-jdk8-maven3.5.x]     at org.codehaus.plexus.classworlds.launcher.Launcher.launchEnhanced (Launcher.java:289)
[windows-jdk8-maven3.5.x]     at org.codehaus.plexus.classworlds.launcher.Launcher.launch (Launcher.java:229)
[windows-jdk8-maven3.5.x]     at org.codehaus.plexus.classworlds.launcher.Launcher.mainWithExitCode (Launcher.java:415)
[windows-jdk8-maven3.5.x]     at org.codehaus.plexus.classworlds.launcher.Launcher.main (Launcher.java:356)
[windows-jdk8-maven3.5.x] Caused by: org.apache.maven.plugin.MojoFailureException: You have 2 Checkstyle violations.
[windows-jdk8-maven3.5.x]     at org.apache.maven.plugins.checkstyle.CheckstyleViolationCheckMojo.execute (CheckstyleViolationCheckMojo.java:576)
[windows-jdk8-maven3.5.x]     at org.apache.maven.plugin.DefaultBuildPluginManager.executeMojo (DefaultBuildPluginManager.java:134)
[windows-jdk8-maven3.5.x]     at org.apache.maven.lifecycle.internal.MojoExecutor.execute (MojoExecutor.java:208)
[windows-jdk8-maven3.5.x]     at org.apache.maven.lifecycle.internal.MojoExecutor.execute (MojoExecutor.java:154)
[windows-jdk8-maven3.5.x]     at org.apache.maven.lifecycle.internal.MojoExecutor.execute (MojoExecutor.java:146)
[windows-jdk8-maven3.5.x]     at org.apache.maven.lifecycle.internal.LifecycleModuleBuilder.buildProject (LifecycleModuleBuilder.java:117)
[windows-jdk8-maven3.5.x]     at org.apache.maven.lifecycle.internal.LifecycleModuleBuilder.buildProject (LifecycleModuleBuilder.java:81)
[windows-jdk8-maven3.5.x]     at org.apache.maven.lifecycle.internal.builder.singlethreaded.SingleThreadedBuilder.build (SingleThreadedBuilder.java:51)
[windows-jdk8-maven3.5.x]     at org.apache.maven.lifecycle.internal.LifecycleStarter.execute (LifecycleStarter.java:128)
[windows-jdk8-maven3.5.x]     at org.apache.maven.DefaultMaven.doExecute (DefaultMaven.java:309)
[windows-jdk8-maven3.5.x]     at org.apache.maven.DefaultMaven.doExecute (DefaultMaven.java:194)
[windows-jdk8-maven3.5.x]     at org.apache.maven.DefaultMaven.execute (DefaultMaven.java:107)
[windows-jdk8-maven3.5.x]     at org.apache.maven.cli.MavenCli.execute (MavenCli.java:955)
[windows-jdk8-maven3.5.x]     at org.apache.maven.cli.MavenCli.doMain (MavenCli.java:290)
[windows-jdk8-maven3.5.x]     at org.apache.maven.cli.MavenCli.main (MavenCli.java:194)
[windows-jdk8-maven3.5.x]     at sun.reflect.NativeMethodAccessorImpl.invoke0 (Native Method)
[windows-jdk8-maven3.5.x]     at sun.reflect.NativeMethodAccessorImpl.invoke (NativeMethodAccessorImpl.java:62)
[windows-jdk8-maven3.5.x]     at sun.reflect.DelegatingMethodAccessorImpl.invoke (DelegatingMethodAccessorImpl.java:43)
[windows-jdk8-maven3.5.x]     at java.lang.reflect.Method.invoke (Method.java:498)
[windows-jdk8-maven3.5.x]     at org.codehaus.plexus.classworlds.launcher.Launcher.launchEnhanced (Launcher.java:289)
[windows-jdk8-maven3.5.x]     at org.codehaus.plexus.classworlds.launcher.Launcher.launch (Launcher.java:229)
[windows-jdk8-maven3.5.x]     at org.codehaus.plexus.classworlds.launcher.Launcher.mainWithExitCode (Launcher.java:415)
[windows-jdk8-maven3.5.x]     at org.codehaus.plexus.classworlds.launcher.Launcher.main (Launcher.java:356)
[windows-jdk8-maven3.5.x] [ERROR]
[windows-jdk8-maven3.5.x] [ERROR] Re-run Maven using the -X switch to enable full debug logging.
[windows-jdk8-maven3.5.x] [ERROR]
[windows-jdk8-maven3.5.x] [ERROR] For more information about the errors and possible solutions, please read the following articles:
[windows-jdk8-maven3.5.x] [ERROR] [Help 1] http://cwiki.apache.org/confluence/display/MAVEN/MojoFailureException
[windows-jdk8-maven3.5.x] [ERROR]
[windows-jdk8-maven3.5.x] [ERROR] After correcting the problems, you can resume the build with the command
[windows-jdk8-maven3.5.x] [ERROR]   mvn <goals> -rf :surefire-junit-platform
[Pipeline] [windows-jdk8-maven3.5.x] }
[Pipeline] [windows-jdk8-maven3.5.x] // withEnv
[Pipeline] [windows-jdk8-maven3.5.x] }
[Pipeline] [windows-jdk8-maven3.5.x] // stage
[Pipeline] [windows-jdk8-maven3.5.x] stage
[Pipeline] [windows-jdk8-maven3.5.x] { (reporting windows-jdk8-maven3.5.x)
[Pipeline] [windows-jdk8-maven3.5.x] fileExists
[Pipeline] [windows-jdk8-maven3.5.x] fileExists
[Pipeline] [windows-jdk8-maven3.5.x] archiveArtifacts
[windows-jdk8-maven3.5.x] Archiving artifacts
[windows-jdk8-maven3.5.x] ‘*--windows-jdk8-maven3.5.x.zip’ doesn’t match anything
[windows-jdk8-maven3.5.x] No artifacts found that match the file pattern "*--windows-jdk8-maven3.5.x.zip". Configuration error?
[Pipeline] [windows-jdk8-maven3.5.x] }
[Pipeline] [windows-jdk8-maven3.5.x] // stage
[Pipeline] [windows-jdk8-maven3.5.x] stage
[Pipeline] [windows-jdk8-maven3.5.x] { (cleanup windows-jdk8-maven3.5.x)
[Pipeline] [windows-jdk8-maven3.5.x] cleanWs
[windows-jdk8-maven3.5.x] [WS-CLEANUP] Deleting project workspace...[WS-CLEANUP] done
[Pipeline] [windows-jdk8-maven3.5.x] }
[Pipeline] [windows-jdk8-maven3.5.x] // stage
[Pipeline] [windows-jdk8-maven3.5.x] }
[Pipeline] [windows-jdk8-maven3.5.x] // timestamps
[Pipeline] [windows-jdk8-maven3.5.x] }
[Pipeline] [windows-jdk8-maven3.5.x] // node
[Pipeline] [windows-jdk8-maven3.5.x] }
[windows-jdk8-maven3.5.x] Failed in branch windows-jdk8-maven3.5.x
[Pipeline] // parallel
[Pipeline] echo
hudson.AbortException: hudson.AbortException: script returned exit code 1
[Pipeline] stage
[Pipeline] { (notifications)
[Pipeline] echo
Build result: FAILURE
[Pipeline] jiraIssueSelector
[Pipeline] emailext
Reply | Threaded
Open this post in threaded view
|

Build failed in Jenkins: Maven TLP » maven-surefire » SUREFIRE-1603 #3

Apache Jenkins Server-2
See https://builds.apache.org/job/maven-box/job/maven-surefire/job/SUREFIRE-1603/3/

Changes:

* Removed exclusion for problematic node cause the node is back online.
* reduce the history archiving
* reduce the history archiving
* increase a bit archiving
* increase a bit archiving
* Activate sonarqube on first project
* Disable sonar:sonar for now
* use publisherStrategy: 'EXPLICIT' to avoid non used publishers
* [INFRA-17514] Fix file separator + add other locations for workspaces
* fix indent
* use a special local repo to have a bit of caching

All tests passed

Build log:
[...truncated 10.87 MB...]
[windows-jdk7-maven3.5.x] [INFO] Downloaded from central: https://repo.maven.apache.org/maven2/org/assertj/assertj-core/3.9.1/assertj-core-3.9.1.pom (10 kB at 410 kB/s)
[windows-jdk7-maven3.5.x] [INFO] Downloading from central: https://repo.maven.apache.org/maven2/org/assertj/assertj-parent-pom/2.1.9/assertj-parent-pom-2.1.9.pom
[windows-jdk7-maven3.5.x] [INFO] Downloaded from central: https://repo.maven.apache.org/maven2/org/assertj/assertj-parent-pom/2.1.9/assertj-parent-pom-2.1.9.pom (15 kB at 534 kB/s)
[windows-jdk7-maven3.5.x] [INFO] Downloading from central: https://repo.maven.apache.org/maven2/org/junit/platform/junit-platform-launcher/1.3.1/junit-platform-launcher-1.3.1.jar
[windows-jdk7-maven3.5.x] [INFO] Downloading from central: https://repo.maven.apache.org/maven2/org/apiguardian/apiguardian-api/1.0.0/apiguardian-api-1.0.0.jar
[windows-jdk7-maven3.5.x] [INFO] Downloading from central: https://repo.maven.apache.org/maven2/org/junit/platform/junit-platform-engine/1.3.1/junit-platform-engine-1.3.1.jar
[windows-jdk7-maven3.5.x] [INFO] Downloading from central: https://repo.maven.apache.org/maven2/org/junit/platform/junit-platform-commons/1.3.1/junit-platform-commons-1.3.1.jar
[windows-jdk7-maven3.5.x] [INFO] Downloading from central: https://repo.maven.apache.org/maven2/org/opentest4j/opentest4j/1.1.1/opentest4j-1.1.1.jar
[windows-jdk7-maven3.5.x] [INFO] Downloaded from central: https://repo.maven.apache.org/maven2/org/apiguardian/apiguardian-api/1.0.0/apiguardian-api-1.0.0.jar (2.2 kB at 83 kB/s)
[windows-jdk7-maven3.5.x] [INFO] Downloading from central: https://repo.maven.apache.org/maven2/org/junit/jupiter/junit-jupiter-engine/5.3.1/junit-jupiter-engine-5.3.1.jar
[windows-jdk7-maven3.5.x] [INFO] Downloaded from central: https://repo.maven.apache.org/maven2/org/opentest4j/opentest4j/1.1.1/opentest4j-1.1.1.jar (7.1 kB at 230 kB/s)
[windows-jdk7-maven3.5.x] [INFO] Downloading from central: https://repo.maven.apache.org/maven2/org/junit/jupiter/junit-jupiter-api/5.3.1/junit-jupiter-api-5.3.1.jar
[windows-jdk7-maven3.5.x] [INFO] Downloaded from central: https://repo.maven.apache.org/maven2/org/junit/platform/junit-platform-commons/1.3.1/junit-platform-commons-1.3.1.jar (78 kB at 1.9 MB/s)
[windows-jdk7-maven3.5.x] [INFO] Downloading from central: https://repo.maven.apache.org/maven2/org/assertj/assertj-core/3.9.1/assertj-core-3.9.1.jar
[windows-jdk7-maven3.5.x] [INFO] Downloaded from central: https://repo.maven.apache.org/maven2/org/junit/platform/junit-platform-launcher/1.3.1/junit-platform-launcher-1.3.1.jar (95 kB at 2.2 MB/s)
[windows-jdk7-maven3.5.x] [INFO] Downloaded from central: https://repo.maven.apache.org/maven2/org/junit/platform/junit-platform-engine/1.3.1/junit-platform-engine-1.3.1.jar (135 kB at 2.7 MB/s)
[windows-jdk7-maven3.5.x] [INFO] Downloaded from central: https://repo.maven.apache.org/maven2/org/junit/jupiter/junit-jupiter-engine/5.3.1/junit-jupiter-engine-5.3.1.jar (150 kB at 2.4 MB/s)
[windows-jdk7-maven3.5.x] [INFO] Downloaded from central: https://repo.maven.apache.org/maven2/org/junit/jupiter/junit-jupiter-api/5.3.1/junit-jupiter-api-5.3.1.jar (115 kB at 1.5 MB/s)
[windows-jdk7-maven3.5.x] [INFO] Downloaded from central: https://repo.maven.apache.org/maven2/org/assertj/assertj-core/3.9.1/assertj-core-3.9.1.jar (3.9 MB at 9.5 MB/s)
[windows-jdk7-maven3.5.x] [INFO]
[windows-jdk7-maven3.5.x] [INFO] --- maven-clean-plugin:3.1.0:clean (default-clean) @ surefire-junit-platform ---
[windows-jdk7-maven3.5.x] [INFO]
[windows-jdk7-maven3.5.x] [INFO] --- maven-enforcer-plugin:3.0.0-M2:enforce (enforce-maven-version) @ surefire-junit-platform ---
[windows-jdk7-maven3.5.x] [INFO]
[windows-jdk7-maven3.5.x] [INFO] --- maven-enforcer-plugin:3.0.0-M2:enforce (enforce-bytecode-version) @ surefire-junit-platform ---
[windows-jdk7-maven3.5.x] [INFO]
[windows-jdk7-maven3.5.x] [INFO] --- maven-enforcer-plugin:3.0.0-M2:enforce (ban-known-bad-maven-versions) @ surefire-junit-platform ---
[windows-jdk7-maven3.5.x] [INFO]
[windows-jdk7-maven3.5.x] [INFO] --- maven-enforcer-plugin:3.0.0-M2:enforce (enforce-java) @ surefire-junit-platform ---
[windows-jdk7-maven3.5.x] [INFO]
[windows-jdk7-maven3.5.x] [INFO] --- maven-enforcer-plugin:3.0.0-M2:enforce (enforce-maven) @ surefire-junit-platform ---
[windows-jdk7-maven3.5.x] [INFO]
[windows-jdk7-maven3.5.x] [INFO] --- apache-rat-plugin:0.12:check (rat-check) @ surefire-junit-platform ---
[windows-jdk7-maven3.5.x] [INFO] Enabled default license matchers.
[windows-jdk7-maven3.5.x] [INFO] Will parse SCM ignores for exclusions...
[windows-jdk7-maven3.5.x] [INFO] Finished adding exclusions from SCM ignore files.
[windows-jdk7-maven3.5.x] [INFO] 61 implicit excludes (use -debug for more details).
[windows-jdk7-maven3.5.x] [INFO] Exclude: .repository/**
[windows-jdk7-maven3.5.x] [INFO] Exclude: .maven/spy.log
[windows-jdk7-maven3.5.x] [INFO] Exclude: dependency-reduced-pom.xml
[windows-jdk7-maven3.5.x] [INFO] Exclude: .java-version
[windows-jdk7-maven3.5.x] [INFO] Exclude: Jenkinsfile
[windows-jdk7-maven3.5.x] [INFO] Exclude: README.md
[windows-jdk7-maven3.5.x] [INFO] Exclude: .gitignore
[windows-jdk7-maven3.5.x] [INFO] Exclude: .git/**/*
[windows-jdk7-maven3.5.x] [INFO] Exclude: **/.idea
[windows-jdk7-maven3.5.x] [INFO] Exclude: **/.svn/**/*
[windows-jdk7-maven3.5.x] [INFO] Exclude: **/*.iml
[windows-jdk7-maven3.5.x] [INFO] Exclude: **/*.ipr
[windows-jdk7-maven3.5.x] [INFO] Exclude: **/*.iws
[windows-jdk7-maven3.5.x] [INFO] Exclude: **/*.versionsBackup
[windows-jdk7-maven3.5.x] [INFO] Exclude: **/dependency-reduced-pom.xml
[windows-jdk7-maven3.5.x] [INFO] Exclude: .repository/**
[windows-jdk7-maven3.5.x] [INFO] Exclude: src/test/resources/**/*
[windows-jdk7-maven3.5.x] [INFO] Exclude: src/test/resources/**/*.css
[windows-jdk7-maven3.5.x] [INFO] Exclude: **/*.jj
[windows-jdk7-maven3.5.x] [INFO] Exclude: src/main/resources/META-INF/services/org.apache.maven.surefire.providerapi.SurefireProvider
[windows-jdk7-maven3.5.x] [INFO] Exclude: DEPENDENCIES
[windows-jdk7-maven3.5.x] [INFO] Exclude: .m2/**
[windows-jdk7-maven3.5.x] [INFO] Exclude: .m2
[windows-jdk7-maven3.5.x] [INFO] Exclude: .travis.yml
[windows-jdk7-maven3.5.x] [INFO] 9 resources included (use -debug for more details)
[windows-jdk7-maven3.5.x] [INFO] Rat check: Summary over all files. Unapproved: 0, unknown: 0, generated: 0, approved: 9 licenses.
[windows-jdk7-maven3.5.x] [INFO]
[windows-jdk7-maven3.5.x] [INFO] --- jacoco-maven-plugin:0.8.2:prepare-agent (jacoco-agent) @ surefire-junit-platform ---
[windows-jdk7-maven3.5.x] [INFO] Skipping JaCoCo execution because property jacoco.skip is set.
[windows-jdk7-maven3.5.x] [INFO] jacoco.agent set to empty
[windows-jdk7-maven3.5.x] [INFO]
[windows-jdk7-maven3.5.x] [INFO] --- maven-compiler-plugin:3.7.0:compile (compile-generated) @ surefire-junit-platform ---
[windows-jdk7-maven3.5.x] [INFO] Nothing to compile - all classes are up to date
[windows-jdk7-maven3.5.x] [INFO]
[windows-jdk7-maven3.5.x] [INFO] --- maven-remote-resources-plugin:1.5:process (process-resource-bundles) @ surefire-junit-platform ---
[windows-jdk7-maven3.5.x] [INFO]
[windows-jdk7-maven3.5.x] [INFO] --- maven-resources-plugin:3.1.0:resources (default-resources) @ surefire-junit-platform ---
[windows-jdk7-maven3.5.x] [INFO] Using 'UTF-8' encoding to copy filtered resources.
[windows-jdk7-maven3.5.x] [INFO] Copying 1 resource
[windows-jdk7-maven3.5.x] [INFO] Copying 3 resources
[windows-jdk7-maven3.5.x] [INFO]
[windows-jdk7-maven3.5.x] [INFO] --- maven-compiler-plugin:3.7.0:compile (default-compile) @ surefire-junit-platform ---
[windows-jdk7-maven3.5.x] [INFO] Changes detected - recompiling the module!
[windows-jdk7-maven3.5.x] [INFO] Compiling 4 source files to F:\jenkins\jenkins-slave\workspace\aven-surefire_SUREFIRE-1603-X2STNNZLDZLTM76TZU4UXX6QPWWXCVWMPJZ7GOLZSRHWQH6QBXRA\surefire-providers\surefire-junit-platform\target\classes
[windows-jdk7-maven3.5.x] [INFO]
[windows-jdk7-maven3.5.x] [INFO] --- animal-sniffer-maven-plugin:1.17:check (signature-check) @ surefire-junit-platform ---
[windows-jdk7-maven3.5.x] [INFO] Checking unresolved references to org.codehaus.mojo.signature:java18:1.0
[windows-jdk7-maven3.5.x] [INFO] Downloading from central: https://repo.maven.apache.org/maven2/org/codehaus/mojo/signature/java18/1.0/java18-1.0.signature
[windows-jdk7-maven3.5.x] [INFO] Downloaded from central: https://repo.maven.apache.org/maven2/org/codehaus/mojo/signature/java18/1.0/java18-1.0.signature (2.0 MB at 10 MB/s)
[windows-jdk7-maven3.5.x] [INFO]
[windows-jdk7-maven3.5.x] [INFO] --- maven-resources-plugin:3.1.0:testResources (default-testResources) @ surefire-junit-platform ---
[windows-jdk7-maven3.5.x] [INFO] Using 'UTF-8' encoding to copy filtered resources.
[windows-jdk7-maven3.5.x] [INFO] skip non existing resourceDirectory F:\jenkins\jenkins-slave\workspace\aven-surefire_SUREFIRE-1603-X2STNNZLDZLTM76TZU4UXX6QPWWXCVWMPJZ7GOLZSRHWQH6QBXRA\surefire-providers\surefire-junit-platform\src\test\resources
[windows-jdk7-maven3.5.x] [INFO] Copying 3 resources
[windows-jdk7-maven3.5.x] [INFO]
[windows-jdk7-maven3.5.x] [INFO] --- maven-compiler-plugin:3.7.0:testCompile (default-testCompile) @ surefire-junit-platform ---
[windows-jdk7-maven3.5.x] [INFO] Changes detected - recompiling the module!
[windows-jdk7-maven3.5.x] [INFO] Compiling 4 source files to F:\jenkins\jenkins-slave\workspace\aven-surefire_SUREFIRE-1603-X2STNNZLDZLTM76TZU4UXX6QPWWXCVWMPJZ7GOLZSRHWQH6QBXRA\surefire-providers\surefire-junit-platform\target\test-classes
[windows-jdk7-maven3.5.x] [INFO]
[windows-jdk7-maven3.5.x] [INFO] --- maven-surefire-plugin:2.12.4:test (default-test) @ surefire-junit-platform ---
[windows-jdk7-maven3.5.x] [INFO] Surefire report directory: F:\jenkins\jenkins-slave\workspace\aven-surefire_SUREFIRE-1603-X2STNNZLDZLTM76TZU4UXX6QPWWXCVWMPJZ7GOLZSRHWQH6QBXRA\surefire-providers\surefire-junit-platform\target\surefire-reports
[windows-jdk7-maven3.5.x] [INFO] Using configured provider org.apache.maven.surefire.shadefire.junit.JUnit3Provider
[windows-jdk7-maven3.5.x]
[windows-jdk7-maven3.5.x] -------------------------------------------------------
[windows-jdk7-maven3.5.x]  T E S T S
[windows-jdk7-maven3.5.x] -------------------------------------------------------
[windows-jdk7-maven3.5.x] Running org.apache.maven.surefire.junitplatform.JUnitPlatformProviderTest
[windows-jdk7-maven3.5.x] Tests run: 0, Failures: 0, Errors: 0, Skipped: 0, Time elapsed: 0 sec
[windows-jdk7-maven3.5.x] Running org.apache.maven.surefire.junitplatform.RunListenerAdapterTest
[windows-jdk7-maven3.5.x] Tests run: 0, Failures: 0, Errors: 0, Skipped: 0, Time elapsed: 0 sec
[windows-jdk7-maven3.5.x] Running org.apache.maven.surefire.junitplatform.TestMethodFilterTest
[windows-jdk7-maven3.5.x] Tests run: 0, Failures: 0, Errors: 0, Skipped: 0, Time elapsed: 0 sec
[windows-jdk7-maven3.5.x] Running org.apache.maven.surefire.junitplatform.TestPlanScannerFilterTest
[windows-jdk7-maven3.5.x] Tests run: 0, Failures: 0, Errors: 0, Skipped: 0, Time elapsed: 0 sec
[windows-jdk7-maven3.5.x]
[windows-jdk7-maven3.5.x] Results :
[windows-jdk7-maven3.5.x]
[windows-jdk7-maven3.5.x] Tests run: 0, Failures: 0, Errors: 0, Skipped: 0
[windows-jdk7-maven3.5.x]
[windows-jdk7-maven3.5.x] [INFO]
[windows-jdk7-maven3.5.x] [INFO] --- maven-jar-plugin:3.1.0:jar (default-jar) @ surefire-junit-platform ---
[windows-jdk7-maven3.5.x] [INFO] Building jar: F:\jenkins\jenkins-slave\workspace\aven-surefire_SUREFIRE-1603-X2STNNZLDZLTM76TZU4UXX6QPWWXCVWMPJZ7GOLZSRHWQH6QBXRA\surefire-providers\surefire-junit-platform\target\surefire-junit-platform-3.0.0-M2-SNAPSHOT.jar
[windows-jdk7-maven3.5.x] [INFO]
[windows-jdk7-maven3.5.x] [INFO] --- maven-site-plugin:3.7.1:attach-descriptor (attach-descriptor) @ surefire-junit-platform ---
[windows-jdk7-maven3.5.x] [INFO] Skipping because packaging 'jar' is not pom.
[windows-jdk7-maven3.5.x] [INFO]
[windows-jdk7-maven3.5.x] [INFO] --- maven-checkstyle-plugin:3.0.0:check (checkstyle-check) @ surefire-junit-platform ---
[windows-jdk7-maven3.5.x] [INFO] There are 2 errors reported by Checkstyle 6.18 with config/maven_checks.xml ruleset.
[windows-jdk7-maven3.5.x] [ERROR] src\main\java\org\apache\maven\surefire\junitplatform\RunListenerAdapter.java:[206,13] (whitespace) ParenPad: '(' is not followed by whitespace.
[windows-jdk7-maven3.5.x] [ERROR] src\main\java\org\apache\maven\surefire\junitplatform\RunListenerAdapter.java:[206,28] (whitespace) ParenPad: ')' is not preceded with whitespace.
[windows-jdk7-maven3.5.x] [INFO] ------------------------------------------------------------------------
[windows-jdk7-maven3.5.x] [INFO] Reactor Summary:
[windows-jdk7-maven3.5.x] [INFO]
[windows-jdk7-maven3.5.x] [INFO] Apache Maven Surefire .............................. SUCCESS [ 27.658 s]
[windows-jdk7-maven3.5.x] [INFO] SureFire Logger API ................................ SUCCESS [  5.987 s]
[windows-jdk7-maven3.5.x] [INFO] SureFire API ....................................... SUCCESS [ 10.752 s]
[windows-jdk7-maven3.5.x] [INFO] SureFire Booter .................................... SUCCESS [ 12.819 s]
[windows-jdk7-maven3.5.x] [INFO] Maven Surefire Test-Grouping Support ............... SUCCESS [  6.501 s]
[windows-jdk7-maven3.5.x] [INFO] SureFire Providers ................................. SUCCESS [  1.153 s]
[windows-jdk7-maven3.5.x] [INFO] Shared JUnit3 Provider Code ........................ SUCCESS [  4.275 s]
[windows-jdk7-maven3.5.x] [INFO] Shared Java 5 Provider Base ........................ SUCCESS [  5.007 s]
[windows-jdk7-maven3.5.x] [INFO] Shared JUnit4 Provider Code ........................ SUCCESS [  5.286 s]
[windows-jdk7-maven3.5.x] [INFO] Shared JUnit48 Provider Code ....................... SUCCESS [  5.639 s]
[windows-jdk7-maven3.5.x] [INFO] SureFire JUnit Runner .............................. SUCCESS [  4.402 s]
[windows-jdk7-maven3.5.x] [INFO] SureFire JUnit4 Runner ............................. SUCCESS [  4.836 s]
[windows-jdk7-maven3.5.x] [INFO] Maven Surefire Common .............................. SUCCESS [ 26.284 s]
[windows-jdk7-maven3.5.x] [INFO] SureFire JUnitCore Runner .......................... SUCCESS [02:12 min]
[windows-jdk7-maven3.5.x] [INFO] SureFire JUnit Platform Runner ..................... FAILURE [  8.521 s]
[windows-jdk7-maven3.5.x] [INFO] SureFire TestNG Utils .............................. SKIPPED
[windows-jdk7-maven3.5.x] [INFO] SureFire TestNG Runner ............................. SKIPPED
[windows-jdk7-maven3.5.x] [INFO] ShadeFire JUnit3 Provider .......................... SKIPPED
[windows-jdk7-maven3.5.x] [INFO] Surefire Report Parser ............................. SKIPPED
[windows-jdk7-maven3.5.x] [INFO] Maven Surefire Plugin .............................. SKIPPED
[windows-jdk7-maven3.5.x] [INFO] Maven Failsafe Plugin .............................. SKIPPED
[windows-jdk7-maven3.5.x] [INFO] Maven Surefire Report Plugin ....................... SKIPPED
[windows-jdk7-maven3.5.x] [INFO] Maven Surefire Integration Tests ................... SKIPPED
[windows-jdk7-maven3.5.x] [INFO] ------------------------------------------------------------------------
[windows-jdk7-maven3.5.x] [INFO] BUILD FAILURE
[windows-jdk7-maven3.5.x] [INFO] ------------------------------------------------------------------------
[windows-jdk7-maven3.5.x] [INFO] Total time: 04:23 min
[windows-jdk7-maven3.5.x] [INFO] Finished at: 2018-12-30T11:49:57Z
[windows-jdk7-maven3.5.x] [INFO] Final Memory: 40M/133M
[windows-jdk7-maven3.5.x] [INFO] ------------------------------------------------------------------------
[windows-jdk7-maven3.5.x] [ERROR] Failed to execute goal org.apache.maven.plugins:maven-checkstyle-plugin:3.0.0:check (checkstyle-check) on project surefire-junit-platform: You have 2 Checkstyle violations. -> [Help 1]
[windows-jdk7-maven3.5.x] org.apache.maven.lifecycle.LifecycleExecutionException: Failed to execute goal org.apache.maven.plugins:maven-checkstyle-plugin:3.0.0:check (checkstyle-check) on project surefire-junit-platform: You have 2 Checkstyle violations.
[windows-jdk7-maven3.5.x]     at org.apache.maven.lifecycle.internal.MojoExecutor.execute (MojoExecutor.java:213)
[windows-jdk7-maven3.5.x]     at org.apache.maven.lifecycle.internal.MojoExecutor.execute (MojoExecutor.java:154)
[windows-jdk7-maven3.5.x]     at org.apache.maven.lifecycle.internal.MojoExecutor.execute (MojoExecutor.java:146)
[windows-jdk7-maven3.5.x]     at org.apache.maven.lifecycle.internal.LifecycleModuleBuilder.buildProject (LifecycleModuleBuilder.java:117)
[windows-jdk7-maven3.5.x]     at org.apache.maven.lifecycle.internal.LifecycleModuleBuilder.buildProject (LifecycleModuleBuilder.java:81)
[windows-jdk7-maven3.5.x]     at org.apache.maven.lifecycle.internal.builder.singlethreaded.SingleThreadedBuilder.build (SingleThreadedBuilder.java:51)
[windows-jdk7-maven3.5.x]     at org.apache.maven.lifecycle.internal.LifecycleStarter.execute (LifecycleStarter.java:128)
[windows-jdk7-maven3.5.x]     at org.apache.maven.DefaultMaven.doExecute (DefaultMaven.java:309)
[windows-jdk7-maven3.5.x]     at org.apache.maven.DefaultMaven.doExecute (DefaultMaven.java:194)
[windows-jdk7-maven3.5.x]     at org.apache.maven.DefaultMaven.execute (DefaultMaven.java:107)
[windows-jdk7-maven3.5.x]     at org.apache.maven.cli.MavenCli.execute (MavenCli.java:955)
[windows-jdk7-maven3.5.x]     at org.apache.maven.cli.MavenCli.doMain (MavenCli.java:290)
[windows-jdk7-maven3.5.x]     at org.apache.maven.cli.MavenCli.main (MavenCli.java:194)
[windows-jdk7-maven3.5.x]     at sun.reflect.NativeMethodAccessorImpl.invoke0 (Native Method)
[windows-jdk7-maven3.5.x]     at sun.reflect.NativeMethodAccessorImpl.invoke (NativeMethodAccessorImpl.java:62)
[windows-jdk7-maven3.5.x]     at sun.reflect.DelegatingMethodAccessorImpl.invoke (DelegatingMethodAccessorImpl.java:43)
[windows-jdk7-maven3.5.x]     at java.lang.reflect.Method.invoke (Method.java:498)
[windows-jdk7-maven3.5.x]     at org.codehaus.plexus.classworlds.launcher.Launcher.launchEnhanced (Launcher.java:289)
[windows-jdk7-maven3.5.x]     at org.codehaus.plexus.classworlds.launcher.Launcher.launch (Launcher.java:229)
[windows-jdk7-maven3.5.x]     at org.codehaus.plexus.classworlds.launcher.Launcher.mainWithExitCode (Launcher.java:415)
[windows-jdk7-maven3.5.x]     at org.codehaus.plexus.classworlds.launcher.Launcher.main (Launcher.java:356)
[windows-jdk7-maven3.5.x] Caused by: org.apache.maven.plugin.MojoFailureException: You have 2 Checkstyle violations.
[windows-jdk7-maven3.5.x]     at org.apache.maven.plugins.checkstyle.CheckstyleViolationCheckMojo.execute (CheckstyleViolationCheckMojo.java:576)
[windows-jdk7-maven3.5.x]     at org.apache.maven.plugin.DefaultBuildPluginManager.executeMojo (DefaultBuildPluginManager.java:134)
[windows-jdk7-maven3.5.x]     at org.apache.maven.lifecycle.internal.MojoExecutor.execute (MojoExecutor.java:208)
[windows-jdk7-maven3.5.x]     at org.apache.maven.lifecycle.internal.MojoExecutor.execute (MojoExecutor.java:154)
[windows-jdk7-maven3.5.x]     at org.apache.maven.lifecycle.internal.MojoExecutor.execute (MojoExecutor.java:146)
[windows-jdk7-maven3.5.x]     at org.apache.maven.lifecycle.internal.LifecycleModuleBuilder.buildProject (LifecycleModuleBuilder.java:117)
[windows-jdk7-maven3.5.x]     at org.apache.maven.lifecycle.internal.LifecycleModuleBuilder.buildProject (LifecycleModuleBuilder.java:81)
[windows-jdk7-maven3.5.x]     at org.apache.maven.lifecycle.internal.builder.singlethreaded.SingleThreadedBuilder.build (SingleThreadedBuilder.java:51)
[windows-jdk7-maven3.5.x]     at org.apache.maven.lifecycle.internal.LifecycleStarter.execute (LifecycleStarter.java:128)
[windows-jdk7-maven3.5.x]     at org.apache.maven.DefaultMaven.doExecute (DefaultMaven.java:309)
[windows-jdk7-maven3.5.x]     at org.apache.maven.DefaultMaven.doExecute (DefaultMaven.java:194)
[windows-jdk7-maven3.5.x]     at org.apache.maven.DefaultMaven.execute (DefaultMaven.java:107)
[windows-jdk7-maven3.5.x]     at org.apache.maven.cli.MavenCli.execute (MavenCli.java:955)
[windows-jdk7-maven3.5.x]     at org.apache.maven.cli.MavenCli.doMain (MavenCli.java:290)
[windows-jdk7-maven3.5.x]     at org.apache.maven.cli.MavenCli.main (MavenCli.java:194)
[windows-jdk7-maven3.5.x]     at sun.reflect.NativeMethodAccessorImpl.invoke0 (Native Method)
[windows-jdk7-maven3.5.x]     at sun.reflect.NativeMethodAccessorImpl.invoke (NativeMethodAccessorImpl.java:62)
[windows-jdk7-maven3.5.x]     at sun.reflect.DelegatingMethodAccessorImpl.invoke (DelegatingMethodAccessorImpl.java:43)
[windows-jdk7-maven3.5.x]     at java.lang.reflect.Method.invoke (Method.java:498)
[windows-jdk7-maven3.5.x]     at org.codehaus.plexus.classworlds.launcher.Launcher.launchEnhanced (Launcher.java:289)
[windows-jdk7-maven3.5.x]     at org.codehaus.plexus.classworlds.launcher.Launcher.launch (Launcher.java:229)
[windows-jdk7-maven3.5.x]     at org.codehaus.plexus.classworlds.launcher.Launcher.mainWithExitCode (Launcher.java:415)
[windows-jdk7-maven3.5.x]     at org.codehaus.plexus.classworlds.launcher.Launcher.main (Launcher.java:356)
[windows-jdk7-maven3.5.x] [ERROR]
[windows-jdk7-maven3.5.x] [ERROR] Re-run Maven using the -X switch to enable full debug logging.
[windows-jdk7-maven3.5.x] [ERROR]
[windows-jdk7-maven3.5.x] [ERROR] For more information about the errors and possible solutions, please read the following articles:
[windows-jdk7-maven3.5.x] [ERROR] [Help 1] http://cwiki.apache.org/confluence/display/MAVEN/MojoFailureException
[windows-jdk7-maven3.5.x] [ERROR]
[windows-jdk7-maven3.5.x] [ERROR] After correcting the problems, you can resume the build with the command
[windows-jdk7-maven3.5.x] [ERROR]   mvn <goals> -rf :surefire-junit-platform
[Pipeline] [windows-jdk7-maven3.5.x] }
[Pipeline] [windows-jdk7-maven3.5.x] // withEnv
[Pipeline] [windows-jdk7-maven3.5.x] }
[Pipeline] [windows-jdk7-maven3.5.x] // stage
[Pipeline] [windows-jdk7-maven3.5.x] stage
[Pipeline] [windows-jdk7-maven3.5.x] { (reporting windows-jdk7-maven3.5.x)
[Pipeline] [windows-jdk7-maven3.5.x] fileExists
[Pipeline] [windows-jdk7-maven3.5.x] fileExists
[Pipeline] [windows-jdk7-maven3.5.x] archiveArtifacts
[windows-jdk7-maven3.5.x] Archiving artifacts
[windows-jdk7-maven3.5.x] ‘*--windows-jdk7-maven3.5.x.zip’ doesn’t match anything
[windows-jdk7-maven3.5.x] No artifacts found that match the file pattern "*--windows-jdk7-maven3.5.x.zip". Configuration error?
[Pipeline] [windows-jdk7-maven3.5.x] }
[Pipeline] [windows-jdk7-maven3.5.x] // stage
[Pipeline] [windows-jdk7-maven3.5.x] stage
[Pipeline] [windows-jdk7-maven3.5.x] { (cleanup windows-jdk7-maven3.5.x)
[Pipeline] [windows-jdk7-maven3.5.x] cleanWs
[windows-jdk7-maven3.5.x] [WS-CLEANUP] Deleting project workspace...[WS-CLEANUP] done
[Pipeline] [windows-jdk7-maven3.5.x] }
[Pipeline] [windows-jdk7-maven3.5.x] // stage
[Pipeline] [windows-jdk7-maven3.5.x] }
[Pipeline] [windows-jdk7-maven3.5.x] // timestamps
[Pipeline] [windows-jdk7-maven3.5.x] }
[Pipeline] [windows-jdk7-maven3.5.x] // node
[Pipeline] [windows-jdk7-maven3.5.x] }
[windows-jdk7-maven3.5.x] Failed in branch windows-jdk7-maven3.5.x
[Pipeline] // parallel
[Pipeline] echo
hudson.AbortException: hudson.AbortException: script returned exit code 1
[Pipeline] stage
[Pipeline] { (notifications)
[Pipeline] echo
Build result: FAILURE
[Pipeline] jiraIssueSelector
Reply | Threaded
Open this post in threaded view
|

Build failed in Jenkins: Maven TLP » maven-surefire » SUREFIRE-1603 #4

Apache Jenkins Server-2
See https://builds.apache.org/job/maven-box/job/maven-surefire/job/SUREFIRE-1603/4/

Changes:

* add mavenLinkerPublisher

All tests passed

Build log:
[...truncated 12078 lines...]
[INFO] Downloaded from central: https://repo.maven.apache.org/maven2/org/junit/platform/junit-platform-launcher/1.3.1/junit-platform-launcher-1.3.1.jar (95 kB at 4.5 MB/s)
[INFO] Downloading from central: https://repo.maven.apache.org/maven2/org/assertj/assertj-core/3.9.1/assertj-core-3.9.1.jar
[INFO] Downloaded from central: https://repo.maven.apache.org/maven2/org/junit/platform/junit-platform-commons/1.3.1/junit-platform-commons-1.3.1.jar (78 kB at 3.0 MB/s)
[INFO] Downloaded from central: https://repo.maven.apache.org/maven2/org/junit/platform/junit-platform-engine/1.3.1/junit-platform-engine-1.3.1.jar (135 kB at 4.2 MB/s)
[INFO] Downloaded from central: https://repo.maven.apache.org/maven2/org/junit/jupiter/junit-jupiter-api/5.3.1/junit-jupiter-api-5.3.1.jar (115 kB at 2.6 MB/s)
[INFO] Downloaded from central: https://repo.maven.apache.org/maven2/org/junit/jupiter/junit-jupiter-engine/5.3.1/junit-jupiter-engine-5.3.1.jar (150 kB at 3.3 MB/s)
[INFO] Downloaded from central: https://repo.maven.apache.org/maven2/org/assertj/assertj-core/3.9.1/assertj-core-3.9.1.jar (3.9 MB at 10.0 MB/s)
[INFO]
[INFO] --- maven-clean-plugin:3.1.0:clean (default-clean) @ surefire-junit-platform ---
[INFO]
[INFO] --- maven-enforcer-plugin:3.0.0-M2:enforce (enforce-maven-version) @ surefire-junit-platform ---
[INFO]
[INFO] --- maven-enforcer-plugin:3.0.0-M2:enforce (enforce-bytecode-version) @ surefire-junit-platform ---
[INFO]
[INFO] --- maven-enforcer-plugin:3.0.0-M2:enforce (ban-known-bad-maven-versions) @ surefire-junit-platform ---
[INFO]
[INFO] --- maven-enforcer-plugin:3.0.0-M2:enforce (enforce-java) @ surefire-junit-platform ---
[INFO]
[INFO] --- maven-enforcer-plugin:3.0.0-M2:enforce (enforce-maven) @ surefire-junit-platform ---
[INFO]
[INFO] --- apache-rat-plugin:0.12:check (rat-check) @ surefire-junit-platform ---
[INFO] Enabled default license matchers.
[INFO] Will parse SCM ignores for exclusions...
[INFO] Finished adding exclusions from SCM ignore files.
[INFO] 61 implicit excludes (use -debug for more details).
[INFO] Exclude: .repository/**
[INFO] Exclude: .maven/spy.log
[INFO] Exclude: dependency-reduced-pom.xml
[INFO] Exclude: .java-version
[INFO] Exclude: Jenkinsfile
[INFO] Exclude: README.md
[INFO] Exclude: .gitignore
[INFO] Exclude: .git/**/*
[INFO] Exclude: **/.idea
[INFO] Exclude: **/.svn/**/*
[INFO] Exclude: **/*.iml
[INFO] Exclude: **/*.ipr
[INFO] Exclude: **/*.iws
[INFO] Exclude: **/*.versionsBackup
[INFO] Exclude: **/dependency-reduced-pom.xml
[INFO] Exclude: .repository/**
[INFO] Exclude: src/test/resources/**/*
[INFO] Exclude: src/test/resources/**/*.css
[INFO] Exclude: **/*.jj
[INFO] Exclude: src/main/resources/META-INF/services/org.apache.maven.surefire.providerapi.SurefireProvider
[INFO] Exclude: DEPENDENCIES
[INFO] Exclude: .m2/**
[INFO] Exclude: .m2
[INFO] Exclude: .travis.yml
[INFO] 9 resources included (use -debug for more details)
[INFO] Rat check: Summary over all files. Unapproved: 0, unknown: 0, generated: 0, approved: 9 licenses.
[INFO]
[INFO] --- jacoco-maven-plugin:0.8.2:prepare-agent (jacoco-agent) @ surefire-junit-platform ---
[INFO] Skipping JaCoCo execution because property jacoco.skip is set.
[INFO] jacoco.agent set to empty
[INFO]
[INFO] --- maven-compiler-plugin:3.7.0:compile (compile-generated) @ surefire-junit-platform ---
[INFO] Nothing to compile - all classes are up to date
[INFO]
[INFO] --- maven-remote-resources-plugin:1.5:process (process-resource-bundles) @ surefire-junit-platform ---
[INFO]
[INFO] --- maven-resources-plugin:3.1.0:resources (default-resources) @ surefire-junit-platform ---
[INFO] Using 'UTF-8' encoding to copy filtered resources.
[INFO] Copying 1 resource
[INFO] Copying 3 resources
[INFO]
[INFO] --- maven-compiler-plugin:3.7.0:compile (default-compile) @ surefire-junit-platform ---
[INFO] Changes detected - recompiling the module!
[INFO] Compiling 4 source files to /home/jenkins/jenkins-slave/workspace/box_maven-surefire_SUREFIRE-1603@2/surefire-providers/surefire-junit-platform/target/classes
[INFO]
[INFO] --- animal-sniffer-maven-plugin:1.17:check (signature-check) @ surefire-junit-platform ---
[INFO] Checking unresolved references to org.codehaus.mojo.signature:java18:1.0
[INFO] Downloading from central: https://repo.maven.apache.org/maven2/org/codehaus/mojo/signature/java18/1.0/java18-1.0.signature
[INFO] Downloaded from central: https://repo.maven.apache.org/maven2/org/codehaus/mojo/signature/java18/1.0/java18-1.0.signature (2.0 MB at 10 MB/s)
[INFO]
[INFO] --- maven-resources-plugin:3.1.0:testResources (default-testResources) @ surefire-junit-platform ---
[INFO] Using 'UTF-8' encoding to copy filtered resources.
[INFO] skip non existing resourceDirectory /home/jenkins/jenkins-slave/workspace/box_maven-surefire_SUREFIRE-1603@2/surefire-providers/surefire-junit-platform/src/test/resources
[INFO] Copying 3 resources
[INFO]
[INFO] --- maven-compiler-plugin:3.7.0:testCompile (default-testCompile) @ surefire-junit-platform ---
[INFO] Changes detected - recompiling the module!
[INFO] Compiling 4 source files to /home/jenkins/jenkins-slave/workspace/box_maven-surefire_SUREFIRE-1603@2/surefire-providers/surefire-junit-platform/target/test-classes
[INFO]
[INFO] --- maven-surefire-plugin:2.12.4:test (default-test) @ surefire-junit-platform ---
[INFO] Surefire report directory: /home/jenkins/jenkins-slave/workspace/box_maven-surefire_SUREFIRE-1603@2/surefire-providers/surefire-junit-platform/target/surefire-reports
[INFO] Using configured provider org.apache.maven.surefire.shadefire.junit.JUnit3Provider

-------------------------------------------------------
 T E S T S
-------------------------------------------------------
Running org.apache.maven.surefire.junitplatform.RunListenerAdapterTest
Tests run: 0, Failures: 0, Errors: 0, Skipped: 0, Time elapsed: 0 sec
Running org.apache.maven.surefire.junitplatform.TestMethodFilterTest
Tests run: 0, Failures: 0, Errors: 0, Skipped: 0, Time elapsed: 0.001 sec
Running org.apache.maven.surefire.junitplatform.JUnitPlatformProviderTest
Tests run: 0, Failures: 0, Errors: 0, Skipped: 0, Time elapsed: 0 sec
Running org.apache.maven.surefire.junitplatform.TestPlanScannerFilterTest
Tests run: 0, Failures: 0, Errors: 0, Skipped: 0, Time elapsed: 0 sec

Results :

Tests run: 0, Failures: 0, Errors: 0, Skipped: 0

[INFO]
[INFO] --- maven-jar-plugin:3.1.0:jar (default-jar) @ surefire-junit-platform ---
[INFO] Building jar: /home/jenkins/jenkins-slave/workspace/box_maven-surefire_SUREFIRE-1603@2/surefire-providers/surefire-junit-platform/target/surefire-junit-platform-3.0.0-M2-SNAPSHOT.jar
[INFO]
[INFO] --- maven-site-plugin:3.7.1:attach-descriptor (attach-descriptor) @ surefire-junit-platform ---
[INFO] Skipping because packaging 'jar' is not pom.
[INFO]
[INFO] --- maven-checkstyle-plugin:3.0.0:check (checkstyle-check) @ surefire-junit-platform ---
[INFO] There are 2 errors reported by Checkstyle 6.18 with config/maven_checks.xml ruleset.
[ERROR] src/main/java/org/apache/maven/surefire/junitplatform/RunListenerAdapter.java:[206,13] (whitespace) ParenPad: '(' is not followed by whitespace.
[ERROR] src/main/java/org/apache/maven/surefire/junitplatform/RunListenerAdapter.java:[206,28] (whitespace) ParenPad: ')' is not preceded with whitespace.
[INFO] ------------------------------------------------------------------------
[INFO] Reactor Summary:
[INFO]
[INFO] Apache Maven Surefire 3.0.0-M2-SNAPSHOT ............ SUCCESS [ 15.685 s]
[INFO] SureFire Logger API ................................ SUCCESS [  3.781 s]
[INFO] SureFire API ....................................... SUCCESS [  8.903 s]
[INFO] SureFire Booter .................................... SUCCESS [  8.917 s]
[INFO] Maven Surefire Test-Grouping Support ............... SUCCESS [  4.184 s]
[INFO] SureFire Providers ................................. SUCCESS [  0.876 s]
[INFO] Shared JUnit3 Provider Code ........................ SUCCESS [  2.720 s]
[INFO] Shared Java 5 Provider Base ........................ SUCCESS [  3.218 s]
[INFO] Shared JUnit4 Provider Code ........................ SUCCESS [  3.284 s]
[INFO] Shared JUnit48 Provider Code ....................... SUCCESS [  4.018 s]
[INFO] SureFire JUnit Runner .............................. SUCCESS [  2.899 s]
[INFO] SureFire JUnit4 Runner ............................. SUCCESS [  3.261 s]
[INFO] Maven Surefire Common .............................. SUCCESS [ 23.109 s]
[INFO] SureFire JUnitCore Runner .......................... SUCCESS [02:16 min]
[INFO] SureFire JUnit Platform Runner ..................... FAILURE [  6.064 s]
[INFO] SureFire TestNG Utils .............................. SKIPPED
[INFO] SureFire TestNG Runner ............................. SKIPPED
[INFO] ShadeFire JUnit3 Provider .......................... SKIPPED
[INFO] Surefire Report Parser ............................. SKIPPED
[INFO] Maven Surefire Plugin .............................. SKIPPED
[INFO] Maven Failsafe Plugin .............................. SKIPPED
[INFO] Maven Surefire Report Plugin ....................... SKIPPED
[INFO] Maven Surefire Integration Tests 3.0.0-M2-SNAPSHOT . SKIPPED
[INFO] ------------------------------------------------------------------------
[INFO] BUILD FAILURE
[INFO] ------------------------------------------------------------------------
[INFO] Total time: 03:49 min
[INFO] Finished at: 2019-01-01T16:19:44Z
[INFO] ------------------------------------------------------------------------
[ERROR] Failed to execute goal org.apache.maven.plugins:maven-checkstyle-plugin:3.0.0:check (checkstyle-check) on project surefire-junit-platform: You have 2 Checkstyle violations. -> [Help 1]
org.apache.maven.lifecycle.LifecycleExecutionException: Failed to execute goal org.apache.maven.plugins:maven-checkstyle-plugin:3.0.0:check (checkstyle-check) on project surefire-junit-platform: You have 2 Checkstyle violations.
    at org.apache.maven.lifecycle.internal.MojoExecutor.execute (MojoExecutor.java:213)
    at org.apache.maven.lifecycle.internal.MojoExecutor.execute (MojoExecutor.java:154)
    at org.apache.maven.lifecycle.internal.MojoExecutor.execute (MojoExecutor.java:146)
    at org.apache.maven.lifecycle.internal.LifecycleModuleBuilder.buildProject (LifecycleModuleBuilder.java:117)
    at org.apache.maven.lifecycle.internal.LifecycleModuleBuilder.buildProject (LifecycleModuleBuilder.java:81)
    at org.apache.maven.lifecycle.internal.builder.singlethreaded.SingleThreadedBuilder.build (SingleThreadedBuilder.java:56)
    at org.apache.maven.lifecycle.internal.LifecycleStarter.execute (LifecycleStarter.java:128)
    at org.apache.maven.DefaultMaven.doExecute (DefaultMaven.java:305)
    at org.apache.maven.DefaultMaven.doExecute (DefaultMaven.java:192)
    at org.apache.maven.DefaultMaven.execute (DefaultMaven.java:105)
    at org.apache.maven.cli.MavenCli.execute (MavenCli.java:954)
    at org.apache.maven.cli.MavenCli.doMain (MavenCli.java:288)
    at org.apache.maven.cli.MavenCli.main (MavenCli.java:192)
    at sun.reflect.NativeMethodAccessorImpl.invoke0 (Native Method)
    at sun.reflect.NativeMethodAccessorImpl.invoke (NativeMethodAccessorImpl.java:62)
    at sun.reflect.DelegatingMethodAccessorImpl.invoke (DelegatingMethodAccessorImpl.java:43)
    at java.lang.reflect.Method.invoke (Method.java:498)
    at org.codehaus.plexus.classworlds.launcher.Launcher.launchEnhanced (Launcher.java:289)
    at org.codehaus.plexus.classworlds.launcher.Launcher.launch (Launcher.java:229)
    at org.codehaus.plexus.classworlds.launcher.Launcher.mainWithExitCode (Launcher.java:415)
    at org.codehaus.plexus.classworlds.launcher.Launcher.main (Launcher.java:356)
Caused by: org.apache.maven.plugin.MojoFailureException: You have 2 Checkstyle violations.
    at org.apache.maven.plugins.checkstyle.CheckstyleViolationCheckMojo.execute (CheckstyleViolationCheckMojo.java:576)
    at org.apache.maven.plugin.DefaultBuildPluginManager.executeMojo (DefaultBuildPluginManager.java:137)
    at org.apache.maven.lifecycle.internal.MojoExecutor.execute (MojoExecutor.java:208)
    at org.apache.maven.lifecycle.internal.MojoExecutor.execute (MojoExecutor.java:154)
    at org.apache.maven.lifecycle.internal.MojoExecutor.execute (MojoExecutor.java:146)
    at org.apache.maven.lifecycle.internal.LifecycleModuleBuilder.buildProject (LifecycleModuleBuilder.java:117)
    at org.apache.maven.lifecycle.internal.LifecycleModuleBuilder.buildProject (LifecycleModuleBuilder.java:81)
    at org.apache.maven.lifecycle.internal.builder.singlethreaded.SingleThreadedBuilder.build (SingleThreadedBuilder.java:56)
    at org.apache.maven.lifecycle.internal.LifecycleStarter.execute (LifecycleStarter.java:128)
    at org.apache.maven.DefaultMaven.doExecute (DefaultMaven.java:305)
    at org.apache.maven.DefaultMaven.doExecute (DefaultMaven.java:192)
    at org.apache.maven.DefaultMaven.execute (DefaultMaven.java:105)
    at org.apache.maven.cli.MavenCli.execute (MavenCli.java:954)
    at org.apache.maven.cli.MavenCli.doMain (MavenCli.java:288)
    at org.apache.maven.cli.MavenCli.main (MavenCli.java:192)
    at sun.reflect.NativeMethodAccessorImpl.invoke0 (Native Method)
    at sun.reflect.NativeMethodAccessorImpl.invoke (NativeMethodAccessorImpl.java:62)
    at sun.reflect.DelegatingMethodAccessorImpl.invoke (DelegatingMethodAccessorImpl.java:43)
    at java.lang.reflect.Method.invoke (Method.java:498)
    at org.codehaus.plexus.classworlds.launcher.Launcher.launchEnhanced (Launcher.java:289)
    at org.codehaus.plexus.classworlds.launcher.Launcher.launch (Launcher.java:229)
    at org.codehaus.plexus.classworlds.launcher.Launcher.mainWithExitCode (Launcher.java:415)
    at org.codehaus.plexus.classworlds.launcher.Launcher.main (Launcher.java:356)
[ERROR]
[ERROR] Re-run Maven using the -X switch to enable full debug logging.
[ERROR]
[ERROR] For more information about the errors and possible solutions, please read the following articles:
[ERROR] [Help 1] http://cwiki.apache.org/confluence/display/MAVEN/MojoFailureException
[ERROR]
[ERROR] After correcting the problems, you can resume the build with the command
[ERROR]   mvn <goals> -rf :surefire-junit-platform
[Pipeline] }
[Pipeline] // withEnv
[Pipeline] }
[Pipeline] // stage
[Pipeline] stage
[Pipeline] { (reporting linux-jdk7-maven3.5.x)
[Pipeline] fileExists
[Pipeline] fileExists
[Pipeline] archiveArtifacts
Archiving artifacts
‘*--linux-jdk7-maven3.5.x.zip’ doesn’t match anything
No artifacts found that match the file pattern "*--linux-jdk7-maven3.5.x.zip". Configuration error?
[Pipeline] }
[Pipeline] // stage
[Pipeline] stage
[Pipeline] { (cleanup linux-jdk7-maven3.5.x)
[Pipeline] cleanWs
[WS-CLEANUP] Deleting project workspace...
[WS-CLEANUP] Deferred wipeout is used...
[WS-CLEANUP] done
[Pipeline] }
[Pipeline] // stage
[Pipeline] }
[Pipeline] // timestamps
[Pipeline] }
[Pipeline] // node
[Pipeline] }
Failed in branch linux-jdk7-maven3.5.x
Cancelling nested steps due to timeout
[Pipeline] // node
[Pipeline] // node
[Pipeline] // node
[Pipeline] }
Failed in branch windows-jdk9-maven3.5.x
[Pipeline] }
Failed in branch windows-jdk8-maven3.5.x
[Pipeline] }
Failed in branch windows-jdk7-maven3.5.x
[Pipeline] // parallel
[Pipeline] echo
hudson.AbortException: hudson.AbortException: script returned exit code 1
[Pipeline] stage
[Pipeline] { (notifications)
[Pipeline] echo
Build result: FAILURE
[Pipeline] jiraIssueSelector
[Pipeline] emailext
Reply | Threaded
Open this post in threaded view
|

Build failed in Jenkins: Maven TLP » maven-surefire » SUREFIRE-1603 #5

Apache Jenkins Server-2
See https://builds.apache.org/job/maven-box/job/maven-surefire/job/SUREFIRE-1603/5/

Changes:

* Disable cleanWs() due to issues with file handles on Windows
* added a link to asf-gitpubsub-jenkins-plugin
* fixed markup (asciidoc, not markdown...)

All tests passed

Build log:
[...truncated 24250 lines...]
[INFO] Downloading from central: https://repo.maven.apache.org/maven2/org/junit/platform/junit-platform-launcher/1.3.1/junit-platform-launcher-1.3.1.jar
[INFO] Downloading from central: https://repo.maven.apache.org/maven2/org/apiguardian/apiguardian-api/1.0.0/apiguardian-api-1.0.0.jar
[INFO] Downloading from central: https://repo.maven.apache.org/maven2/org/junit/platform/junit-platform-engine/1.3.1/junit-platform-engine-1.3.1.jar
[INFO] Downloading from central: https://repo.maven.apache.org/maven2/org/junit/platform/junit-platform-commons/1.3.1/junit-platform-commons-1.3.1.jar
[INFO] Downloading from central: https://repo.maven.apache.org/maven2/org/opentest4j/opentest4j/1.1.1/opentest4j-1.1.1.jar
[INFO] Downloaded from central: https://repo.maven.apache.org/maven2/org/opentest4j/opentest4j/1.1.1/opentest4j-1.1.1.jar (7.1 kB at 198 kB/s)
[INFO] Downloading from central: https://repo.maven.apache.org/maven2/org/junit/jupiter/junit-jupiter-engine/5.3.1/junit-jupiter-engine-5.3.1.jar
[INFO] Downloaded from central: https://repo.maven.apache.org/maven2/org/apiguardian/apiguardian-api/1.0.0/apiguardian-api-1.0.0.jar (2.2 kB at 54 kB/s)
[INFO] Downloading from central: https://repo.maven.apache.org/maven2/org/junit/jupiter/junit-jupiter-api/5.3.1/junit-jupiter-api-5.3.1.jar
[INFO] Downloaded from central: https://repo.maven.apache.org/maven2/org/junit/platform/junit-platform-commons/1.3.1/junit-platform-commons-1.3.1.jar (78 kB at 1.9 MB/s)
[INFO] Downloading from central: https://repo.maven.apache.org/maven2/org/assertj/assertj-core/3.9.1/assertj-core-3.9.1.jar
[INFO] Downloaded from central: https://repo.maven.apache.org/maven2/org/junit/platform/junit-platform-launcher/1.3.1/junit-platform-launcher-1.3.1.jar (95 kB at 2.2 MB/s)
[INFO] Downloaded from central: https://repo.maven.apache.org/maven2/org/junit/platform/junit-platform-engine/1.3.1/junit-platform-engine-1.3.1.jar (135 kB at 2.5 MB/s)
[INFO] Downloaded from central: https://repo.maven.apache.org/maven2/org/junit/jupiter/junit-jupiter-engine/5.3.1/junit-jupiter-engine-5.3.1.jar (150 kB at 2.1 MB/s)
[INFO] Downloaded from central: https://repo.maven.apache.org/maven2/org/junit/jupiter/junit-jupiter-api/5.3.1/junit-jupiter-api-5.3.1.jar (115 kB at 1.4 MB/s)
[INFO] Downloaded from central: https://repo.maven.apache.org/maven2/org/assertj/assertj-core/3.9.1/assertj-core-3.9.1.jar (3.9 MB at 10 MB/s)
[INFO]
[INFO] --- maven-clean-plugin:3.1.0:clean (default-clean) @ surefire-junit-platform ---
[INFO]
[INFO] --- maven-enforcer-plugin:3.0.0-M2:enforce (enforce-maven-version) @ surefire-junit-platform ---
[INFO]
[INFO] --- maven-enforcer-plugin:3.0.0-M2:enforce (enforce-bytecode-version) @ surefire-junit-platform ---
[INFO]
[INFO] --- maven-enforcer-plugin:3.0.0-M2:enforce (ban-known-bad-maven-versions) @ surefire-junit-platform ---
[INFO]
[INFO] --- maven-enforcer-plugin:3.0.0-M2:enforce (enforce-java) @ surefire-junit-platform ---
[INFO]
[INFO] --- maven-enforcer-plugin:3.0.0-M2:enforce (enforce-maven) @ surefire-junit-platform ---
[INFO]
[INFO] --- apache-rat-plugin:0.12:check (rat-check) @ surefire-junit-platform ---
[INFO] Enabled default license matchers.
[INFO] Will parse SCM ignores for exclusions...
[INFO] Finished adding exclusions from SCM ignore files.
[INFO] 61 implicit excludes (use -debug for more details).
[INFO] Exclude: .repository/**
[INFO] Exclude: .maven/spy.log
[INFO] Exclude: dependency-reduced-pom.xml
[INFO] Exclude: .java-version
[INFO] Exclude: Jenkinsfile
[INFO] Exclude: README.md
[INFO] Exclude: .gitignore
[INFO] Exclude: .git/**/*
[INFO] Exclude: **/.idea
[INFO] Exclude: **/.svn/**/*
[INFO] Exclude: **/*.iml
[INFO] Exclude: **/*.ipr
[INFO] Exclude: **/*.iws
[INFO] Exclude: **/*.versionsBackup
[INFO] Exclude: **/dependency-reduced-pom.xml
[INFO] Exclude: .repository/**
[INFO] Exclude: src/test/resources/**/*
[INFO] Exclude: src/test/resources/**/*.css
[INFO] Exclude: **/*.jj
[INFO] Exclude: src/main/resources/META-INF/services/org.apache.maven.surefire.providerapi.SurefireProvider
[INFO] Exclude: DEPENDENCIES
[INFO] Exclude: .m2/**
[INFO] Exclude: .m2
[INFO] Exclude: .travis.yml
[INFO] 9 resources included (use -debug for more details)
[INFO] Rat check: Summary over all files. Unapproved: 0, unknown: 0, generated: 0, approved: 9 licenses.
[INFO]
[INFO] --- jacoco-maven-plugin:0.8.2:prepare-agent (jacoco-agent) @ surefire-junit-platform ---
[INFO] Skipping JaCoCo execution because property jacoco.skip is set.
[INFO] jacoco.agent set to empty
[INFO]
[INFO] --- maven-compiler-plugin:3.7.0:compile (compile-generated) @ surefire-junit-platform ---
[INFO] Nothing to compile - all classes are up to date
[INFO]
[INFO] --- maven-remote-resources-plugin:1.5:process (process-resource-bundles) @ surefire-junit-platform ---
[INFO]
[INFO] --- maven-resources-plugin:3.1.0:resources (default-resources) @ surefire-junit-platform ---
[INFO] Using 'UTF-8' encoding to copy filtered resources.
[INFO] Copying 1 resource
[INFO] Copying 3 resources
[INFO]
[INFO] --- maven-compiler-plugin:3.7.0:compile (default-compile) @ surefire-junit-platform ---
[INFO] Changes detected - recompiling the module!
[INFO] Compiling 4 source files to F:\jenkins\jenkins-slave\workspace\box_maven-surefire_SUREFIRE-1603\surefire-providers\surefire-junit-platform\target\classes
[INFO]
[INFO] --- animal-sniffer-maven-plugin:1.17:check (signature-check) @ surefire-junit-platform ---
[INFO] Checking unresolved references to org.codehaus.mojo.signature:java18:1.0
[INFO] Downloading from central: https://repo.maven.apache.org/maven2/org/codehaus/mojo/signature/java18/1.0/java18-1.0.signature
[INFO] Downloaded from central: https://repo.maven.apache.org/maven2/org/codehaus/mojo/signature/java18/1.0/java18-1.0.signature (2.0 MB at 9.6 MB/s)
[INFO]
[INFO] --- maven-resources-plugin:3.1.0:testResources (default-testResources) @ surefire-junit-platform ---
[INFO] Using 'UTF-8' encoding to copy filtered resources.
[INFO] skip non existing resourceDirectory F:\jenkins\jenkins-slave\workspace\box_maven-surefire_SUREFIRE-1603\surefire-providers\surefire-junit-platform\src\test\resources
[INFO] Copying 3 resources
[INFO]
[INFO] --- maven-compiler-plugin:3.7.0:testCompile (default-testCompile) @ surefire-junit-platform ---
[INFO] Changes detected - recompiling the module!
[INFO] Compiling 4 source files to F:\jenkins\jenkins-slave\workspace\box_maven-surefire_SUREFIRE-1603\surefire-providers\surefire-junit-platform\target\test-classes
[INFO]
[INFO] --- maven-surefire-plugin:2.12.4:test (default-test) @ surefire-junit-platform ---
[INFO] Surefire report directory: F:\jenkins\jenkins-slave\workspace\box_maven-surefire_SUREFIRE-1603\surefire-providers\surefire-junit-platform\target\surefire-reports
[INFO] Using configured provider org.apache.maven.surefire.shadefire.junit.JUnit3Provider

-------------------------------------------------------
 T E S T S
-------------------------------------------------------
Running org.apache.maven.surefire.junitplatform.JUnitPlatformProviderTest
Tests run: 0, Failures: 0, Errors: 0, Skipped: 0, Time elapsed: 0 sec
Running org.apache.maven.surefire.junitplatform.RunListenerAdapterTest
Tests run: 0, Failures: 0, Errors: 0, Skipped: 0, Time elapsed: 0 sec
Running org.apache.maven.surefire.junitplatform.TestMethodFilterTest
Tests run: 0, Failures: 0, Errors: 0, Skipped: 0, Time elapsed: 0 sec
Running org.apache.maven.surefire.junitplatform.TestPlanScannerFilterTest
Tests run: 0, Failures: 0, Errors: 0, Skipped: 0, Time elapsed: 0 sec

Results :

Tests run: 0, Failures: 0, Errors: 0, Skipped: 0

[INFO]
[INFO] --- maven-jar-plugin:3.1.0:jar (default-jar) @ surefire-junit-platform ---
[INFO] Building jar: F:\jenkins\jenkins-slave\workspace\box_maven-surefire_SUREFIRE-1603\surefire-providers\surefire-junit-platform\target\surefire-junit-platform-3.0.0-M2-SNAPSHOT.jar
[INFO]
[INFO] --- maven-site-plugin:3.7.1:attach-descriptor (attach-descriptor) @ surefire-junit-platform ---
[INFO] Skipping because packaging 'jar' is not pom.
[INFO]
[INFO] --- maven-checkstyle-plugin:3.0.0:check (checkstyle-check) @ surefire-junit-platform ---
[INFO] There are 2 errors reported by Checkstyle 6.18 with config/maven_checks.xml ruleset.
[ERROR] src\main\java\org\apache\maven\surefire\junitplatform\RunListenerAdapter.java:[206,13] (whitespace) ParenPad: '(' is not followed by whitespace.
[ERROR] src\main\java\org\apache\maven\surefire\junitplatform\RunListenerAdapter.java:[206,28] (whitespace) ParenPad: ')' is not preceded with whitespace.
[INFO] ------------------------------------------------------------------------
[INFO] Reactor Summary:
[INFO]
[INFO] Apache Maven Surefire .............................. SUCCESS [ 28.239 s]
[INFO] SureFire Logger API ................................ SUCCESS [  6.847 s]
[INFO] SureFire API ....................................... SUCCESS [ 13.613 s]
[INFO] SureFire Booter .................................... SUCCESS [ 15.348 s]
[INFO] Maven Surefire Test-Grouping Support ............... SUCCESS [  7.883 s]
[INFO] SureFire Providers ................................. SUCCESS [  1.531 s]
[INFO] Shared JUnit3 Provider Code ........................ SUCCESS [  5.403 s]
[INFO] Shared Java 5 Provider Base ........................ SUCCESS [  5.984 s]
[INFO] Shared JUnit4 Provider Code ........................ SUCCESS [  6.293 s]
[INFO] Shared JUnit48 Provider Code ....................... SUCCESS [  7.694 s]
[INFO] SureFire JUnit Runner .............................. SUCCESS [  5.611 s]
[INFO] SureFire JUnit4 Runner ............................. SUCCESS [  6.172 s]
[INFO] Maven Surefire Common .............................. SUCCESS [ 33.944 s]
[INFO] SureFire JUnitCore Runner .......................... SUCCESS [02:23 min]
[INFO] SureFire JUnit Platform Runner ..................... FAILURE [ 10.219 s]
[INFO] SureFire TestNG Utils .............................. SKIPPED
[INFO] SureFire TestNG Runner ............................. SKIPPED
[INFO] ShadeFire JUnit3 Provider .......................... SKIPPED
[INFO] Surefire Report Parser ............................. SKIPPED
[INFO] Maven Surefire Plugin .............................. SKIPPED
[INFO] Maven Failsafe Plugin .............................. SKIPPED
[INFO] Maven Surefire Report Plugin ....................... SKIPPED
[INFO] Maven Surefire Integration Tests ................... SKIPPED
[INFO] ------------------------------------------------------------------------
[INFO] BUILD FAILURE
[INFO] ------------------------------------------------------------------------
[INFO] Total time: 05:01 min
[INFO] Finished at: 2019-01-10T12:02:20Z
[INFO] Final Memory: 39M/130M
[INFO] ------------------------------------------------------------------------
[ERROR] Failed to execute goal org.apache.maven.plugins:maven-checkstyle-plugin:3.0.0:check (checkstyle-check) on project surefire-junit-platform: You have 2 Checkstyle violations. -> [Help 1]
org.apache.maven.lifecycle.LifecycleExecutionException: Failed to execute goal org.apache.maven.plugins:maven-checkstyle-plugin:3.0.0:check (checkstyle-check) on project surefire-junit-platform: You have 2 Checkstyle violations.
    at org.apache.maven.lifecycle.internal.MojoExecutor.execute (MojoExecutor.java:213)
    at org.apache.maven.lifecycle.internal.MojoExecutor.execute (MojoExecutor.java:154)
    at org.apache.maven.lifecycle.internal.MojoExecutor.execute (MojoExecutor.java:146)
    at org.apache.maven.lifecycle.internal.LifecycleModuleBuilder.buildProject (LifecycleModuleBuilder.java:117)
    at org.apache.maven.lifecycle.internal.LifecycleModuleBuilder.buildProject (LifecycleModuleBuilder.java:81)
    at org.apache.maven.lifecycle.internal.builder.singlethreaded.SingleThreadedBuilder.build (SingleThreadedBuilder.java:51)
    at org.apache.maven.lifecycle.internal.LifecycleStarter.execute (LifecycleStarter.java:128)
    at org.apache.maven.DefaultMaven.doExecute (DefaultMaven.java:309)
    at org.apache.maven.DefaultMaven.doExecute (DefaultMaven.java:194)
    at org.apache.maven.DefaultMaven.execute (DefaultMaven.java:107)
    at org.apache.maven.cli.MavenCli.execute (MavenCli.java:955)
    at org.apache.maven.cli.MavenCli.doMain (MavenCli.java:290)
    at org.apache.maven.cli.MavenCli.main (MavenCli.java:194)
    at sun.reflect.NativeMethodAccessorImpl.invoke0 (Native Method)
    at sun.reflect.NativeMethodAccessorImpl.invoke (NativeMethodAccessorImpl.java:62)
    at sun.reflect.DelegatingMethodAccessorImpl.invoke (DelegatingMethodAccessorImpl.java:43)
    at java.lang.reflect.Method.invoke (Method.java:498)
    at org.codehaus.plexus.classworlds.launcher.Launcher.launchEnhanced (Launcher.java:289)
    at org.codehaus.plexus.classworlds.launcher.Launcher.launch (Launcher.java:229)
    at org.codehaus.plexus.classworlds.launcher.Launcher.mainWithExitCode (Launcher.java:415)
    at org.codehaus.plexus.classworlds.launcher.Launcher.main (Launcher.java:356)
Caused by: org.apache.maven.plugin.MojoFailureException: You have 2 Checkstyle violations.
    at org.apache.maven.plugins.checkstyle.CheckstyleViolationCheckMojo.execute (CheckstyleViolationCheckMojo.java:576)
    at org.apache.maven.plugin.DefaultBuildPluginManager.executeMojo (DefaultBuildPluginManager.java:134)
    at org.apache.maven.lifecycle.internal.MojoExecutor.execute (MojoExecutor.java:208)
    at org.apache.maven.lifecycle.internal.MojoExecutor.execute (MojoExecutor.java:154)
    at org.apache.maven.lifecycle.internal.MojoExecutor.execute (MojoExecutor.java:146)
    at org.apache.maven.lifecycle.internal.LifecycleModuleBuilder.buildProject (LifecycleModuleBuilder.java:117)
    at org.apache.maven.lifecycle.internal.LifecycleModuleBuilder.buildProject (LifecycleModuleBuilder.java:81)
    at org.apache.maven.lifecycle.internal.builder.singlethreaded.SingleThreadedBuilder.build (SingleThreadedBuilder.java:51)
    at org.apache.maven.lifecycle.internal.LifecycleStarter.execute (LifecycleStarter.java:128)
    at org.apache.maven.DefaultMaven.doExecute (DefaultMaven.java:309)
    at org.apache.maven.DefaultMaven.doExecute (DefaultMaven.java:194)
    at org.apache.maven.DefaultMaven.execute (DefaultMaven.java:107)
    at org.apache.maven.cli.MavenCli.execute (MavenCli.java:955)
    at org.apache.maven.cli.MavenCli.doMain (MavenCli.java:290)
    at org.apache.maven.cli.MavenCli.main (MavenCli.java:194)
    at sun.reflect.NativeMethodAccessorImpl.invoke0 (Native Method)
    at sun.reflect.NativeMethodAccessorImpl.invoke (NativeMethodAccessorImpl.java:62)
    at sun.reflect.DelegatingMethodAccessorImpl.invoke (DelegatingMethodAccessorImpl.java:43)
    at java.lang.reflect.Method.invoke (Method.java:498)
    at org.codehaus.plexus.classworlds.launcher.Launcher.launchEnhanced (Launcher.java:289)
    at org.codehaus.plexus.classworlds.launcher.Launcher.launch (Launcher.java:229)
    at org.codehaus.plexus.classworlds.launcher.Launcher.mainWithExitCode (Launcher.java:415)
    at org.codehaus.plexus.classworlds.launcher.Launcher.main (Launcher.java:356)
[ERROR]
[ERROR] Re-run Maven using the -X switch to enable full debug logging.
[ERROR]
[ERROR] For more information about the errors and possible solutions, please read the following articles:
[ERROR] [Help 1] http://cwiki.apache.org/confluence/display/MAVEN/MojoFailureException
[ERROR]
[ERROR] After correcting the problems, you can resume the build with the command
[ERROR]   mvn <goals> -rf :surefire-junit-platform
[Pipeline] }
[Pipeline] // withEnv
[Pipeline] }
[Pipeline] // stage
[Pipeline] stage
[Pipeline] { (reporting windows-jdk7-maven3.5.x)
[Pipeline] fileExists
[Pipeline] fileExists
[Pipeline] archiveArtifacts
Archiving artifacts
‘*--windows-jdk7-maven3.5.x.zip’ doesn’t match anything
No artifacts found that match the file pattern "*--windows-jdk7-maven3.5.x.zip". Configuration error?
[Pipeline] }
[Pipeline] // stage
[Pipeline] stage
[Pipeline] { (cleanup windows-jdk7-maven3.5.x)
[Pipeline] cleanWs
[WS-CLEANUP] Deleting project workspace...
[WS-CLEANUP] Deferred wipeout is used...
[WS-CLEANUP] done
[Pipeline] }
[Pipeline] // stage
[Pipeline] }
[Pipeline] // timestamps
[Pipeline] }
[Pipeline] // node
[Pipeline] }
Failed in branch windows-jdk7-maven3.5.x
[Pipeline] // parallel
[Pipeline] echo
hudson.AbortException: hudson.AbortException: script returned exit code 1
[Pipeline] stage
[Pipeline] { (notifications)
[Pipeline] echo
Build result: FAILURE
[Pipeline] jiraIssueSelector
[Pipeline] emailext
Reply | Threaded
Open this post in threaded view
|

Build failed in Jenkins: Maven TLP » maven-surefire » SUREFIRE-1603 #6

Apache Jenkins Server-2
See https://builds.apache.org/job/maven-box/job/maven-surefire/job/SUREFIRE-1603/6/

Changes:

* Add JDK 13 (latest)
* INFRA-17514, lock to 1 Windows node
* Cause found, back to all Windows nodes
* Add support for Maven 3.6.x/3.6.0
* INFRA-17514 testing if this invoker keeps locks on the files.
* INFRA-17514 disable invokerPublisher() This is the root cause for the

All tests passed

Build log:
[...truncated 24252 lines...]
[INFO] Downloading from central: https://repo.maven.apache.org/maven2/org/junit/platform/junit-platform-launcher/1.3.1/junit-platform-launcher-1.3.1.jar
[INFO] Downloading from central: https://repo.maven.apache.org/maven2/org/apiguardian/apiguardian-api/1.0.0/apiguardian-api-1.0.0.jar
[INFO] Downloading from central: https://repo.maven.apache.org/maven2/org/junit/platform/junit-platform-engine/1.3.1/junit-platform-engine-1.3.1.jar
[INFO] Downloading from central: https://repo.maven.apache.org/maven2/org/opentest4j/opentest4j/1.1.1/opentest4j-1.1.1.jar
[INFO] Downloading from central: https://repo.maven.apache.org/maven2/org/junit/platform/junit-platform-commons/1.3.1/junit-platform-commons-1.3.1.jar
[INFO] Downloaded from central: https://repo.maven.apache.org/maven2/org/apiguardian/apiguardian-api/1.0.0/apiguardian-api-1.0.0.jar (2.2 kB at 80 kB/s)
[INFO] Downloading from central: https://repo.maven.apache.org/maven2/org/junit/jupiter/junit-jupiter-engine/5.3.1/junit-jupiter-engine-5.3.1.jar
[INFO] Downloaded from central: https://repo.maven.apache.org/maven2/org/opentest4j/opentest4j/1.1.1/opentest4j-1.1.1.jar (7.1 kB at 178 kB/s)
[INFO] Downloading from central: https://repo.maven.apache.org/maven2/org/junit/jupiter/junit-jupiter-api/5.3.1/junit-jupiter-api-5.3.1.jar
[INFO] Downloaded from central: https://repo.maven.apache.org/maven2/org/junit/platform/junit-platform-commons/1.3.1/junit-platform-commons-1.3.1.jar (78 kB at 1.6 MB/s)
[INFO] Downloading from central: https://repo.maven.apache.org/maven2/org/assertj/assertj-core/3.9.1/assertj-core-3.9.1.jar
[INFO] Downloaded from central: https://repo.maven.apache.org/maven2/org/junit/platform/junit-platform-launcher/1.3.1/junit-platform-launcher-1.3.1.jar (95 kB at 1.6 MB/s)
[INFO] Downloaded from central: https://repo.maven.apache.org/maven2/org/junit/platform/junit-platform-engine/1.3.1/junit-platform-engine-1.3.1.jar (135 kB at 2.3 MB/s)
[INFO] Downloaded from central: https://repo.maven.apache.org/maven2/org/junit/jupiter/junit-jupiter-engine/5.3.1/junit-jupiter-engine-5.3.1.jar (150 kB at 1.7 MB/s)
[INFO] Downloaded from central: https://repo.maven.apache.org/maven2/org/junit/jupiter/junit-jupiter-api/5.3.1/junit-jupiter-api-5.3.1.jar (115 kB at 1.3 MB/s)
[INFO] Downloaded from central: https://repo.maven.apache.org/maven2/org/assertj/assertj-core/3.9.1/assertj-core-3.9.1.jar (3.9 MB at 6.0 MB/s)
[INFO]
[INFO] --- maven-clean-plugin:3.1.0:clean (default-clean) @ surefire-junit-platform ---
[INFO]
[INFO] --- maven-enforcer-plugin:3.0.0-M2:enforce (enforce-maven-version) @ surefire-junit-platform ---
[INFO]
[INFO] --- maven-enforcer-plugin:3.0.0-M2:enforce (enforce-bytecode-version) @ surefire-junit-platform ---
[INFO]
[INFO] --- maven-enforcer-plugin:3.0.0-M2:enforce (ban-known-bad-maven-versions) @ surefire-junit-platform ---
[INFO]
[INFO] --- maven-enforcer-plugin:3.0.0-M2:enforce (enforce-java) @ surefire-junit-platform ---
[INFO]
[INFO] --- maven-enforcer-plugin:3.0.0-M2:enforce (enforce-maven) @ surefire-junit-platform ---
[INFO]
[INFO] --- apache-rat-plugin:0.12:check (rat-check) @ surefire-junit-platform ---
[INFO] Enabled default license matchers.
[INFO] Will parse SCM ignores for exclusions...
[INFO] Finished adding exclusions from SCM ignore files.
[INFO] 61 implicit excludes (use -debug for more details).
[INFO] Exclude: .repository/**
[INFO] Exclude: .maven/spy.log
[INFO] Exclude: dependency-reduced-pom.xml
[INFO] Exclude: .java-version
[INFO] Exclude: Jenkinsfile
[INFO] Exclude: README.md
[INFO] Exclude: .gitignore
[INFO] Exclude: .git/**/*
[INFO] Exclude: **/.idea
[INFO] Exclude: **/.svn/**/*
[INFO] Exclude: **/*.iml
[INFO] Exclude: **/*.ipr
[INFO] Exclude: **/*.iws
[INFO] Exclude: **/*.versionsBackup
[INFO] Exclude: **/dependency-reduced-pom.xml
[INFO] Exclude: .repository/**
[INFO] Exclude: src/test/resources/**/*
[INFO] Exclude: src/test/resources/**/*.css
[INFO] Exclude: **/*.jj
[INFO] Exclude: src/main/resources/META-INF/services/org.apache.maven.surefire.providerapi.SurefireProvider
[INFO] Exclude: DEPENDENCIES
[INFO] Exclude: .m2/**
[INFO] Exclude: .m2
[INFO] Exclude: .travis.yml
[INFO] 9 resources included (use -debug for more details)
[INFO] Rat check: Summary over all files. Unapproved: 0, unknown: 0, generated: 0, approved: 9 licenses.
[INFO]
[INFO] --- jacoco-maven-plugin:0.8.2:prepare-agent (jacoco-agent) @ surefire-junit-platform ---
[INFO] Skipping JaCoCo execution because property jacoco.skip is set.
[INFO] jacoco.agent set to empty
[INFO]
[INFO] --- maven-compiler-plugin:3.7.0:compile (compile-generated) @ surefire-junit-platform ---
[INFO] Nothing to compile - all classes are up to date
[INFO]
[INFO] --- maven-remote-resources-plugin:1.5:process (process-resource-bundles) @ surefire-junit-platform ---
[INFO]
[INFO] --- maven-resources-plugin:3.1.0:resources (default-resources) @ surefire-junit-platform ---
[INFO] Using 'UTF-8' encoding to copy filtered resources.
[INFO] Copying 1 resource
[INFO] Copying 3 resources
[INFO]
[INFO] --- maven-compiler-plugin:3.7.0:compile (default-compile) @ surefire-junit-platform ---
[INFO] Changes detected - recompiling the module!
[INFO] Compiling 4 source files to F:\jenkins\jenkins-slave\workspace\box_maven-surefire_SUREFIRE-1603\surefire-providers\surefire-junit-platform\target\classes
[INFO]
[INFO] --- animal-sniffer-maven-plugin:1.17:check (signature-check) @ surefire-junit-platform ---
[INFO] Checking unresolved references to org.codehaus.mojo.signature:java18:1.0
[INFO] Downloading from central: https://repo.maven.apache.org/maven2/org/codehaus/mojo/signature/java18/1.0/java18-1.0.signature
[INFO] Downloaded from central: https://repo.maven.apache.org/maven2/org/codehaus/mojo/signature/java18/1.0/java18-1.0.signature (2.0 MB at 6.7 MB/s)
[INFO]
[INFO] --- maven-resources-plugin:3.1.0:testResources (default-testResources) @ surefire-junit-platform ---
[INFO] Using 'UTF-8' encoding to copy filtered resources.
[INFO] skip non existing resourceDirectory F:\jenkins\jenkins-slave\workspace\box_maven-surefire_SUREFIRE-1603\surefire-providers\surefire-junit-platform\src\test\resources
[INFO] Copying 3 resources
[INFO]
[INFO] --- maven-compiler-plugin:3.7.0:testCompile (default-testCompile) @ surefire-junit-platform ---
[INFO] Changes detected - recompiling the module!
[INFO] Compiling 4 source files to F:\jenkins\jenkins-slave\workspace\box_maven-surefire_SUREFIRE-1603\surefire-providers\surefire-junit-platform\target\test-classes
[INFO]
[INFO] --- maven-surefire-plugin:2.12.4:test (default-test) @ surefire-junit-platform ---
[INFO] Surefire report directory: F:\jenkins\jenkins-slave\workspace\box_maven-surefire_SUREFIRE-1603\surefire-providers\surefire-junit-platform\target\surefire-reports
[INFO] Using configured provider org.apache.maven.surefire.shadefire.junit.JUnit3Provider

-------------------------------------------------------
 T E S T S
-------------------------------------------------------
Running org.apache.maven.surefire.junitplatform.JUnitPlatformProviderTest
Tests run: 0, Failures: 0, Errors: 0, Skipped: 0, Time elapsed: 0 sec
Running org.apache.maven.surefire.junitplatform.RunListenerAdapterTest
Tests run: 0, Failures: 0, Errors: 0, Skipped: 0, Time elapsed: 0 sec
Running org.apache.maven.surefire.junitplatform.TestMethodFilterTest
Tests run: 0, Failures: 0, Errors: 0, Skipped: 0, Time elapsed: 0 sec
Running org.apache.maven.surefire.junitplatform.TestPlanScannerFilterTest
Tests run: 0, Failures: 0, Errors: 0, Skipped: 0, Time elapsed: 0 sec

Results :

Tests run: 0, Failures: 0, Errors: 0, Skipped: 0

[INFO]
[INFO] --- maven-jar-plugin:3.1.0:jar (default-jar) @ surefire-junit-platform ---
[INFO] Building jar: F:\jenkins\jenkins-slave\workspace\box_maven-surefire_SUREFIRE-1603\surefire-providers\surefire-junit-platform\target\surefire-junit-platform-3.0.0-M2-SNAPSHOT.jar
[INFO]
[INFO] --- maven-site-plugin:3.7.1:attach-descriptor (attach-descriptor) @ surefire-junit-platform ---
[INFO] Skipping because packaging 'jar' is not pom.
[INFO]
[INFO] --- maven-checkstyle-plugin:3.0.0:check (checkstyle-check) @ surefire-junit-platform ---
[INFO] There are 2 errors reported by Checkstyle 6.18 with config/maven_checks.xml ruleset.
[ERROR] src\main\java\org\apache\maven\surefire\junitplatform\RunListenerAdapter.java:[206,13] (whitespace) ParenPad: '(' is not followed by whitespace.
[ERROR] src\main\java\org\apache\maven\surefire\junitplatform\RunListenerAdapter.java:[206,28] (whitespace) ParenPad: ')' is not preceded with whitespace.
[INFO] ------------------------------------------------------------------------
[INFO] Reactor Summary:
[INFO]
[INFO] Apache Maven Surefire .............................. SUCCESS [ 37.556 s]
[INFO] SureFire Logger API ................................ SUCCESS [  9.816 s]
[INFO] SureFire API ....................................... SUCCESS [ 23.122 s]
[INFO] SureFire Booter .................................... SUCCESS [ 23.607 s]
[INFO] Maven Surefire Test-Grouping Support ............... SUCCESS [ 12.696 s]
[INFO] SureFire Providers ................................. SUCCESS [  2.414 s]
[INFO] Shared JUnit3 Provider Code ........................ SUCCESS [  8.299 s]
[INFO] Shared Java 5 Provider Base ........................ SUCCESS [  9.845 s]
[INFO] Shared JUnit4 Provider Code ........................ SUCCESS [ 10.254 s]
[INFO] Shared JUnit48 Provider Code ....................... SUCCESS [ 11.573 s]
[INFO] SureFire JUnit Runner .............................. SUCCESS [  8.940 s]
[INFO] SureFire JUnit4 Runner ............................. SUCCESS [  9.541 s]
[INFO] Maven Surefire Common .............................. SUCCESS [ 54.608 s]
[INFO] SureFire JUnitCore Runner .......................... SUCCESS [02:34 min]
[INFO] SureFire JUnit Platform Runner ..................... FAILURE [ 17.014 s]
[INFO] SureFire TestNG Utils .............................. SKIPPED
[INFO] SureFire TestNG Runner ............................. SKIPPED
[INFO] ShadeFire JUnit3 Provider .......................... SKIPPED
[INFO] Surefire Report Parser ............................. SKIPPED
[INFO] Maven Surefire Plugin .............................. SKIPPED
[INFO] Maven Failsafe Plugin .............................. SKIPPED
[INFO] Maven Surefire Report Plugin ....................... SKIPPED
[INFO] Maven Surefire Integration Tests ................... SKIPPED
[INFO] ------------------------------------------------------------------------
[INFO] BUILD FAILURE
[INFO] ------------------------------------------------------------------------
[INFO] Total time: 06:37 min
[INFO] Finished at: 2019-01-20T11:58:27Z
[INFO] Final Memory: 39M/130M
[INFO] ------------------------------------------------------------------------
[ERROR] Failed to execute goal org.apache.maven.plugins:maven-checkstyle-plugin:3.0.0:check (checkstyle-check) on project surefire-junit-platform: You have 2 Checkstyle violations. -> [Help 1]
org.apache.maven.lifecycle.LifecycleExecutionException: Failed to execute goal org.apache.maven.plugins:maven-checkstyle-plugin:3.0.0:check (checkstyle-check) on project surefire-junit-platform: You have 2 Checkstyle violations.
    at org.apache.maven.lifecycle.internal.MojoExecutor.execute (MojoExecutor.java:213)
    at org.apache.maven.lifecycle.internal.MojoExecutor.execute (MojoExecutor.java:154)
    at org.apache.maven.lifecycle.internal.MojoExecutor.execute (MojoExecutor.java:146)
    at org.apache.maven.lifecycle.internal.LifecycleModuleBuilder.buildProject (LifecycleModuleBuilder.java:117)
    at org.apache.maven.lifecycle.internal.LifecycleModuleBuilder.buildProject (LifecycleModuleBuilder.java:81)
    at org.apache.maven.lifecycle.internal.builder.singlethreaded.SingleThreadedBuilder.build (SingleThreadedBuilder.java:51)
    at org.apache.maven.lifecycle.internal.LifecycleStarter.execute (LifecycleStarter.java:128)
    at org.apache.maven.DefaultMaven.doExecute (DefaultMaven.java:309)
    at org.apache.maven.DefaultMaven.doExecute (DefaultMaven.java:194)
    at org.apache.maven.DefaultMaven.execute (DefaultMaven.java:107)
    at org.apache.maven.cli.MavenCli.execute (MavenCli.java:955)
    at org.apache.maven.cli.MavenCli.doMain (MavenCli.java:290)
    at org.apache.maven.cli.MavenCli.main (MavenCli.java:194)
    at sun.reflect.NativeMethodAccessorImpl.invoke0 (Native Method)
    at sun.reflect.NativeMethodAccessorImpl.invoke (NativeMethodAccessorImpl.java:62)
    at sun.reflect.DelegatingMethodAccessorImpl.invoke (DelegatingMethodAccessorImpl.java:43)
    at java.lang.reflect.Method.invoke (Method.java:498)
    at org.codehaus.plexus.classworlds.launcher.Launcher.launchEnhanced (Launcher.java:289)
    at org.codehaus.plexus.classworlds.launcher.Launcher.launch (Launcher.java:229)
    at org.codehaus.plexus.classworlds.launcher.Launcher.mainWithExitCode (Launcher.java:415)
    at org.codehaus.plexus.classworlds.launcher.Launcher.main (Launcher.java:356)
Caused by: org.apache.maven.plugin.MojoFailureException: You have 2 Checkstyle violations.
    at org.apache.maven.plugins.checkstyle.CheckstyleViolationCheckMojo.execute (CheckstyleViolationCheckMojo.java:576)
    at org.apache.maven.plugin.DefaultBuildPluginManager.executeMojo (DefaultBuildPluginManager.java:134)
    at org.apache.maven.lifecycle.internal.MojoExecutor.execute (MojoExecutor.java:208)
    at org.apache.maven.lifecycle.internal.MojoExecutor.execute (MojoExecutor.java:154)
    at org.apache.maven.lifecycle.internal.MojoExecutor.execute (MojoExecutor.java:146)
    at org.apache.maven.lifecycle.internal.LifecycleModuleBuilder.buildProject (LifecycleModuleBuilder.java:117)
    at org.apache.maven.lifecycle.internal.LifecycleModuleBuilder.buildProject (LifecycleModuleBuilder.java:81)
    at org.apache.maven.lifecycle.internal.builder.singlethreaded.SingleThreadedBuilder.build (SingleThreadedBuilder.java:51)
    at org.apache.maven.lifecycle.internal.LifecycleStarter.execute (LifecycleStarter.java:128)
    at org.apache.maven.DefaultMaven.doExecute (DefaultMaven.java:309)
    at org.apache.maven.DefaultMaven.doExecute (DefaultMaven.java:194)
    at org.apache.maven.DefaultMaven.execute (DefaultMaven.java:107)
    at org.apache.maven.cli.MavenCli.execute (MavenCli.java:955)
    at org.apache.maven.cli.MavenCli.doMain (MavenCli.java:290)
    at org.apache.maven.cli.MavenCli.main (MavenCli.java:194)
    at sun.reflect.NativeMethodAccessorImpl.invoke0 (Native Method)
    at sun.reflect.NativeMethodAccessorImpl.invoke (NativeMethodAccessorImpl.java:62)
    at sun.reflect.DelegatingMethodAccessorImpl.invoke (DelegatingMethodAccessorImpl.java:43)
    at java.lang.reflect.Method.invoke (Method.java:498)
    at org.codehaus.plexus.classworlds.launcher.Launcher.launchEnhanced (Launcher.java:289)
    at org.codehaus.plexus.classworlds.launcher.Launcher.launch (Launcher.java:229)
    at org.codehaus.plexus.classworlds.launcher.Launcher.mainWithExitCode (Launcher.java:415)
    at org.codehaus.plexus.classworlds.launcher.Launcher.main (Launcher.java:356)
[ERROR]
[ERROR] Re-run Maven using the -X switch to enable full debug logging.
[ERROR]
[ERROR] For more information about the errors and possible solutions, please read the following articles:
[ERROR] [Help 1] http://cwiki.apache.org/confluence/display/MAVEN/MojoFailureException
[ERROR]
[ERROR] After correcting the problems, you can resume the build with the command
[ERROR]   mvn <goals> -rf :surefire-junit-platform
[Pipeline] }
[Pipeline] // withEnv
[Pipeline] }
[Pipeline] // stage
[Pipeline] stage
[Pipeline] { (reporting windows-jdk7-maven3.5.x)
[Pipeline] fileExists
[Pipeline] fileExists
[Pipeline] archiveArtifacts
Archiving artifacts
‘*--windows-jdk7-maven3.5.x.zip’ doesn’t match anything
No artifacts found that match the file pattern "*--windows-jdk7-maven3.5.x.zip". Configuration error?
[Pipeline] }
[Pipeline] // stage
[Pipeline] stage
[Pipeline] { (cleanup windows-jdk7-maven3.5.x)
[Pipeline] cleanWs
[WS-CLEANUP] Deleting project workspace...
[WS-CLEANUP] Deferred wipeout is used...
[WS-CLEANUP] done
[Pipeline] }
[Pipeline] // stage
[Pipeline] }
[Pipeline] // timestamps
[Pipeline] }
[Pipeline] // node
[Pipeline] }
Failed in branch windows-jdk7-maven3.5.x
[Pipeline] // parallel
[Pipeline] echo
hudson.AbortException: hudson.AbortException: script returned exit code 1
[Pipeline] stage
[Pipeline] { (notifications)
[Pipeline] echo
Build result: FAILURE
[Pipeline] jiraIssueSelector
[Pipeline] emailext
Reply | Threaded
Open this post in threaded view
|

Build failed in Jenkins: Maven TLP » maven-surefire » SUREFIRE-1603 #7

Apache Jenkins Server-2
See https://builds.apache.org/job/maven-box/job/maven-surefire/job/SUREFIRE-1603/7/

Changes:

* More verbose info about build exceptions
* Verbose info about failure - add bit more
* Revert: no access to currntBuild.rawBuild

All tests passed

Build log:
[...truncated 24158 lines...]
[INFO] Unpacking f:\jenkins\jenkins-slave\workspace\box_maven-surefire_SUREFIRE-1603\.m2\junit\junit\4.12\junit-4.12.jar to F:\jenkins\jenkins-slave\workspace\box_maven-surefire_SUREFIRE-1603\surefire-providers\surefire-junit47\target\endorsed-tmp with includes "org/junit/runner/notification/RunListener*" and excludes ""
[INFO]
[INFO] --- maven-assembly-plugin:3.0.0:single (patch-junit47) @ surefire-junit47 ---
[INFO] Downloading from central: https://repo.maven.apache.org/maven2/org/apache/maven/shared/maven-artifact-transfer/0.9.0/maven-artifact-transfer-0.9.0.pom
[INFO] Downloaded from central: https://repo.maven.apache.org/maven2/org/apache/maven/shared/maven-artifact-transfer/0.9.0/maven-artifact-transfer-0.9.0.pom (7.6 kB at 475 kB/s)
[INFO] Downloading from central: https://repo.maven.apache.org/maven2/org/apache/maven/shared/maven-common-artifact-filters/3.0.0/maven-common-artifact-filters-3.0.0.pom
[INFO] Downloaded from central: https://repo.maven.apache.org/maven2/org/apache/maven/shared/maven-common-artifact-filters/3.0.0/maven-common-artifact-filters-3.0.0.pom (4.8 kB at 370 kB/s)
[INFO] Downloading from central: https://repo.maven.apache.org/maven2/org/apache/maven/shared/maven-artifact-transfer/0.9.0/maven-artifact-transfer-0.9.0.jar
[INFO] Downloaded from central: https://repo.maven.apache.org/maven2/org/apache/maven/shared/maven-artifact-transfer/0.9.0/maven-artifact-transfer-0.9.0.jar (123 kB at 4.4 MB/s)
[INFO] Reading assembly descriptor: src/assembly/assembly.xml
[ERROR] OS=Windows and the assembly descriptor contains a *nix-specific root-relative-reference (starting with slash) /
[INFO] Building jar: F:\jenkins\jenkins-slave\workspace\box_maven-surefire_SUREFIRE-1603\surefire-providers\surefire-junit47\target\endorsed\junit-4.7-with-threadsafe-listener.jar
[INFO]
[INFO] --- maven-compiler-plugin:3.7.0:compile (compile-generated) @ surefire-junit47 ---
[INFO] Nothing to compile - all classes are up to date
[INFO]
[INFO] --- maven-remote-resources-plugin:1.5:process (process-resource-bundles) @ surefire-junit47 ---
[INFO]
[INFO] --- maven-resources-plugin:3.1.0:resources (default-resources) @ surefire-junit47 ---
[INFO] Using 'UTF-8' encoding to copy filtered resources.
[INFO] Copying 1 resource
[INFO] Copying 3 resources
[INFO]
[INFO] --- maven-compiler-plugin:3.7.0:compile (default-compile) @ surefire-junit47 ---
[INFO] Changes detected - recompiling the module!
[INFO] Compiling 39 source files to F:\jenkins\jenkins-slave\workspace\box_maven-surefire_SUREFIRE-1603\surefire-providers\surefire-junit47\target\classes
[INFO]
[INFO] --- animal-sniffer-maven-plugin:1.17:check (signature-check) @ surefire-junit47 ---
[INFO] Checking unresolved references to org.codehaus.mojo.signature:java17:1.0
[INFO]
[INFO] --- maven-dependency-plugin:3.1.1:copy (test) @ surefire-junit47 ---
[INFO] Configured Artifact: junit:junit:4.12:jar
[INFO] Copying junit-4.12.jar to F:\jenkins\jenkins-slave\workspace\box_maven-surefire_SUREFIRE-1603\surefire-providers\surefire-junit47\target\endorsed-test\junit-4.12.jar
[INFO]
[INFO] --- maven-resources-plugin:3.1.0:testResources (default-testResources) @ surefire-junit47 ---
[INFO] Using 'UTF-8' encoding to copy filtered resources.
[INFO] skip non existing resourceDirectory F:\jenkins\jenkins-slave\workspace\box_maven-surefire_SUREFIRE-1603\surefire-providers\surefire-junit47\src\test\resources
[INFO] Copying 3 resources
[INFO]
[INFO] --- maven-compiler-plugin:3.7.0:testCompile (default-testCompile) @ surefire-junit47 ---
[INFO] Changes detected - recompiling the module!
[INFO] Compiling 18 source files to F:\jenkins\jenkins-slave\workspace\box_maven-surefire_SUREFIRE-1603\surefire-providers\surefire-junit47\target\test-classes
[INFO]
[INFO] --- maven-surefire-plugin:2.12.4:test (default-test) @ surefire-junit47 ---
[INFO] Surefire report directory: F:\jenkins\jenkins-slave\workspace\box_maven-surefire_SUREFIRE-1603\surefire-providers\surefire-junit47\target\surefire-reports
[INFO] Using configured provider org.apache.maven.surefire.shadefire.junit.JUnit3Provider

-------------------------------------------------------
 T E S T S
-------------------------------------------------------
Running org.apache.maven.surefire.junitcore.JUnit47SuiteTest
Tests run: 129, Failures: 0, Errors: 1, Skipped: 0, Time elapsed: 148.972 sec <<< FAILURE!
separatePoolsWithSuiteAndSequentialClasses(org.apache.maven.surefire.junitcore.pc.ParallelComputerBuilderTest)  Time elapsed: 15.184 sec  <<< ERROR!
java.lang.AssertionError:
Expected: between <10450L> and <12250L>
     but: was <15160L>
        at org.hamcrest.MatcherAssert.assertThat(MatcherAssert.java:20)
        at org.junit.Assert.assertThat(Assert.java:956)
        at org.junit.Assert.assertThat(Assert.java:923)
        at org.apache.maven.surefire.junitcore.pc.ParallelComputerBuilderTest.separatePoolsWithSuiteAndSequentialClasses(ParallelComputerBuilderTest.java:345)
        at sun.reflect.NativeMethodAccessorImpl.invoke0(Native Method)
        at sun.reflect.NativeMethodAccessorImpl.invoke(NativeMethodAccessorImpl.java:57)
        at sun.reflect.DelegatingMethodAccessorImpl.invoke(DelegatingMethodAccessorImpl.java:43)
        at java.lang.reflect.Method.invoke(Method.java:606)
        at org.junit.runners.model.FrameworkMethod$1.runReflectiveCall(FrameworkMethod.java:50)
        at org.junit.internal.runners.model.ReflectiveCallable.run(ReflectiveCallable.java:12)
        at org.junit.runners.model.FrameworkMethod.invokeExplosively(FrameworkMethod.java:47)
        at org.junit.internal.runners.statements.InvokeMethod.evaluate(InvokeMethod.java:17)
        at org.junit.internal.runners.statements.RunBefores.evaluate(RunBefores.java:26)
        at org.junit.runners.ParentRunner.runLeaf(ParentRunner.java:325)
        at org.junit.runners.BlockJUnit4ClassRunner.runChild(BlockJUnit4ClassRunner.java:78)
        at org.junit.runners.BlockJUnit4ClassRunner.runChild(BlockJUnit4ClassRunner.java:57)
        at org.junit.runners.ParentRunner$3.run(ParentRunner.java:290)
        at org.junit.runners.ParentRunner$1.schedule(ParentRunner.java:71)
        at org.junit.runners.ParentRunner.runChildren(ParentRunner.java:288)
        at org.junit.runners.ParentRunner.access$000(ParentRunner.java:58)
        at org.junit.runners.ParentRunner$2.evaluate(ParentRunner.java:268)
        at org.junit.internal.runners.statements.RunBefores.evaluate(RunBefores.java:26)
        at org.junit.runners.ParentRunner.run(ParentRunner.java:363)
        at org.junit.runners.Suite.runChild(Suite.java:128)
        at org.junit.runners.Suite.runChild(Suite.java:27)
        at org.junit.runners.ParentRunner$3.run(ParentRunner.java:290)
        at org.junit.runners.ParentRunner$1.schedule(ParentRunner.java:71)
        at org.junit.runners.ParentRunner.runChildren(ParentRunner.java:288)
        at org.junit.runners.ParentRunner.access$000(ParentRunner.java:58)
        at org.junit.runners.ParentRunner$2.evaluate(ParentRunner.java:268)
        at org.junit.runners.ParentRunner.run(ParentRunner.java:363)
        at junit.framework.JUnit4TestAdapter.run(JUnit4TestAdapter.java:38)
        at sun.reflect.NativeMethodAccessorImpl.invoke0(Native Method)
        at sun.reflect.NativeMethodAccessorImpl.invoke(NativeMethodAccessorImpl.java:57)
        at sun.reflect.DelegatingMethodAccessorImpl.invoke(DelegatingMethodAccessorImpl.java:43)
        at java.lang.reflect.Method.invoke(Method.java:606)
        at org.apache.maven.surefire.shadefire.junit.JUnitTestSet.execute(JUnitTestSet.java:95)
        at org.apache.maven.surefire.shadefire.junit.JUnit3Provider.executeTestSet(JUnit3Provider.java:121)
        at org.apache.maven.surefire.shadefire.junit.JUnit3Provider.invoke(JUnit3Provider.java:98)
        at sun.reflect.NativeMethodAccessorImpl.invoke0(Native Method)
        at sun.reflect.NativeMethodAccessorImpl.invoke(NativeMethodAccessorImpl.java:57)
        at sun.reflect.DelegatingMethodAccessorImpl.invoke(DelegatingMethodAccessorImpl.java:43)
        at java.lang.reflect.Method.invoke(Method.java:606)
        at org.apache.maven.surefire.shadefire.util.ReflectionUtils.invokeMethodWithArray(ReflectionUtils.java:189)
        at org.apache.maven.surefire.shadefire.booter.ProviderFactory$ProviderProxy.invoke(ProviderFactory.java:165)
        at org.apache.maven.surefire.shadefire.booter.ProviderFactory.invokeProvider(ProviderFactory.java:85)
        at org.apache.maven.surefire.shadefire.booter.ForkedBooter.runSuitesInProcess(ForkedBooter.java:103)
        at org.apache.maven.surefire.shadefire.booter.ForkedBooter.main(ForkedBooter.java:74)


Results :

Tests in error:
  separatePoolsWithSuiteAndSequentialClasses(org.apache.maven.surefire.junitcore.pc.ParallelComputerBuilderTest): (..)

Tests run: 129, Failures: 0, Errors: 1, Skipped: 0

[INFO] ------------------------------------------------------------------------
[INFO] Reactor Summary:
[INFO]
[INFO] Apache Maven Surefire .............................. SUCCESS [ 26.472 s]
[INFO] SureFire Logger API ................................ SUCCESS [  5.190 s]
[INFO] SureFire API ....................................... SUCCESS [  9.887 s]
[INFO] SureFire Booter .................................... SUCCESS [ 10.401 s]
[INFO] Maven Surefire Test-Grouping Support ............... SUCCESS [  5.389 s]
[INFO] SureFire Providers ................................. SUCCESS [  0.748 s]
[INFO] Shared JUnit3 Provider Code ........................ SUCCESS [  2.667 s]
[INFO] Shared Java 5 Provider Base ........................ SUCCESS [  3.478 s]
[INFO] Shared JUnit4 Provider Code ........................ SUCCESS [  3.821 s]
[INFO] Shared JUnit48 Provider Code ....................... SUCCESS [  4.537 s]
[INFO] SureFire JUnit Runner .............................. SUCCESS [  3.060 s]
[INFO] SureFire JUnit4 Runner ............................. SUCCESS [  3.474 s]
[INFO] Maven Surefire Common .............................. SUCCESS [ 22.799 s]
[INFO] SureFire JUnitCore Runner .......................... FAILURE [02:51 min]
[INFO] SureFire JUnit Platform Runner ..................... SKIPPED
[INFO] SureFire TestNG Utils .............................. SKIPPED
[INFO] SureFire TestNG Runner ............................. SKIPPED
[INFO] ShadeFire JUnit3 Provider .......................... SKIPPED
[INFO] Surefire Report Parser ............................. SKIPPED
[INFO] Maven Surefire Plugin .............................. SKIPPED
[INFO] Maven Failsafe Plugin .............................. SKIPPED
[INFO] Maven Surefire Report Plugin ....................... SKIPPED
[INFO] Maven Surefire Integration Tests ................... SKIPPED
[INFO] ------------------------------------------------------------------------
[INFO] BUILD FAILURE
[INFO] ------------------------------------------------------------------------
[INFO] Total time: 04:35 min
[INFO] Finished at: 2019-01-31T12:19:23Z
[INFO] Final Memory: 43M/145M
[INFO] ------------------------------------------------------------------------
[ERROR] Failed to execute goal org.apache.maven.plugins:maven-surefire-plugin:2.12.4:test (default-test) on project surefire-junit47: There are test failures.
[ERROR]
[ERROR] Please refer to F:\jenkins\jenkins-slave\workspace\box_maven-surefire_SUREFIRE-1603\surefire-providers\surefire-junit47\target\surefire-reports for the individual test results.
[ERROR] -> [Help 1]
org.apache.maven.lifecycle.LifecycleExecutionException: Failed to execute goal org.apache.maven.plugins:maven-surefire-plugin:2.12.4:test (default-test) on project surefire-junit47: There are test failures.

Please refer to F:\jenkins\jenkins-slave\workspace\box_maven-surefire_SUREFIRE-1603\surefire-providers\surefire-junit47\target\surefire-reports for the individual test results.
    at org.apache.maven.lifecycle.internal.MojoExecutor.execute (MojoExecutor.java:213)
    at org.apache.maven.lifecycle.internal.MojoExecutor.execute (MojoExecutor.java:154)
    at org.apache.maven.lifecycle.internal.MojoExecutor.execute (MojoExecutor.java:146)
    at org.apache.maven.lifecycle.internal.LifecycleModuleBuilder.buildProject (LifecycleModuleBuilder.java:117)
    at org.apache.maven.lifecycle.internal.LifecycleModuleBuilder.buildProject (LifecycleModuleBuilder.java:81)
    at org.apache.maven.lifecycle.internal.builder.singlethreaded.SingleThreadedBuilder.build (SingleThreadedBuilder.java:51)
    at org.apache.maven.lifecycle.internal.LifecycleStarter.execute (LifecycleStarter.java:128)
    at org.apache.maven.DefaultMaven.doExecute (DefaultMaven.java:309)
    at org.apache.maven.DefaultMaven.doExecute (DefaultMaven.java:194)
    at org.apache.maven.DefaultMaven.execute (DefaultMaven.java:107)
    at org.apache.maven.cli.MavenCli.execute (MavenCli.java:955)
    at org.apache.maven.cli.MavenCli.doMain (MavenCli.java:290)
    at org.apache.maven.cli.MavenCli.main (MavenCli.java:194)
    at sun.reflect.NativeMethodAccessorImpl.invoke0 (Native Method)
    at sun.reflect.NativeMethodAccessorImpl.invoke (NativeMethodAccessorImpl.java:62)
    at sun.reflect.DelegatingMethodAccessorImpl.invoke (DelegatingMethodAccessorImpl.java:43)
    at java.lang.reflect.Method.invoke (Method.java:498)
    at org.codehaus.plexus.classworlds.launcher.Launcher.launchEnhanced (Launcher.java:289)
    at org.codehaus.plexus.classworlds.launcher.Launcher.launch (Launcher.java:229)
    at org.codehaus.plexus.classworlds.launcher.Launcher.mainWithExitCode (Launcher.java:415)
    at org.codehaus.plexus.classworlds.launcher.Launcher.main (Launcher.java:356)
Caused by: org.apache.maven.plugin.MojoFailureException: There are test failures.

Please refer to F:\jenkins\jenkins-slave\workspace\box_maven-surefire_SUREFIRE-1603\surefire-providers\surefire-junit47\target\surefire-reports for the individual test results.
    at org.apache.maven.plugin.surefire.SurefireHelper.reportExecution (SurefireHelper.java:83)
    at org.apache.maven.plugin.surefire.SurefirePlugin.writeSummary (SurefirePlugin.java:176)
    at org.apache.maven.plugin.surefire.SurefirePlugin.handleSummary (SurefirePlugin.java:150)
    at org.apache.maven.plugin.surefire.AbstractSurefireMojo.executeAfterPreconditionsChecked (AbstractSurefireMojo.java:650)
    at org.apache.maven.plugin.surefire.AbstractSurefireMojo.execute (AbstractSurefireMojo.java:586)
    at org.apache.maven.plugin.DefaultBuildPluginManager.executeMojo (DefaultBuildPluginManager.java:134)
    at org.apache.maven.lifecycle.internal.MojoExecutor.execute (MojoExecutor.java:208)
    at org.apache.maven.lifecycle.internal.MojoExecutor.execute (MojoExecutor.java:154)
    at org.apache.maven.lifecycle.internal.MojoExecutor.execute (MojoExecutor.java:146)
    at org.apache.maven.lifecycle.internal.LifecycleModuleBuilder.buildProject (LifecycleModuleBuilder.java:117)
    at org.apache.maven.lifecycle.internal.LifecycleModuleBuilder.buildProject (LifecycleModuleBuilder.java:81)
    at org.apache.maven.lifecycle.internal.builder.singlethreaded.SingleThreadedBuilder.build (SingleThreadedBuilder.java:51)
    at org.apache.maven.lifecycle.internal.LifecycleStarter.execute (LifecycleStarter.java:128)
    at org.apache.maven.DefaultMaven.doExecute (DefaultMaven.java:309)
    at org.apache.maven.DefaultMaven.doExecute (DefaultMaven.java:194)
    at org.apache.maven.DefaultMaven.execute (DefaultMaven.java:107)
    at org.apache.maven.cli.MavenCli.execute (MavenCli.java:955)
    at org.apache.maven.cli.MavenCli.doMain (MavenCli.java:290)
    at org.apache.maven.cli.MavenCli.main (MavenCli.java:194)
    at sun.reflect.NativeMethodAccessorImpl.invoke0 (Native Method)
    at sun.reflect.NativeMethodAccessorImpl.invoke (NativeMethodAccessorImpl.java:62)
    at sun.reflect.DelegatingMethodAccessorImpl.invoke (DelegatingMethodAccessorImpl.java:43)
    at java.lang.reflect.Method.invoke (Method.java:498)
    at org.codehaus.plexus.classworlds.launcher.Launcher.launchEnhanced (Launcher.java:289)
    at org.codehaus.plexus.classworlds.launcher.Launcher.launch (Launcher.java:229)
    at org.codehaus.plexus.classworlds.launcher.Launcher.mainWithExitCode (Launcher.java:415)
    at org.codehaus.plexus.classworlds.launcher.Launcher.main (Launcher.java:356)
[ERROR]
[ERROR] Re-run Maven using the -X switch to enable full debug logging.
[ERROR]
[ERROR] For more information about the errors and possible solutions, please read the following articles:
[ERROR] [Help 1] http://cwiki.apache.org/confluence/display/MAVEN/MojoFailureException
[ERROR]
[ERROR] After correcting the problems, you can resume the build with the command
[ERROR]   mvn <goals> -rf :surefire-junit47
[Pipeline] }
[Pipeline] // withEnv
[Pipeline] }
[Pipeline] // stage
[Pipeline] stage
[Pipeline] { (reporting windows-jdk7-maven3.5.x)
[Pipeline] fileExists
[Pipeline] fileExists
[Pipeline] archiveArtifacts
Archiving artifacts
‘*--windows-jdk7-maven3.5.x.zip’ doesn’t match anything
No artifacts found that match the file pattern "*--windows-jdk7-maven3.5.x.zip". Configuration error?
[Pipeline] }
[Pipeline] // stage
[Pipeline] stage
[Pipeline] { (cleanup windows-jdk7-maven3.5.x)
[Pipeline] cleanWs
[WS-CLEANUP] Deleting project workspace...
[WS-CLEANUP] Deferred wipeout is used...
[WS-CLEANUP] done
[Pipeline] }
[Pipeline] // stage
[Pipeline] }
[Pipeline] // timestamps
[Pipeline] }
[Pipeline] // node
[Pipeline] }
Failed in branch windows-jdk7-maven3.5.x
[Pipeline] // parallel
[Pipeline] echo
hudson.AbortException: hudson.AbortException: script returned exit code 1
[Pipeline] stage
[Pipeline] { (notifications)
[Pipeline] echo
Build result: FAILURE
[Pipeline] jiraIssueSelector
[Pipeline] emailext
Reply | Threaded
Open this post in threaded view
|

Build failed in Jenkins: Maven TLP » maven-surefire » SUREFIRE-1603 #8

Apache Jenkins Server-2
See https://builds.apache.org/job/maven-box/job/maven-surefire/job/SUREFIRE-1603/8/

Changes:

* JDK 12 is now in the Release Candidate Phase
* [INFRA-17514] Jenkins invoker-plugin updated by INFRA

All tests passed

Build log:
[...truncated 24258 lines...]
[INFO] Downloading from central: https://repo.maven.apache.org/maven2/org/junit/platform/junit-platform-launcher/1.3.1/junit-platform-launcher-1.3.1.jar
[INFO] Downloading from central: https://repo.maven.apache.org/maven2/org/apiguardian/apiguardian-api/1.0.0/apiguardian-api-1.0.0.jar
[INFO] Downloading from central: https://repo.maven.apache.org/maven2/org/junit/platform/junit-platform-engine/1.3.1/junit-platform-engine-1.3.1.jar
[INFO] Downloading from central: https://repo.maven.apache.org/maven2/org/junit/platform/junit-platform-commons/1.3.1/junit-platform-commons-1.3.1.jar
[INFO] Downloading from central: https://repo.maven.apache.org/maven2/org/opentest4j/opentest4j/1.1.1/opentest4j-1.1.1.jar
[INFO] Downloaded from central: https://repo.maven.apache.org/maven2/org/apiguardian/apiguardian-api/1.0.0/apiguardian-api-1.0.0.jar (2.2 kB at 58 kB/s)
[INFO] Downloading from central: https://repo.maven.apache.org/maven2/org/junit/jupiter/junit-jupiter-engine/5.3.1/junit-jupiter-engine-5.3.1.jar
[INFO] Downloaded from central: https://repo.maven.apache.org/maven2/org/junit/platform/junit-platform-launcher/1.3.1/junit-platform-launcher-1.3.1.jar (95 kB at 1.9 MB/s)
[INFO] Downloading from central: https://repo.maven.apache.org/maven2/org/junit/jupiter/junit-jupiter-api/5.3.1/junit-jupiter-api-5.3.1.jar
[INFO] Downloaded from central: https://repo.maven.apache.org/maven2/org/junit/platform/junit-platform-engine/1.3.1/junit-platform-engine-1.3.1.jar (135 kB at 2.4 MB/s)
[INFO] Downloading from central: https://repo.maven.apache.org/maven2/org/assertj/assertj-core/3.9.1/assertj-core-3.9.1.jar
[INFO] Downloaded from central: https://repo.maven.apache.org/maven2/org/junit/platform/junit-platform-commons/1.3.1/junit-platform-commons-1.3.1.jar (78 kB at 1.3 MB/s)
[INFO] Downloaded from central: https://repo.maven.apache.org/maven2/org/junit/jupiter/junit-jupiter-engine/5.3.1/junit-jupiter-engine-5.3.1.jar (150 kB at 1.9 MB/s)
[INFO] Downloaded from central: https://repo.maven.apache.org/maven2/org/junit/jupiter/junit-jupiter-api/5.3.1/junit-jupiter-api-5.3.1.jar (115 kB at 1.2 MB/s)
[INFO] Downloaded from central: https://repo.maven.apache.org/maven2/org/opentest4j/opentest4j/1.1.1/opentest4j-1.1.1.jar (7.1 kB at 68 kB/s)
[INFO] Downloaded from central: https://repo.maven.apache.org/maven2/org/assertj/assertj-core/3.9.1/assertj-core-3.9.1.jar (3.9 MB at 7.7 MB/s)
[INFO]
[INFO] --- maven-clean-plugin:3.1.0:clean (default-clean) @ surefire-junit-platform ---
[INFO]
[INFO] --- maven-enforcer-plugin:3.0.0-M2:enforce (enforce-maven-version) @ surefire-junit-platform ---
[INFO]
[INFO] --- maven-enforcer-plugin:3.0.0-M2:enforce (enforce-bytecode-version) @ surefire-junit-platform ---
[INFO]
[INFO] --- maven-enforcer-plugin:3.0.0-M2:enforce (ban-known-bad-maven-versions) @ surefire-junit-platform ---
[INFO]
[INFO] --- maven-enforcer-plugin:3.0.0-M2:enforce (enforce-java) @ surefire-junit-platform ---
[INFO]
[INFO] --- maven-enforcer-plugin:3.0.0-M2:enforce (enforce-maven) @ surefire-junit-platform ---
[INFO]
[INFO] --- apache-rat-plugin:0.12:check (rat-check) @ surefire-junit-platform ---
[INFO] Enabled default license matchers.
[INFO] Will parse SCM ignores for exclusions...
[INFO] Finished adding exclusions from SCM ignore files.
[INFO] 61 implicit excludes (use -debug for more details).
[INFO] Exclude: .repository/**
[INFO] Exclude: .maven/spy.log
[INFO] Exclude: dependency-reduced-pom.xml
[INFO] Exclude: .java-version
[INFO] Exclude: Jenkinsfile
[INFO] Exclude: README.md
[INFO] Exclude: .gitignore
[INFO] Exclude: .git/**/*
[INFO] Exclude: **/.idea
[INFO] Exclude: **/.svn/**/*
[INFO] Exclude: **/*.iml
[INFO] Exclude: **/*.ipr
[INFO] Exclude: **/*.iws
[INFO] Exclude: **/*.versionsBackup
[INFO] Exclude: **/dependency-reduced-pom.xml
[INFO] Exclude: .repository/**
[INFO] Exclude: src/test/resources/**/*
[INFO] Exclude: src/test/resources/**/*.css
[INFO] Exclude: **/*.jj
[INFO] Exclude: src/main/resources/META-INF/services/org.apache.maven.surefire.providerapi.SurefireProvider
[INFO] Exclude: DEPENDENCIES
[INFO] Exclude: .m2/**
[INFO] Exclude: .m2
[INFO] Exclude: .travis.yml
[INFO] 9 resources included (use -debug for more details)
[INFO] Rat check: Summary over all files. Unapproved: 0, unknown: 0, generated: 0, approved: 9 licenses.
[INFO]
[INFO] --- jacoco-maven-plugin:0.8.2:prepare-agent (jacoco-agent) @ surefire-junit-platform ---
[INFO] Skipping JaCoCo execution because property jacoco.skip is set.
[INFO] jacoco.agent set to empty
[INFO]
[INFO] --- maven-compiler-plugin:3.7.0:compile (compile-generated) @ surefire-junit-platform ---
[INFO] Nothing to compile - all classes are up to date
[INFO]
[INFO] --- maven-remote-resources-plugin:1.5:process (process-resource-bundles) @ surefire-junit-platform ---
[INFO]
[INFO] --- maven-resources-plugin:3.1.0:resources (default-resources) @ surefire-junit-platform ---
[INFO] Using 'UTF-8' encoding to copy filtered resources.
[INFO] Copying 1 resource
[INFO] Copying 3 resources
[INFO]
[INFO] --- maven-compiler-plugin:3.7.0:compile (default-compile) @ surefire-junit-platform ---
[INFO] Changes detected - recompiling the module!
[INFO] Compiling 4 source files to F:\jenkins\jenkins-slave\workspace\box_maven-surefire_SUREFIRE-1603\surefire-providers\surefire-junit-platform\target\classes
[INFO]
[INFO] --- animal-sniffer-maven-plugin:1.17:check (signature-check) @ surefire-junit-platform ---
[INFO] Checking unresolved references to org.codehaus.mojo.signature:java18:1.0
[INFO] Downloading from central: https://repo.maven.apache.org/maven2/org/codehaus/mojo/signature/java18/1.0/java18-1.0.signature
[INFO] Downloaded from central: https://repo.maven.apache.org/maven2/org/codehaus/mojo/signature/java18/1.0/java18-1.0.signature (2.0 MB at 6.6 MB/s)
[INFO]
[INFO] --- maven-resources-plugin:3.1.0:testResources (default-testResources) @ surefire-junit-platform ---
[INFO] Using 'UTF-8' encoding to copy filtered resources.
[INFO] skip non existing resourceDirectory F:\jenkins\jenkins-slave\workspace\box_maven-surefire_SUREFIRE-1603\surefire-providers\surefire-junit-platform\src\test\resources
[INFO] Copying 3 resources
[INFO]
[INFO] --- maven-compiler-plugin:3.7.0:testCompile (default-testCompile) @ surefire-junit-platform ---
[INFO] Changes detected - recompiling the module!
[INFO] Compiling 4 source files to F:\jenkins\jenkins-slave\workspace\box_maven-surefire_SUREFIRE-1603\surefire-providers\surefire-junit-platform\target\test-classes
[INFO]
[INFO] --- maven-surefire-plugin:2.12.4:test (default-test) @ surefire-junit-platform ---
[INFO] Surefire report directory: F:\jenkins\jenkins-slave\workspace\box_maven-surefire_SUREFIRE-1603\surefire-providers\surefire-junit-platform\target\surefire-reports
[INFO] Using configured provider org.apache.maven.surefire.shadefire.junit.JUnit3Provider

-------------------------------------------------------
 T E S T S
-------------------------------------------------------
Running org.apache.maven.surefire.junitplatform.JUnitPlatformProviderTest
Tests run: 0, Failures: 0, Errors: 0, Skipped: 0, Time elapsed: 0.001 sec
Running org.apache.maven.surefire.junitplatform.RunListenerAdapterTest
Tests run: 0, Failures: 0, Errors: 0, Skipped: 0, Time elapsed: 0 sec
Running org.apache.maven.surefire.junitplatform.TestMethodFilterTest
Tests run: 0, Failures: 0, Errors: 0, Skipped: 0, Time elapsed: 0 sec
Running org.apache.maven.surefire.junitplatform.TestPlanScannerFilterTest
Tests run: 0, Failures: 0, Errors: 0, Skipped: 0, Time elapsed: 0 sec

Results :

Tests run: 0, Failures: 0, Errors: 0, Skipped: 0

[INFO]
[INFO] --- maven-jar-plugin:3.1.0:jar (default-jar) @ surefire-junit-platform ---
[INFO] Building jar: F:\jenkins\jenkins-slave\workspace\box_maven-surefire_SUREFIRE-1603\surefire-providers\surefire-junit-platform\target\surefire-junit-platform-3.0.0-M2-SNAPSHOT.jar
[INFO]
[INFO] --- maven-site-plugin:3.7.1:attach-descriptor (attach-descriptor) @ surefire-junit-platform ---
[INFO] Skipping because packaging 'jar' is not pom.
[INFO]
[INFO] --- maven-checkstyle-plugin:3.0.0:check (checkstyle-check) @ surefire-junit-platform ---
[INFO] There are 2 errors reported by Checkstyle 6.18 with config/maven_checks.xml ruleset.
[ERROR] src\main\java\org\apache\maven\surefire\junitplatform\RunListenerAdapter.java:[206,13] (whitespace) ParenPad: '(' is not followed by whitespace.
[ERROR] src\main\java\org\apache\maven\surefire\junitplatform\RunListenerAdapter.java:[206,28] (whitespace) ParenPad: ')' is not preceded with whitespace.
[INFO] ------------------------------------------------------------------------
[INFO] Reactor Summary:
[INFO]
[INFO] Apache Maven Surefire .............................. SUCCESS [ 45.671 s]
[INFO] SureFire Logger API ................................ SUCCESS [ 12.115 s]
[INFO] SureFire API ....................................... SUCCESS [ 19.015 s]
[INFO] SureFire Booter .................................... SUCCESS [ 19.496 s]
[INFO] Maven Surefire Test-Grouping Support ............... SUCCESS [ 11.887 s]
[INFO] SureFire Providers ................................. SUCCESS [  1.554 s]
[INFO] Shared JUnit3 Provider Code ........................ SUCCESS [  6.588 s]
[INFO] Shared Java 5 Provider Base ........................ SUCCESS [  7.507 s]
[INFO] Shared JUnit4 Provider Code ........................ SUCCESS [  8.273 s]
[INFO] Shared JUnit48 Provider Code ....................... SUCCESS [  8.890 s]
[INFO] SureFire JUnit Runner .............................. SUCCESS [  6.442 s]
[INFO] SureFire JUnit4 Runner ............................. SUCCESS [  6.996 s]
[INFO] Maven Surefire Common .............................. SUCCESS [ 40.525 s]
[INFO] SureFire JUnitCore Runner .......................... SUCCESS [02:27 min]
[INFO] SureFire JUnit Platform Runner ..................... FAILURE [ 11.572 s]
[INFO] SureFire TestNG Utils .............................. SKIPPED
[INFO] SureFire TestNG Runner ............................. SKIPPED
[INFO] ShadeFire JUnit3 Provider .......................... SKIPPED
[INFO] Surefire Report Parser ............................. SKIPPED
[INFO] Maven Surefire Plugin .............................. SKIPPED
[INFO] Maven Failsafe Plugin .............................. SKIPPED
[INFO] Maven Surefire Report Plugin ....................... SKIPPED
[INFO] Maven Surefire Integration Tests ................... SKIPPED
[INFO] ------------------------------------------------------------------------
[INFO] BUILD FAILURE
[INFO] ------------------------------------------------------------------------
[INFO] Total time: 05:56 min
[INFO] Finished at: 2019-02-13T06:36:29-08:00
[INFO] Final Memory: 39M/130M
[INFO] ------------------------------------------------------------------------
[ERROR] Failed to execute goal org.apache.maven.plugins:maven-checkstyle-plugin:3.0.0:check (checkstyle-check) on project surefire-junit-platform: You have 2 Checkstyle violations. -> [Help 1]
org.apache.maven.lifecycle.LifecycleExecutionException: Failed to execute goal org.apache.maven.plugins:maven-checkstyle-plugin:3.0.0:check (checkstyle-check) on project surefire-junit-platform: You have 2 Checkstyle violations.
    at org.apache.maven.lifecycle.internal.MojoExecutor.execute (MojoExecutor.java:213)
    at org.apache.maven.lifecycle.internal.MojoExecutor.execute (MojoExecutor.java:154)
    at org.apache.maven.lifecycle.internal.MojoExecutor.execute (MojoExecutor.java:146)
    at org.apache.maven.lifecycle.internal.LifecycleModuleBuilder.buildProject (LifecycleModuleBuilder.java:117)
    at org.apache.maven.lifecycle.internal.LifecycleModuleBuilder.buildProject (LifecycleModuleBuilder.java:81)
    at org.apache.maven.lifecycle.internal.builder.singlethreaded.SingleThreadedBuilder.build (SingleThreadedBuilder.java:51)
    at org.apache.maven.lifecycle.internal.LifecycleStarter.execute (LifecycleStarter.java:128)
    at org.apache.maven.DefaultMaven.doExecute (DefaultMaven.java:309)
    at org.apache.maven.DefaultMaven.doExecute (DefaultMaven.java:194)
    at org.apache.maven.DefaultMaven.execute (DefaultMaven.java:107)
    at org.apache.maven.cli.MavenCli.execute (MavenCli.java:955)
    at org.apache.maven.cli.MavenCli.doMain (MavenCli.java:290)
    at org.apache.maven.cli.MavenCli.main (MavenCli.java:194)
    at sun.reflect.NativeMethodAccessorImpl.invoke0 (Native Method)
    at sun.reflect.NativeMethodAccessorImpl.invoke (NativeMethodAccessorImpl.java:62)
    at sun.reflect.DelegatingMethodAccessorImpl.invoke (DelegatingMethodAccessorImpl.java:43)
    at java.lang.reflect.Method.invoke (Method.java:498)
    at org.codehaus.plexus.classworlds.launcher.Launcher.launchEnhanced (Launcher.java:289)
    at org.codehaus.plexus.classworlds.launcher.Launcher.launch (Launcher.java:229)
    at org.codehaus.plexus.classworlds.launcher.Launcher.mainWithExitCode (Launcher.java:415)
    at org.codehaus.plexus.classworlds.launcher.Launcher.main (Launcher.java:356)
Caused by: org.apache.maven.plugin.MojoFailureException: You have 2 Checkstyle violations.
    at org.apache.maven.plugins.checkstyle.CheckstyleViolationCheckMojo.execute (CheckstyleViolationCheckMojo.java:576)
    at org.apache.maven.plugin.DefaultBuildPluginManager.executeMojo (DefaultBuildPluginManager.java:134)
    at org.apache.maven.lifecycle.internal.MojoExecutor.execute (MojoExecutor.java:208)
    at org.apache.maven.lifecycle.internal.MojoExecutor.execute (MojoExecutor.java:154)
    at org.apache.maven.lifecycle.internal.MojoExecutor.execute (MojoExecutor.java:146)
    at org.apache.maven.lifecycle.internal.LifecycleModuleBuilder.buildProject (LifecycleModuleBuilder.java:117)
    at org.apache.maven.lifecycle.internal.LifecycleModuleBuilder.buildProject (LifecycleModuleBuilder.java:81)
    at org.apache.maven.lifecycle.internal.builder.singlethreaded.SingleThreadedBuilder.build (SingleThreadedBuilder.java:51)
    at org.apache.maven.lifecycle.internal.LifecycleStarter.execute (LifecycleStarter.java:128)
    at org.apache.maven.DefaultMaven.doExecute (DefaultMaven.java:309)
    at org.apache.maven.DefaultMaven.doExecute (DefaultMaven.java:194)
    at org.apache.maven.DefaultMaven.execute (DefaultMaven.java:107)
    at org.apache.maven.cli.MavenCli.execute (MavenCli.java:955)
    at org.apache.maven.cli.MavenCli.doMain (MavenCli.java:290)
    at org.apache.maven.cli.MavenCli.main (MavenCli.java:194)
    at sun.reflect.NativeMethodAccessorImpl.invoke0 (Native Method)
    at sun.reflect.NativeMethodAccessorImpl.invoke (NativeMethodAccessorImpl.java:62)
    at sun.reflect.DelegatingMethodAccessorImpl.invoke (DelegatingMethodAccessorImpl.java:43)
    at java.lang.reflect.Method.invoke (Method.java:498)
    at org.codehaus.plexus.classworlds.launcher.Launcher.launchEnhanced (Launcher.java:289)
    at org.codehaus.plexus.classworlds.launcher.Launcher.launch (Launcher.java:229)
    at org.codehaus.plexus.classworlds.launcher.Launcher.mainWithExitCode (Launcher.java:415)
    at org.codehaus.plexus.classworlds.launcher.Launcher.main (Launcher.java:356)
[ERROR]
[ERROR] Re-run Maven using the -X switch to enable full debug logging.
[ERROR]
[ERROR] For more information about the errors and possible solutions, please read the following articles:
[ERROR] [Help 1] http://cwiki.apache.org/confluence/display/MAVEN/MojoFailureException
[ERROR]
[ERROR] After correcting the problems, you can resume the build with the command
[ERROR]   mvn <goals> -rf :surefire-junit-platform
[Pipeline] }
[Pipeline] // withEnv
[Pipeline] }
[Pipeline] // stage
[Pipeline] stage
[Pipeline] { (reporting windows-jdk7-maven3.5.x)
[Pipeline] fileExists
[Pipeline] fileExists
[Pipeline] archiveArtifacts
Archiving artifacts
‘*--windows-jdk7-maven3.5.x.zip’ doesn’t match anything
No artifacts found that match the file pattern "*--windows-jdk7-maven3.5.x.zip". Configuration error?
[Pipeline] }
[Pipeline] // stage
[Pipeline] stage
[Pipeline] { (cleanup windows-jdk7-maven3.5.x)
[Pipeline] cleanWs
[WS-CLEANUP] Deleting project workspace...
[WS-CLEANUP] Deferred wipeout is used...
[WS-CLEANUP] done
[Pipeline] }
[Pipeline] // stage
[Pipeline] }
[Pipeline] // timestamps
[Pipeline] }
[Pipeline] // node
[Pipeline] }
Failed in branch windows-jdk7-maven3.5.x
[Pipeline] // parallel
[Pipeline] echo
hudson.AbortException: hudson.AbortException: script returned exit code 1
[Pipeline] stage
[Pipeline] { (notifications)
[Pipeline] echo
Build result: FAILURE
[Pipeline] jiraIssueSelector
[Pipeline] emailext