Build failed in Jenkins: Maven TLP » maven-surefire » SUREFIRE-1602 #1

classic Classic list List threaded Threaded
2 messages Options
Reply | Threaded
Open this post in threaded view
|

Build failed in Jenkins: Maven TLP » maven-surefire » SUREFIRE-1602 #1

Apache Jenkins Server-2
See https://builds.apache.org/job/maven-box/job/maven-surefire/job/SUREFIRE-1602/1/

No changes.

1 tests failed.
FAILED:  org.apache.maven.surefire.its.Surefire1602IT.nonCanonicalPath

Error Message:
Exit code was non-zero: 1; command line and log =  /home/jenkins/tools/maven/apache-maven-3.5.4/bin/mvn -e --batch-mode -Dmaven.repo.local=/home/jenkins/jenkins-slave/workspace/aven-surefire_SUREFIRE-1602-PKUAZHJFJ64JC6OYM2NZCYEKIA7E26FZIZFK4NWSLYHB5HS6BNMQ/.m2 org.apache.maven.plugins:maven-clean-plugin:clean -Dsurefire.version=3.0.0-M2-SNAPSHOT -Djacoco.agent=-javaagent:/home/jenkins/jenkins-slave/workspace/aven-surefire_SUREFIRE-1602-PKUAZHJFJ64JC6OYM2NZCYEKIA7E26FZIZFK4NWSLYHB5HS6BNMQ/.m2/org/jacoco/org.jacoco.agent/0.8.2/org.jacoco.agent-0.8.2-runtime.jar=destfile=/home/jenkins/jenkins-slave/workspace/aven-surefire_SUREFIRE-1602-PKUAZHJFJ64JC6OYM2NZCYEKIA7E26FZIZFK4NWSLYHB5HS6BNMQ/surefire-its/target/jacoco-it.exec,append=true,includes=**/failsafe/*:**/failsafe/**/*:**/surefire/*:**/surefire/**/*,inclnolocationclasses=true,jmx=false -Dhttps.protocols=TLSv1,TLSv1.1,TLSv1.2 install [INFO] Error stacktraces are turned on. [INFO] Scanning for projects... [INFO] ------------------------------------------------------------------------ [INFO] Reactor Build Order: [INFO]  [INFO] testapp                                                            [pom] [INFO] testapp-application                                                [jar] [INFO] testapp-unit-tests                                                 [jar] [INFO] testapp-integration-tests                                          [jar] [INFO]  [INFO] ----------------------------< org:testapp >----------------------------- [INFO] Building testapp 1.0-SNAPSHOT                                      [1/4] [INFO] --------------------------------[ pom ]--------------------------------- [INFO]  [INFO] --- maven-clean-plugin:2.5:clean (default-cli) @ testapp --- [INFO]  [INFO] --- maven-install-plugin:2.4:install (default-install) @ testapp --- [INFO] Installing /home/jenkins/jenkins-slave/workspace/aven-surefire_SUREFIRE-1602-PKUAZHJFJ64JC6OYM2NZCYEKIA7E26FZIZFK4NWSLYHB5HS6BNMQ/surefire-its/target/Surefire1602IT_nonCanonicalPath/pom.xml to /home/jenkins/jenkins-slave/workspace/aven-surefire_SUREFIRE-1602-PKUAZHJFJ64JC6OYM2NZCYEKIA7E26FZIZFK4NWSLYHB5HS6BNMQ/.m2/org/testapp/1.0-SNAPSHOT/testapp-1.0-SNAPSHOT.pom [INFO]  [INFO] ----------------------< org:testapp-application >----------------------- [INFO] Building testapp-application 1.0-SNAPSHOT                          [2/4] [INFO] --------------------------------[ jar ]--------------------------------- [INFO]  [INFO] --- maven-clean-plugin:2.5:clean (default-cli) @ testapp-application --- [INFO]  [INFO] --- maven-resources-plugin:2.6:resources (default-resources) @ testapp-application --- [WARNING] Using platform encoding (ISO-8859-1 actually) to copy filtered resources, i.e. build is platform dependent! [INFO] skip non existing resourceDirectory /home/jenkins/jenkins-slave/workspace/aven-surefire_SUREFIRE-1602-PKUAZHJFJ64JC6OYM2NZCYEKIA7E26FZIZFK4NWSLYHB5HS6BNMQ/surefire-its/target/Surefire1602IT_nonCanonicalPath/application/src/main/resources [INFO]  [INFO] --- maven-compiler-plugin:3.1:compile (default-compile) @ testapp-application --- [INFO] No sources to compile [INFO]  [INFO] --- maven-resources-plugin:2.6:testResources (default-testResources) @ testapp-application --- [WARNING] Using platform encoding (ISO-8859-1 actually) to copy filtered resources, i.e. build is platform dependent! [INFO] skip non existing resourceDirectory /home/jenkins/jenkins-slave/workspace/aven-surefire_SUREFIRE-1602-PKUAZHJFJ64JC6OYM2NZCYEKIA7E26FZIZFK4NWSLYHB5HS6BNMQ/surefire-its/target/Surefire1602IT_nonCanonicalPath/application/src/test/resources [INFO]  [INFO] --- maven-compiler-plugin:3.1:testCompile (default-testCompile) @ testapp-application --- [INFO] No sources to compile [INFO]  [INFO] --- maven-surefire-plugin:2.12.4:test (default-test) @ testapp-application --- [INFO] No tests to run. [INFO]  [INFO] --- maven-jar-plugin:2.4:jar (default-jar) @ testapp-application --- [WARNING] JAR will be empty - no content was marked for inclusion! [INFO] Building jar: /home/jenkins/jenkins-slave/workspace/aven-surefire_SUREFIRE-1602-PKUAZHJFJ64JC6OYM2NZCYEKIA7E26FZIZFK4NWSLYHB5HS6BNMQ/surefire-its/target/Surefire1602IT_nonCanonicalPath/application/target/testapp-application-1.0-SNAPSHOT.jar [INFO]  [INFO] --- maven-install-plugin:2.4:install (default-install) @ testapp-application --- [INFO] Installing /home/jenkins/jenkins-slave/workspace/aven-surefire_SUREFIRE-1602-PKUAZHJFJ64JC6OYM2NZCYEKIA7E26FZIZFK4NWSLYHB5HS6BNMQ/surefire-its/target/Surefire1602IT_nonCanonicalPath/application/target/testapp-application-1.0-SNAPSHOT.jar to /home/jenkins/jenkins-slave/workspace/aven-surefire_SUREFIRE-1602-PKUAZHJFJ64JC6OYM2NZCYEKIA7E26FZIZFK4NWSLYHB5HS6BNMQ/.m2/org/testapp-application/1.0-SNAPSHOT/testapp-application-1.0-SNAPSHOT.jar [INFO] Installing /home/jenkins/jenkins-slave/workspace/aven-surefire_SUREFIRE-1602-PKUAZHJFJ64JC6OYM2NZCYEKIA7E26FZIZFK4NWSLYHB5HS6BNMQ/surefire-its/target/Surefire1602IT_nonCanonicalPath/application/pom.xml to /home/jenkins/jenkins-slave/workspace/aven-surefire_SUREFIRE-1602-PKUAZHJFJ64JC6OYM2NZCYEKIA7E26FZIZFK4NWSLYHB5HS6BNMQ/.m2/org/testapp-application/1.0-SNAPSHOT/testapp-application-1.0-SNAPSHOT.pom [INFO]  [INFO] -----------------------< org:testapp-unit-tests >----------------------- [INFO] Building testapp-unit-tests 1.0-SNAPSHOT                           [3/4] [INFO] --------------------------------[ jar ]--------------------------------- [INFO]  [INFO] --- maven-clean-plugin:2.5:clean (default-cli) @ testapp-unit-tests --- [INFO]  [INFO] --- maven-resources-plugin:2.6:resources (default-resources) @ testapp-unit-tests --- [WARNING] Using platform encoding (ISO-8859-1 actually) to copy filtered resources, i.e. build is platform dependent! [INFO] skip non existing resourceDirectory /home/jenkins/jenkins-slave/workspace/aven-surefire_SUREFIRE-1602-PKUAZHJFJ64JC6OYM2NZCYEKIA7E26FZIZFK4NWSLYHB5HS6BNMQ/surefire-its/target/Surefire1602IT_nonCanonicalPath/unit-tests/src/main/resources [INFO]  [INFO] --- maven-compiler-plugin:3.1:compile (default-compile) @ testapp-unit-tests --- [INFO] No sources to compile [INFO]  [INFO] --- maven-resources-plugin:2.6:testResources (default-testResources) @ testapp-unit-tests --- [WARNING] Using platform encoding (ISO-8859-1 actually) to copy filtered resources, i.e. build is platform dependent! [INFO] skip non existing resourceDirectory /home/jenkins/jenkins-slave/workspace/aven-surefire_SUREFIRE-1602-PKUAZHJFJ64JC6OYM2NZCYEKIA7E26FZIZFK4NWSLYHB5HS6BNMQ/surefire-its/target/Surefire1602IT_nonCanonicalPath/unit-tests/src/test/resources [INFO]  [INFO] --- maven-compiler-plugin:3.1:testCompile (default-testCompile) @ testapp-unit-tests --- [INFO] Changes detected - recompiling the module! [WARNING] File encoding has not been set, using platform encoding ISO-8859-1, i.e. build is platform dependent! [INFO] Compiling 1 source file to /home/jenkins/jenkins-slave/workspace/aven-surefire_SUREFIRE-1602-PKUAZHJFJ64JC6OYM2NZCYEKIA7E26FZIZFK4NWSLYHB5HS6BNMQ/surefire-its/target/Surefire1602IT_nonCanonicalPath/unit-tests/target/test-classes [INFO] ------------------------------------------------------------- [ERROR] COMPILATION ERROR :  [INFO] ------------------------------------------------------------- [ERROR] Source option 1.5 is no longer supported. Use 1.6 or later. [ERROR] Target option 1.5 is no longer supported. Use 1.6 or later. [INFO] 2 errors  [INFO] ------------------------------------------------------------- [INFO] ------------------------------------------------------------------------ [INFO] Reactor Summary: [INFO]  [INFO] testapp 1.0-SNAPSHOT ............................... SUCCESS [  0.371 s] [INFO] testapp-application ................................ SUCCESS [  1.038 s] [INFO] testapp-unit-tests ................................. FAILURE [  0.531 s] [INFO] testapp-integration-tests 1.0-SNAPSHOT ............. SKIPPED [INFO] ------------------------------------------------------------------------ [INFO] BUILD FAILURE [INFO] ------------------------------------------------------------------------ [INFO] Total time: 2.174 s [INFO] Finished at: 2018-12-04T17:21:59Z [INFO] ------------------------------------------------------------------------ [ERROR] Failed to execute goal org.apache.maven.plugins:maven-compiler-plugin:3.1:testCompile (default-testCompile) on project testapp-unit-tests: Compilation failure: Compilation failure:  [ERROR] Source option 1.5 is no longer supported. Use 1.6 or later. [ERROR] Target option 1.5 is no longer supported. Use 1.6 or later. [ERROR] -> [Help 1] org.apache.maven.lifecycle.LifecycleExecutionException: Failed to execute goal org.apache.maven.plugins:maven-compiler-plugin:3.1:testCompile (default-testCompile) on project testapp-unit-tests: Compilation failure     at org.apache.maven.lifecycle.internal.MojoExecutor.execute (MojoExecutor.java:213)     at org.apache.maven.lifecycle.internal.MojoExecutor.execute (MojoExecutor.java:154)     at org.apache.maven.lifecycle.internal.MojoExecutor.execute (MojoExecutor.java:146)     at org.apache.maven.lifecycle.internal.LifecycleModuleBuilder.buildProject (LifecycleModuleBuilder.java:117)     at org.apache.maven.lifecycle.internal.LifecycleModuleBuilder.buildProject (LifecycleModuleBuilder.java:81)     at org.apache.maven.lifecycle.internal.builder.singlethreaded.SingleThreadedBuilder.build (SingleThreadedBuilder.java:56)     at org.apache.maven.lifecycle.internal.LifecycleStarter.execute (LifecycleStarter.java:128)     at org.apache.maven.DefaultMaven.doExecute (DefaultMaven.java:305)     at org.apache.maven.DefaultMaven.doExecute (DefaultMaven.java:192)     at org.apache.maven.DefaultMaven.execute (DefaultMaven.java:105)     at org.apache.maven.cli.MavenCli.execute (MavenCli.java:954)     at org.apache.maven.cli.MavenCli.doMain (MavenCli.java:288)     at org.apache.maven.cli.MavenCli.main (MavenCli.java:192)     at jdk.internal.reflect.NativeMethodAccessorImpl.invoke0 (Native Method)     at jdk.internal.reflect.NativeMethodAccessorImpl.invoke (NativeMethodAccessorImpl.java:62)     at jdk.internal.reflect.DelegatingMethodAccessorImpl.invoke (DelegatingMethodAccessorImpl.java:43)     at java.lang.reflect.Method.invoke (Method.java:564)     at org.codehaus.plexus.classworlds.launcher.Launcher.launchEnhanced (Launcher.java:289)     at org.codehaus.plexus.classworlds.launcher.Launcher.launch (Launcher.java:229)     at org.codehaus.plexus.classworlds.launcher.Launcher.mainWithExitCode (Launcher.java:415)     at org.codehaus.plexus.classworlds.launcher.Launcher.main (Launcher.java:356) Caused by: org.apache.maven.plugin.compiler.CompilationFailureException: Compilation failure     at org.apache.maven.plugin.compiler.AbstractCompilerMojo.execute (AbstractCompilerMojo.java:858)     at org.apache.maven.plugin.compiler.TestCompilerMojo.execute (TestCompilerMojo.java:152)     at org.apache.maven.plugin.DefaultBuildPluginManager.executeMojo (DefaultBuildPluginManager.java:137)     at org.apache.maven.lifecycle.internal.MojoExecutor.execute (MojoExecutor.java:208)     at org.apache.maven.lifecycle.internal.MojoExecutor.execute (MojoExecutor.java:154)     at org.apache.maven.lifecycle.internal.MojoExecutor.execute (MojoExecutor.java:146)     at org.apache.maven.lifecycle.internal.LifecycleModuleBuilder.buildProject (LifecycleModuleBuilder.java:117)     at org.apache.maven.lifecycle.internal.LifecycleModuleBuilder.buildProject (LifecycleModuleBuilder.java:81)     at org.apache.maven.lifecycle.internal.builder.singlethreaded.SingleThreadedBuilder.build (SingleThreadedBuilder.java:56)     at org.apache.maven.lifecycle.internal.LifecycleStarter.execute (LifecycleStarter.java:128)     at org.apache.maven.DefaultMaven.doExecute (DefaultMaven.java:305)     at org.apache.maven.DefaultMaven.doExecute (DefaultMaven.java:192)     at org.apache.maven.DefaultMaven.execute (DefaultMaven.java:105)     at org.apache.maven.cli.MavenCli.execute (MavenCli.java:954)     at org.apache.maven.cli.MavenCli.doMain (MavenCli.java:288)     at org.apache.maven.cli.MavenCli.main (MavenCli.java:192)     at jdk.internal.reflect.NativeMethodAccessorImpl.invoke0 (Native Method)     at jdk.internal.reflect.NativeMethodAccessorImpl.invoke (NativeMethodAccessorImpl.java:62)     at jdk.internal.reflect.DelegatingMethodAccessorImpl.invoke (DelegatingMethodAccessorImpl.java:43)     at java.lang.reflect.Method.invoke (Method.java:564)     at org.codehaus.plexus.classworlds.launcher.Launcher.launchEnhanced (Launcher.java:289)     at org.codehaus.plexus.classworlds.launcher.Launcher.launch (Launcher.java:229)     at org.codehaus.plexus.classworlds.launcher.Launcher.mainWithExitCode (Launcher.java:415)     at org.codehaus.plexus.classworlds.launcher.Launcher.main (Launcher.java:356) [ERROR]  [ERROR] Re-run Maven using the -X switch to enable full debug logging. [ERROR]  [ERROR] For more information about the errors and possible solutions, please read the following articles: [ERROR] [Help 1] http://cwiki.apache.org/confluence/display/MAVEN/MojoFailureException [ERROR]  [ERROR] After correcting the problems, you can resume the build with the command [ERROR]   mvn <goals> -rf :testapp-unit-tests

Stack Trace:
org.apache.maven.surefire.its.fixture.SurefireVerifierException: Exit code was non-zero: 1; command line and log =
/home/jenkins/tools/maven/apache-maven-3.5.4/bin/mvn -e --batch-mode -Dmaven.repo.local=/home/jenkins/jenkins-slave/workspace/aven-surefire_SUREFIRE-1602-PKUAZHJFJ64JC6OYM2NZCYEKIA7E26FZIZFK4NWSLYHB5HS6BNMQ/.m2 org.apache.maven.plugins:maven-clean-plugin:clean -Dsurefire.version=3.0.0-M2-SNAPSHOT -Djacoco.agent=-javaagent:/home/jenkins/jenkins-slave/workspace/aven-surefire_SUREFIRE-1602-PKUAZHJFJ64JC6OYM2NZCYEKIA7E26FZIZFK4NWSLYHB5HS6BNMQ/.m2/org/jacoco/org.jacoco.agent/0.8.2/org.jacoco.agent-0.8.2-runtime.jar=destfile=/home/jenkins/jenkins-slave/workspace/aven-surefire_SUREFIRE-1602-PKUAZHJFJ64JC6OYM2NZCYEKIA7E26FZIZFK4NWSLYHB5HS6BNMQ/surefire-its/target/jacoco-it.exec,append=true,includes=**/failsafe/*:**/failsafe/**/*:**/surefire/*:**/surefire/**/*,inclnolocationclasses=true,jmx=false -Dhttps.protocols=TLSv1,TLSv1.1,TLSv1.2 install
[INFO] Error stacktraces are turned on.
[INFO] Scanning for projects...
[INFO] ------------------------------------------------------------------------
[INFO] Reactor Build Order:
[INFO]
[INFO] testapp                                                            [pom]
[INFO] testapp-application                                                [jar]
[INFO] testapp-unit-tests                                                 [jar]
[INFO] testapp-integration-tests                                          [jar]
[INFO]
[INFO] ----------------------------< org:testapp >-----------------------------
[INFO] Building testapp 1.0-SNAPSHOT                                      [1/4]
[INFO] --------------------------------[ pom ]---------------------------------
[INFO]
[INFO] --- maven-clean-plugin:2.5:clean (default-cli) @ testapp ---
[INFO]
[INFO] --- maven-install-plugin:2.4:install (default-install) @ testapp ---
[INFO] Installing /home/jenkins/jenkins-slave/workspace/aven-surefire_SUREFIRE-1602-PKUAZHJFJ64JC6OYM2NZCYEKIA7E26FZIZFK4NWSLYHB5HS6BNMQ/surefire-its/target/Surefire1602IT_nonCanonicalPath/pom.xml to /home/jenkins/jenkins-slave/workspace/aven-surefire_SUREFIRE-1602-PKUAZHJFJ64JC6OYM2NZCYEKIA7E26FZIZFK4NWSLYHB5HS6BNMQ/.m2/org/testapp/1.0-SNAPSHOT/testapp-1.0-SNAPSHOT.pom
[INFO]
[INFO] ----------------------< org:testapp-application >-----------------------
[INFO] Building testapp-application 1.0-SNAPSHOT                          [2/4]
[INFO] --------------------------------[ jar ]---------------------------------
[INFO]
[INFO] --- maven-clean-plugin:2.5:clean (default-cli) @ testapp-application ---
[INFO]
[INFO] --- maven-resources-plugin:2.6:resources (default-resources) @ testapp-application ---
[WARNING] Using platform encoding (ISO-8859-1 actually) to copy filtered resources, i.e. build is platform dependent!
[INFO] skip non existing resourceDirectory /home/jenkins/jenkins-slave/workspace/aven-surefire_SUREFIRE-1602-PKUAZHJFJ64JC6OYM2NZCYEKIA7E26FZIZFK4NWSLYHB5HS6BNMQ/surefire-its/target/Surefire1602IT_nonCanonicalPath/application/src/main/resources
[INFO]
[INFO] --- maven-compiler-plugin:3.1:compile (default-compile) @ testapp-application ---
[INFO] No sources to compile
[INFO]
[INFO] --- maven-resources-plugin:2.6:testResources (default-testResources) @ testapp-application ---
[WARNING] Using platform encoding (ISO-8859-1 actually) to copy filtered resources, i.e. build is platform dependent!
[INFO] skip non existing resourceDirectory /home/jenkins/jenkins-slave/workspace/aven-surefire_SUREFIRE-1602-PKUAZHJFJ64JC6OYM2NZCYEKIA7E26FZIZFK4NWSLYHB5HS6BNMQ/surefire-its/target/Surefire1602IT_nonCanonicalPath/application/src/test/resources
[INFO]
[INFO] --- maven-compiler-plugin:3.1:testCompile (default-testCompile) @ testapp-application ---
[INFO] No sources to compile
[INFO]
[INFO] --- maven-surefire-plugin:2.12.4:test (default-test) @ testapp-application ---
[INFO] No tests to run.
[INFO]
[INFO] --- maven-jar-plugin:2.4:jar (default-jar) @ testapp-application ---
[WARNING] JAR will be empty - no content was marked for inclusion!
[INFO] Building jar: /home/jenkins/jenkins-slave/workspace/aven-surefire_SUREFIRE-1602-PKUAZHJFJ64JC6OYM2NZCYEKIA7E26FZIZFK4NWSLYHB5HS6BNMQ/surefire-its/target/Surefire1602IT_nonCanonicalPath/application/target/testapp-application-1.0-SNAPSHOT.jar
[INFO]
[INFO] --- maven-install-plugin:2.4:install (default-install) @ testapp-application ---
[INFO] Installing /home/jenkins/jenkins-slave/workspace/aven-surefire_SUREFIRE-1602-PKUAZHJFJ64JC6OYM2NZCYEKIA7E26FZIZFK4NWSLYHB5HS6BNMQ/surefire-its/target/Surefire1602IT_nonCanonicalPath/application/target/testapp-application-1.0-SNAPSHOT.jar to /home/jenkins/jenkins-slave/workspace/aven-surefire_SUREFIRE-1602-PKUAZHJFJ64JC6OYM2NZCYEKIA7E26FZIZFK4NWSLYHB5HS6BNMQ/.m2/org/testapp-application/1.0-SNAPSHOT/testapp-application-1.0-SNAPSHOT.jar
[INFO] Installing /home/jenkins/jenkins-slave/workspace/aven-surefire_SUREFIRE-1602-PKUAZHJFJ64JC6OYM2NZCYEKIA7E26FZIZFK4NWSLYHB5HS6BNMQ/surefire-its/target/Surefire1602IT_nonCanonicalPath/application/pom.xml to /home/jenkins/jenkins-slave/workspace/aven-surefire_SUREFIRE-1602-PKUAZHJFJ64JC6OYM2NZCYEKIA7E26FZIZFK4NWSLYHB5HS6BNMQ/.m2/org/testapp-application/1.0-SNAPSHOT/testapp-application-1.0-SNAPSHOT.pom
[INFO]
[INFO] -----------------------< org:testapp-unit-tests >-----------------------
[INFO] Building testapp-unit-tests 1.0-SNAPSHOT                           [3/4]
[INFO] --------------------------------[ jar ]---------------------------------
[INFO]
[INFO] --- maven-clean-plugin:2.5:clean (default-cli) @ testapp-unit-tests ---
[INFO]
[INFO] --- maven-resources-plugin:2.6:resources (default-resources) @ testapp-unit-tests ---
[WARNING] Using platform encoding (ISO-8859-1 actually) to copy filtered resources, i.e. build is platform dependent!
[INFO] skip non existing resourceDirectory /home/jenkins/jenkins-slave/workspace/aven-surefire_SUREFIRE-1602-PKUAZHJFJ64JC6OYM2NZCYEKIA7E26FZIZFK4NWSLYHB5HS6BNMQ/surefire-its/target/Surefire1602IT_nonCanonicalPath/unit-tests/src/main/resources
[INFO]
[INFO] --- maven-compiler-plugin:3.1:compile (default-compile) @ testapp-unit-tests ---
[INFO] No sources to compile
[INFO]
[INFO] --- maven-resources-plugin:2.6:testResources (default-testResources) @ testapp-unit-tests ---
[WARNING] Using platform encoding (ISO-8859-1 actually) to copy filtered resources, i.e. build is platform dependent!
[INFO] skip non existing resourceDirectory /home/jenkins/jenkins-slave/workspace/aven-surefire_SUREFIRE-1602-PKUAZHJFJ64JC6OYM2NZCYEKIA7E26FZIZFK4NWSLYHB5HS6BNMQ/surefire-its/target/Surefire1602IT_nonCanonicalPath/unit-tests/src/test/resources
[INFO]
[INFO] --- maven-compiler-plugin:3.1:testCompile (default-testCompile) @ testapp-unit-tests ---
[INFO] Changes detected - recompiling the module!
[WARNING] File encoding has not been set, using platform encoding ISO-8859-1, i.e. build is platform dependent!
[INFO] Compiling 1 source file to /home/jenkins/jenkins-slave/workspace/aven-surefire_SUREFIRE-1602-PKUAZHJFJ64JC6OYM2NZCYEKIA7E26FZIZFK4NWSLYHB5HS6BNMQ/surefire-its/target/Surefire1602IT_nonCanonicalPath/unit-tests/target/test-classes
[INFO] -------------------------------------------------------------
[ERROR] COMPILATION ERROR :
[INFO] -------------------------------------------------------------
[ERROR] Source option 1.5 is no longer supported. Use 1.6 or later.
[ERROR] Target option 1.5 is no longer supported. Use 1.6 or later.
[INFO] 2 errors
[INFO] -------------------------------------------------------------
[INFO] ------------------------------------------------------------------------
[INFO] Reactor Summary:
[INFO]
[INFO] testapp 1.0-SNAPSHOT ............................... SUCCESS [  0.371 s]
[INFO] testapp-application ................................ SUCCESS [  1.038 s]
[INFO] testapp-unit-tests ................................. FAILURE [  0.531 s]
[INFO] testapp-integration-tests 1.0-SNAPSHOT ............. SKIPPED
[INFO] ------------------------------------------------------------------------
[INFO] BUILD FAILURE
[INFO] ------------------------------------------------------------------------
[INFO] Total time: 2.174 s
[INFO] Finished at: 2018-12-04T17:21:59Z
[INFO] ------------------------------------------------------------------------
[ERROR] Failed to execute goal org.apache.maven.plugins:maven-compiler-plugin:3.1:testCompile (default-testCompile) on project testapp-unit-tests: Compilation failure: Compilation failure:
[ERROR] Source option 1.5 is no longer supported. Use 1.6 or later.
[ERROR] Target option 1.5 is no longer supported. Use 1.6 or later.
[ERROR] -> [Help 1]
org.apache.maven.lifecycle.LifecycleExecutionException: Failed to execute goal org.apache.maven.plugins:maven-compiler-plugin:3.1:testCompile (default-testCompile) on project testapp-unit-tests: Compilation failure
    at org.apache.maven.lifecycle.internal.MojoExecutor.execute (MojoExecutor.java:213)
    at org.apache.maven.lifecycle.internal.MojoExecutor.execute (MojoExecutor.java:154)
    at org.apache.maven.lifecycle.internal.MojoExecutor.execute (MojoExecutor.java:146)
    at org.apache.maven.lifecycle.internal.LifecycleModuleBuilder.buildProject (LifecycleModuleBuilder.java:117)
    at org.apache.maven.lifecycle.internal.LifecycleModuleBuilder.buildProject (LifecycleModuleBuilder.java:81)
    at org.apache.maven.lifecycle.internal.builder.singlethreaded.SingleThreadedBuilder.build (SingleThreadedBuilder.java:56)
    at org.apache.maven.lifecycle.internal.LifecycleStarter.execute (LifecycleStarter.java:128)
    at org.apache.maven.DefaultMaven.doExecute (DefaultMaven.java:305)
    at org.apache.maven.DefaultMaven.doExecute (DefaultMaven.java:192)
    at org.apache.maven.DefaultMaven.execute (DefaultMaven.java:105)
    at org.apache.maven.cli.MavenCli.execute (MavenCli.java:954)
    at org.apache.maven.cli.MavenCli.doMain (MavenCli.java:288)
    at org.apache.maven.cli.MavenCli.main (MavenCli.java:192)
    at jdk.internal.reflect.NativeMethodAccessorImpl.invoke0 (Native Method)
    at jdk.internal.reflect.NativeMethodAccessorImpl.invoke (NativeMethodAccessorImpl.java:62)
    at jdk.internal.reflect.DelegatingMethodAccessorImpl.invoke (DelegatingMethodAccessorImpl.java:43)
    at java.lang.reflect.Method.invoke (Method.java:564)
    at org.codehaus.plexus.classworlds.launcher.Launcher.launchEnhanced (Launcher.java:289)
    at org.codehaus.plexus.classworlds.launcher.Launcher.launch (Launcher.java:229)
    at org.codehaus.plexus.classworlds.launcher.Launcher.mainWithExitCode (Launcher.java:415)
    at org.codehaus.plexus.classworlds.launcher.Launcher.main (Launcher.java:356)
Caused by: org.apache.maven.plugin.compiler.CompilationFailureException: Compilation failure
    at org.apache.maven.plugin.compiler.AbstractCompilerMojo.execute (AbstractCompilerMojo.java:858)
    at org.apache.maven.plugin.compiler.TestCompilerMojo.execute (TestCompilerMojo.java:152)
    at org.apache.maven.plugin.DefaultBuildPluginManager.executeMojo (DefaultBuildPluginManager.java:137)
    at org.apache.maven.lifecycle.internal.MojoExecutor.execute (MojoExecutor.java:208)
    at org.apache.maven.lifecycle.internal.MojoExecutor.execute (MojoExecutor.java:154)
    at org.apache.maven.lifecycle.internal.MojoExecutor.execute (MojoExecutor.java:146)
    at org.apache.maven.lifecycle.internal.LifecycleModuleBuilder.buildProject (LifecycleModuleBuilder.java:117)
    at org.apache.maven.lifecycle.internal.LifecycleModuleBuilder.buildProject (LifecycleModuleBuilder.java:81)
    at org.apache.maven.lifecycle.internal.builder.singlethreaded.SingleThreadedBuilder.build (SingleThreadedBuilder.java:56)
    at org.apache.maven.lifecycle.internal.LifecycleStarter.execute (LifecycleStarter.java:128)
    at org.apache.maven.DefaultMaven.doExecute (DefaultMaven.java:305)
    at org.apache.maven.DefaultMaven.doExecute (DefaultMaven.java:192)
    at org.apache.maven.DefaultMaven.execute (DefaultMaven.java:105)
    at org.apache.maven.cli.MavenCli.execute (MavenCli.java:954)
    at org.apache.maven.cli.MavenCli.doMain (MavenCli.java:288)
    at org.apache.maven.cli.MavenCli.main (MavenCli.java:192)
    at jdk.internal.reflect.NativeMethodAccessorImpl.invoke0 (Native Method)
    at jdk.internal.reflect.NativeMethodAccessorImpl.invoke (NativeMethodAccessorImpl.java:62)
    at jdk.internal.reflect.DelegatingMethodAccessorImpl.invoke (DelegatingMethodAccessorImpl.java:43)
    at java.lang.reflect.Method.invoke (Method.java:564)
    at org.codehaus.plexus.classworlds.launcher.Launcher.launchEnhanced (Launcher.java:289)
    at org.codehaus.plexus.classworlds.launcher.Launcher.launch (Launcher.java:229)
    at org.codehaus.plexus.classworlds.launcher.Launcher.mainWithExitCode (Launcher.java:415)
    at org.codehaus.plexus.classworlds.launcher.Launcher.main (Launcher.java:356)
[ERROR]
[ERROR] Re-run Maven using the -X switch to enable full debug logging.
[ERROR]
[ERROR] For more information about the errors and possible solutions, please read the following articles:
[ERROR] [Help 1] http://cwiki.apache.org/confluence/display/MAVEN/MojoFailureException
[ERROR]
[ERROR] After correcting the problems, you can resume the build with the command
[ERROR]   mvn <goals> -rf :testapp-unit-tests

        at org.apache.maven.surefire.its.fixture.MavenLauncher.executeCurrentGoals(MavenLauncher.java:305)
        at org.apache.maven.surefire.its.fixture.MavenLauncher.execute(MavenLauncher.java:292)
        at org.apache.maven.surefire.its.fixture.SurefireLauncher.executeInstall(SurefireLauncher.java:197)
        at org.apache.maven.surefire.its.Surefire1602IT.nonCanonicalPath(Surefire1602IT.java:40)
        at java.base/jdk.internal.reflect.NativeMethodAccessorImpl.invoke0(Native Method)
        at java.base/jdk.internal.reflect.NativeMethodAccessorImpl.invoke(NativeMethodAccessorImpl.java:62)
        at java.base/jdk.internal.reflect.DelegatingMethodAccessorImpl.invoke(DelegatingMethodAccessorImpl.java:43)
        at java.base/java.lang.reflect.Method.invoke(Method.java:564)
        at org.junit.runners.model.FrameworkMethod$1.runReflectiveCall(FrameworkMethod.java:50)
        at org.junit.internal.runners.model.ReflectiveCallable.run(ReflectiveCallable.java:12)
        at org.junit.runners.model.FrameworkMethod.invokeExplosively(FrameworkMethod.java:47)
        at org.junit.internal.runners.statements.InvokeMethod.evaluate(InvokeMethod.java:17)
        at org.junit.runners.ParentRunner.runLeaf(ParentRunner.java:325)
        at org.junit.runners.BlockJUnit4ClassRunner.runChild(BlockJUnit4ClassRunner.java:78)
        at org.junit.runners.BlockJUnit4ClassRunner.runChild(BlockJUnit4ClassRunner.java:57)
        at org.junit.runners.ParentRunner$3.run(ParentRunner.java:290)
        at org.junit.runners.ParentRunner$1.schedule(ParentRunner.java:71)
        at org.junit.runners.ParentRunner.runChildren(ParentRunner.java:288)
        at org.junit.runners.ParentRunner.access$000(ParentRunner.java:58)
        at org.junit.runners.ParentRunner$2.evaluate(ParentRunner.java:268)
        at org.junit.runners.ParentRunner.run(ParentRunner.java:363)
        at org.junit.runners.Suite.runChild(Suite.java:128)
        at org.junit.runners.Suite.runChild(Suite.java:27)
        at org.junit.runners.ParentRunner$3.run(ParentRunner.java:290)
        at org.junit.runners.ParentRunner$1.schedule(ParentRunner.java:71)
        at org.junit.runners.ParentRunner.runChildren(ParentRunner.java:288)
        at org.junit.runners.ParentRunner.access$000(ParentRunner.java:58)
        at org.junit.runners.ParentRunner$2.evaluate(ParentRunner.java:268)
        at org.junit.runners.ParentRunner.run(ParentRunner.java:363)
        at org.junit.runner.JUnitCore.run(JUnitCore.java:137)
        at org.junit.runner.JUnitCore.run(JUnitCore.java:115)
        at org.apache.maven.surefire.junitcore.JUnitCoreWrapper.execute(JUnitCoreWrapper.java:62)
        at org.apache.maven.surefire.junitcore.JUnitCoreProvider.invoke(JUnitCoreProvider.java:139)
        at java.base/jdk.internal.reflect.NativeMethodAccessorImpl.invoke0(Native Method)
        at java.base/jdk.internal.reflect.NativeMethodAccessorImpl.invoke(NativeMethodAccessorImpl.java:62)
        at java.base/jdk.internal.reflect.DelegatingMethodAccessorImpl.invoke(DelegatingMethodAccessorImpl.java:43)
        at java.base/java.lang.reflect.Method.invoke(Method.java:564)
        at org.apache.maven.surefire.util.ReflectionUtils.invokeMethodWithArray(ReflectionUtils.java:189)
        at org.apache.maven.surefire.booter.ProviderFactory$ProviderProxy.invoke(ProviderFactory.java:165)
        at org.apache.maven.surefire.booter.ProviderFactory.invokeProvider(ProviderFactory.java:85)
        at org.apache.maven.surefire.booter.ForkedBooter.runSuitesInProcess(ForkedBooter.java:115)
        at org.apache.maven.surefire.booter.ForkedBooter.main(ForkedBooter.java:75)
Caused by: org.apache.maven.it.VerificationException: Exit code was non-zero: 1; command line and log =
/home/jenkins/tools/maven/apache-maven-3.5.4/bin/mvn -e --batch-mode -Dmaven.repo.local=/home/jenkins/jenkins-slave/workspace/aven-surefire_SUREFIRE-1602-PKUAZHJFJ64JC6OYM2NZCYEKIA7E26FZIZFK4NWSLYHB5HS6BNMQ/.m2 org.apache.maven.plugins:maven-clean-plugin:clean -Dsurefire.version=3.0.0-M2-SNAPSHOT -Djacoco.agent=-javaagent:/home/jenkins/jenkins-slave/workspace/aven-surefire_SUREFIRE-1602-PKUAZHJFJ64JC6OYM2NZCYEKIA7E26FZIZFK4NWSLYHB5HS6BNMQ/.m2/org/jacoco/org.jacoco.agent/0.8.2/org.jacoco.agent-0.8.2-runtime.jar=destfile=/home/jenkins/jenkins-slave/workspace/aven-surefire_SUREFIRE-1602-PKUAZHJFJ64JC6OYM2NZCYEKIA7E26FZIZFK4NWSLYHB5HS6BNMQ/surefire-its/target/jacoco-it.exec,append=true,includes=**/failsafe/*:**/failsafe/**/*:**/surefire/*:**/surefire/**/*,inclnolocationclasses=true,jmx=false -Dhttps.protocols=TLSv1,TLSv1.1,TLSv1.2 install
[INFO] Error stacktraces are turned on.
[INFO] Scanning for projects...
[INFO] ------------------------------------------------------------------------
[INFO] Reactor Build Order:
[INFO]
[INFO] testapp                                                            [pom]
[INFO] testapp-application                                                [jar]
[INFO] testapp-unit-tests                                                 [jar]
[INFO] testapp-integration-tests                                          [jar]
[INFO]
[INFO] ----------------------------< org:testapp >-----------------------------
[INFO] Building testapp 1.0-SNAPSHOT                                      [1/4]
[INFO] --------------------------------[ pom ]---------------------------------
[INFO]
[INFO] --- maven-clean-plugin:2.5:clean (default-cli) @ testapp ---
[INFO]
[INFO] --- maven-install-plugin:2.4:install (default-install) @ testapp ---
[INFO] Installing /home/jenkins/jenkins-slave/workspace/aven-surefire_SUREFIRE-1602-PKUAZHJFJ64JC6OYM2NZCYEKIA7E26FZIZFK4NWSLYHB5HS6BNMQ/surefire-its/target/Surefire1602IT_nonCanonicalPath/pom.xml to /home/jenkins/jenkins-slave/workspace/aven-surefire_SUREFIRE-1602-PKUAZHJFJ64JC6OYM2NZCYEKIA7E26FZIZFK4NWSLYHB5HS6BNMQ/.m2/org/testapp/1.0-SNAPSHOT/testapp-1.0-SNAPSHOT.pom
[INFO]
[INFO] ----------------------< org:testapp-application >-----------------------
[INFO] Building testapp-application 1.0-SNAPSHOT                          [2/4]
[INFO] --------------------------------[ jar ]---------------------------------
[INFO]
[INFO] --- maven-clean-plugin:2.5:clean (default-cli) @ testapp-application ---
[INFO]
[INFO] --- maven-resources-plugin:2.6:resources (default-resources) @ testapp-application ---
[WARNING] Using platform encoding (ISO-8859-1 actually) to copy filtered resources, i.e. build is platform dependent!
[INFO] skip non existing resourceDirectory /home/jenkins/jenkins-slave/workspace/aven-surefire_SUREFIRE-1602-PKUAZHJFJ64JC6OYM2NZCYEKIA7E26FZIZFK4NWSLYHB5HS6BNMQ/surefire-its/target/Surefire1602IT_nonCanonicalPath/application/src/main/resources
[INFO]
[INFO] --- maven-compiler-plugin:3.1:compile (default-compile) @ testapp-application ---
[INFO] No sources to compile
[INFO]
[INFO] --- maven-resources-plugin:2.6:testResources (default-testResources) @ testapp-application ---
[WARNING] Using platform encoding (ISO-8859-1 actually) to copy filtered resources, i.e. build is platform dependent!
[INFO] skip non existing resourceDirectory /home/jenkins/jenkins-slave/workspace/aven-surefire_SUREFIRE-1602-PKUAZHJFJ64JC6OYM2NZCYEKIA7E26FZIZFK4NWSLYHB5HS6BNMQ/surefire-its/target/Surefire1602IT_nonCanonicalPath/application/src/test/resources
[INFO]
[INFO] --- maven-compiler-plugin:3.1:testCompile (default-testCompile) @ testapp-application ---
[INFO] No sources to compile
[INFO]
[INFO] --- maven-surefire-plugin:2.12.4:test (default-test) @ testapp-application ---
[INFO] No tests to run.
[INFO]
[INFO] --- maven-jar-plugin:2.4:jar (default-jar) @ testapp-application ---
[WARNING] JAR will be empty - no content was marked for inclusion!
[INFO] Building jar: /home/jenkins/jenkins-slave/workspace/aven-surefire_SUREFIRE-1602-PKUAZHJFJ64JC6OYM2NZCYEKIA7E26FZIZFK4NWSLYHB5HS6BNMQ/surefire-its/target/Surefire1602IT_nonCanonicalPath/application/target/testapp-application-1.0-SNAPSHOT.jar
[INFO]
[INFO] --- maven-install-plugin:2.4:install (default-install) @ testapp-application ---
[INFO] Installing /home/jenkins/jenkins-slave/workspace/aven-surefire_SUREFIRE-1602-PKUAZHJFJ64JC6OYM2NZCYEKIA7E26FZIZFK4NWSLYHB5HS6BNMQ/surefire-its/target/Surefire1602IT_nonCanonicalPath/application/target/testapp-application-1.0-SNAPSHOT.jar to /home/jenkins/jenkins-slave/workspace/aven-surefire_SUREFIRE-1602-PKUAZHJFJ64JC6OYM2NZCYEKIA7E26FZIZFK4NWSLYHB5HS6BNMQ/.m2/org/testapp-application/1.0-SNAPSHOT/testapp-application-1.0-SNAPSHOT.jar
[INFO] Installing /home/jenkins/jenkins-slave/workspace/aven-surefire_SUREFIRE-1602-PKUAZHJFJ64JC6OYM2NZCYEKIA7E26FZIZFK4NWSLYHB5HS6BNMQ/surefire-its/target/Surefire1602IT_nonCanonicalPath/application/pom.xml to /home/jenkins/jenkins-slave/workspace/aven-surefire_SUREFIRE-1602-PKUAZHJFJ64JC6OYM2NZCYEKIA7E26FZIZFK4NWSLYHB5HS6BNMQ/.m2/org/testapp-application/1.0-SNAPSHOT/testapp-application-1.0-SNAPSHOT.pom
[INFO]
[INFO] -----------------------< org:testapp-unit-tests >-----------------------
[INFO] Building testapp-unit-tests 1.0-SNAPSHOT                           [3/4]
[INFO] --------------------------------[ jar ]---------------------------------
[INFO]
[INFO] --- maven-clean-plugin:2.5:clean (default-cli) @ testapp-unit-tests ---
[INFO]
[INFO] --- maven-resources-plugin:2.6:resources (default-resources) @ testapp-unit-tests ---
[WARNING] Using platform encoding (ISO-8859-1 actually) to copy filtered resources, i.e. build is platform dependent!
[INFO] skip non existing resourceDirectory /home/jenkins/jenkins-slave/workspace/aven-surefire_SUREFIRE-1602-PKUAZHJFJ64JC6OYM2NZCYEKIA7E26FZIZFK4NWSLYHB5HS6BNMQ/surefire-its/target/Surefire1602IT_nonCanonicalPath/unit-tests/src/main/resources
[INFO]
[INFO] --- maven-compiler-plugin:3.1:compile (default-compile) @ testapp-unit-tests ---
[INFO] No sources to compile
[INFO]
[INFO] --- maven-resources-plugin:2.6:testResources (default-testResources) @ testapp-unit-tests ---
[WARNING] Using platform encoding (ISO-8859-1 actually) to copy filtered resources, i.e. build is platform dependent!
[INFO] skip non existing resourceDirectory /home/jenkins/jenkins-slave/workspace/aven-surefire_SUREFIRE-1602-PKUAZHJFJ64JC6OYM2NZCYEKIA7E26FZIZFK4NWSLYHB5HS6BNMQ/surefire-its/target/Surefire1602IT_nonCanonicalPath/unit-tests/src/test/resources
[INFO]
[INFO] --- maven-compiler-plugin:3.1:testCompile (default-testCompile) @ testapp-unit-tests ---
[INFO] Changes detected - recompiling the module!
[WARNING] File encoding has not been set, using platform encoding ISO-8859-1, i.e. build is platform dependent!
[INFO] Compiling 1 source file to /home/jenkins/jenkins-slave/workspace/aven-surefire_SUREFIRE-1602-PKUAZHJFJ64JC6OYM2NZCYEKIA7E26FZIZFK4NWSLYHB5HS6BNMQ/surefire-its/target/Surefire1602IT_nonCanonicalPath/unit-tests/target/test-classes
[INFO] -------------------------------------------------------------
[ERROR] COMPILATION ERROR :
[INFO] -------------------------------------------------------------
[ERROR] Source option 1.5 is no longer supported. Use 1.6 or later.
[ERROR] Target option 1.5 is no longer supported. Use 1.6 or later.
[INFO] 2 errors
[INFO] -------------------------------------------------------------
[INFO] ------------------------------------------------------------------------
[INFO] Reactor Summary:
[INFO]
[INFO] testapp 1.0-SNAPSHOT ............................... SUCCESS [  0.371 s]
[INFO] testapp-application ................................ SUCCESS [  1.038 s]
[INFO] testapp-unit-tests ................................. FAILURE [  0.531 s]
[INFO] testapp-integration-tests 1.0-SNAPSHOT ............. SKIPPED
[INFO] ------------------------------------------------------------------------
[INFO] BUILD FAILURE
[INFO] ------------------------------------------------------------------------
[INFO] Total time: 2.174 s
[INFO] Finished at: 2018-12-04T17:21:59Z
[INFO] ------------------------------------------------------------------------
[ERROR] Failed to execute goal org.apache.maven.plugins:maven-compiler-plugin:3.1:testCompile (default-testCompile) on project testapp-unit-tests: Compilation failure: Compilation failure:
[ERROR] Source option 1.5 is no longer supported. Use 1.6 or later.
[ERROR] Target option 1.5 is no longer supported. Use 1.6 or later.
[ERROR] -> [Help 1]
org.apache.maven.lifecycle.LifecycleExecutionException: Failed to execute goal org.apache.maven.plugins:maven-compiler-plugin:3.1:testCompile (default-testCompile) on project testapp-unit-tests: Compilation failure
    at org.apache.maven.lifecycle.internal.MojoExecutor.execute (MojoExecutor.java:213)
    at org.apache.maven.lifecycle.internal.MojoExecutor.execute (MojoExecutor.java:154)
    at org.apache.maven.lifecycle.internal.MojoExecutor.execute (MojoExecutor.java:146)
    at org.apache.maven.lifecycle.internal.LifecycleModuleBuilder.buildProject (LifecycleModuleBuilder.java:117)
    at org.apache.maven.lifecycle.internal.LifecycleModuleBuilder.buildProject (LifecycleModuleBuilder.java:81)
    at org.apache.maven.lifecycle.internal.builder.singlethreaded.SingleThreadedBuilder.build (SingleThreadedBuilder.java:56)
    at org.apache.maven.lifecycle.internal.LifecycleStarter.execute (LifecycleStarter.java:128)
    at org.apache.maven.DefaultMaven.doExecute (DefaultMaven.java:305)
    at org.apache.maven.DefaultMaven.doExecute (DefaultMaven.java:192)
    at org.apache.maven.DefaultMaven.execute (DefaultMaven.java:105)
    at org.apache.maven.cli.MavenCli.execute (MavenCli.java:954)
    at org.apache.maven.cli.MavenCli.doMain (MavenCli.java:288)
    at org.apache.maven.cli.MavenCli.main (MavenCli.java:192)
    at jdk.internal.reflect.NativeMethodAccessorImpl.invoke0 (Native Method)
    at jdk.internal.reflect.NativeMethodAccessorImpl.invoke (NativeMethodAccessorImpl.java:62)
    at jdk.internal.reflect.DelegatingMethodAccessorImpl.invoke (DelegatingMethodAccessorImpl.java:43)
    at java.lang.reflect.Method.invoke (Method.java:564)
    at org.codehaus.plexus.classworlds.launcher.Launcher.launchEnhanced (Launcher.java:289)
    at org.codehaus.plexus.classworlds.launcher.Launcher.launch (Launcher.java:229)
    at org.codehaus.plexus.classworlds.launcher.Launcher.mainWithExitCode (Launcher.java:415)
    at org.codehaus.plexus.classworlds.launcher.Launcher.main (Launcher.java:356)
Caused by: org.apache.maven.plugin.compiler.CompilationFailureException: Compilation failure
    at org.apache.maven.plugin.compiler.AbstractCompilerMojo.execute (AbstractCompilerMojo.java:858)
    at org.apache.maven.plugin.compiler.TestCompilerMojo.execute (TestCompilerMojo.java:152)
    at org.apache.maven.plugin.DefaultBuildPluginManager.executeMojo (DefaultBuildPluginManager.java:137)
    at org.apache.maven.lifecycle.internal.MojoExecutor.execute (MojoExecutor.java:208)
    at org.apache.maven.lifecycle.internal.MojoExecutor.execute (MojoExecutor.java:154)
    at org.apache.maven.lifecycle.internal.MojoExecutor.execute (MojoExecutor.java:146)
    at org.apache.maven.lifecycle.internal.LifecycleModuleBuilder.buildProject (LifecycleModuleBuilder.java:117)
    at org.apache.maven.lifecycle.internal.LifecycleModuleBuilder.buildProject (LifecycleModuleBuilder.java:81)
    at org.apache.maven.lifecycle.internal.builder.singlethreaded.SingleThreadedBuilder.build (SingleThreadedBuilder.java:56)
    at org.apache.maven.lifecycle.internal.LifecycleStarter.execute (LifecycleStarter.java:128)
    at org.apache.maven.DefaultMaven.doExecute (DefaultMaven.java:305)
    at org.apache.maven.DefaultMaven.doExecute (DefaultMaven.java:192)
    at org.apache.maven.DefaultMaven.execute (DefaultMaven.java:105)
    at org.apache.maven.cli.MavenCli.execute (MavenCli.java:954)
    at org.apache.maven.cli.MavenCli.doMain (MavenCli.java:288)
    at org.apache.maven.cli.MavenCli.main (MavenCli.java:192)
    at jdk.internal.reflect.NativeMethodAccessorImpl.invoke0 (Native Method)
    at jdk.internal.reflect.NativeMethodAccessorImpl.invoke (NativeMethodAccessorImpl.java:62)
    at jdk.internal.reflect.DelegatingMethodAccessorImpl.invoke (DelegatingMethodAccessorImpl.java:43)
    at java.lang.reflect.Method.invoke (Method.java:564)
    at org.codehaus.plexus.classworlds.launcher.Launcher.launchEnhanced (Launcher.java:289)
    at org.codehaus.plexus.classworlds.launcher.Launcher.launch (Launcher.java:229)
    at org.codehaus.plexus.classworlds.launcher.Launcher.mainWithExitCode (Launcher.java:415)
    at org.codehaus.plexus.classworlds.launcher.Launcher.main (Launcher.java:356)
[ERROR]
[ERROR] Re-run Maven using the -X switch to enable full debug logging.
[ERROR]
[ERROR] For more information about the errors and possible solutions, please read the following articles:
[ERROR] [Help 1] http://cwiki.apache.org/confluence/display/MAVEN/MojoFailureException
[ERROR]
[ERROR] After correcting the problems, you can resume the build with the command
[ERROR]   mvn <goals> -rf :testapp-unit-tests

        at org.apache.maven.it.Verifier.executeGoals(Verifier.java:1369)
        at org.apache.maven.surefire.its.fixture.MavenLauncher.executeCurrentGoals(MavenLauncher.java:300)
        ... 41 more




Build log:
[...truncated 16.11 MB...]
[windows-jdk9-maven3.5.x] [INFO] SureFire Logger API ................................ SUCCESS [  6.318 s]
[windows-jdk9-maven3.5.x] [INFO] SureFire API ....................................... SUCCESS [ 12.476 s]
[windows-jdk9-maven3.5.x] [INFO] SureFire Booter .................................... SUCCESS [ 13.920 s]
[windows-jdk9-maven3.5.x] [INFO] Maven Surefire Test-Grouping Support ............... SUCCESS [  6.895 s]
[windows-jdk9-maven3.5.x] [INFO] SureFire Providers ................................. SUCCESS [  1.267 s]
[windows-jdk9-maven3.5.x] [INFO] Shared JUnit3 Provider Code ........................ SUCCESS [  4.533 s]
[windows-jdk9-maven3.5.x] [INFO] Shared Java 5 Provider Base ........................ SUCCESS [  5.079 s]
[windows-jdk9-maven3.5.x] [INFO] Shared JUnit4 Provider Code ........................ SUCCESS [  5.669 s]
[windows-jdk9-maven3.5.x] [INFO] Shared JUnit48 Provider Code ....................... SUCCESS [  6.046 s]
[windows-jdk9-maven3.5.x] [INFO] SureFire JUnit Runner .............................. SUCCESS [  4.812 s]
[windows-jdk9-maven3.5.x] [INFO] SureFire JUnit4 Runner ............................. SUCCESS [  5.083 s]
[windows-jdk9-maven3.5.x] [INFO] Maven Surefire Common .............................. SUCCESS [ 29.057 s]
[windows-jdk9-maven3.5.x] [INFO] SureFire JUnitCore Runner .......................... SUCCESS [02:15 min]
[windows-jdk9-maven3.5.x] [INFO] SureFire JUnit Platform Runner ..................... SUCCESS [  9.518 s]
[windows-jdk9-maven3.5.x] [INFO] SureFire TestNG Utils .............................. SUCCESS [  5.370 s]
[windows-jdk9-maven3.5.x] [INFO] SureFire TestNG Runner ............................. SUCCESS [  5.654 s]
[windows-jdk9-maven3.5.x] [INFO] ShadeFire JUnit3 Provider .......................... SUCCESS [  1.534 s]
[windows-jdk9-maven3.5.x] [INFO] Surefire Report Parser ............................. SUCCESS [  6.375 s]
[windows-jdk9-maven3.5.x] [INFO] Maven Surefire Plugin .............................. SUCCESS [ 12.004 s]
[windows-jdk9-maven3.5.x] [INFO] Maven Failsafe Plugin .............................. SUCCESS [01:20 min]
[windows-jdk9-maven3.5.x] [INFO] Maven Surefire Report Plugin ....................... SUCCESS [ 15.605 s]
[windows-jdk9-maven3.5.x] [INFO] Maven Surefire Integration Tests ................... FAILURE [  01:19 h]
[windows-jdk9-maven3.5.x] [INFO] ------------------------------------------------------------------------
[windows-jdk9-maven3.5.x] [INFO] BUILD FAILURE
[windows-jdk9-maven3.5.x] [INFO] ------------------------------------------------------------------------
[windows-jdk9-maven3.5.x] [INFO] Total time: 01:26 h
[windows-jdk9-maven3.5.x] [INFO] Finished at: 2018-12-04T18:03:07Z
[windows-jdk9-maven3.5.x] [INFO] Final Memory: 50M/168M
[windows-jdk9-maven3.5.x] [INFO] ------------------------------------------------------------------------
[windows-jdk9-maven3.5.x] [ERROR] Failed to execute goal org.apache.maven.plugins:maven-failsafe-plugin:2.12.4:verify (default) on project surefire-its: There are test failures.
[windows-jdk9-maven3.5.x] [ERROR]
[windows-jdk9-maven3.5.x] [ERROR] Please refer to F:\jenkins\jenkins-slave\workspace\aven-surefire_SUREFIRE-1602-PKUAZHJFJ64JC6OYM2NZCYEKIA7E26FZIZFK4NWSLYHB5HS6BNMQ\surefire-its\target\failsafe-reports for the individual test results.
[windows-jdk9-maven3.5.x] [ERROR] -> [Help 1]
[windows-jdk9-maven3.5.x] org.apache.maven.lifecycle.LifecycleExecutionException: Failed to execute goal org.apache.maven.plugins:maven-failsafe-plugin:2.12.4:verify (default) on project surefire-its: There are test failures.
[windows-jdk9-maven3.5.x]
[windows-jdk9-maven3.5.x] Please refer to F:\jenkins\jenkins-slave\workspace\aven-surefire_SUREFIRE-1602-PKUAZHJFJ64JC6OYM2NZCYEKIA7E26FZIZFK4NWSLYHB5HS6BNMQ\surefire-its\target\failsafe-reports for the individual test results.
[windows-jdk9-maven3.5.x]     at org.apache.maven.lifecycle.internal.MojoExecutor.execute (MojoExecutor.java:213)
[windows-jdk9-maven3.5.x]     at org.apache.maven.lifecycle.internal.MojoExecutor.execute (MojoExecutor.java:154)
[windows-jdk9-maven3.5.x]     at org.apache.maven.lifecycle.internal.MojoExecutor.execute (MojoExecutor.java:146)
[windows-jdk9-maven3.5.x]     at org.apache.maven.lifecycle.internal.LifecycleModuleBuilder.buildProject (LifecycleModuleBuilder.java:117)
[windows-jdk9-maven3.5.x]     at org.apache.maven.lifecycle.internal.LifecycleModuleBuilder.buildProject (LifecycleModuleBuilder.java:81)
[windows-jdk9-maven3.5.x]     at org.apache.maven.lifecycle.internal.builder.singlethreaded.SingleThreadedBuilder.build (SingleThreadedBuilder.java:51)
[windows-jdk9-maven3.5.x]     at org.apache.maven.lifecycle.internal.LifecycleStarter.execute (LifecycleStarter.java:128)
[windows-jdk9-maven3.5.x]     at org.apache.maven.DefaultMaven.doExecute (DefaultMaven.java:309)
[windows-jdk9-maven3.5.x]     at org.apache.maven.DefaultMaven.doExecute (DefaultMaven.java:194)
[windows-jdk9-maven3.5.x]     at org.apache.maven.DefaultMaven.execute (DefaultMaven.java:107)
[windows-jdk9-maven3.5.x]     at org.apache.maven.cli.MavenCli.execute (MavenCli.java:955)
[windows-jdk9-maven3.5.x]     at org.apache.maven.cli.MavenCli.doMain (MavenCli.java:290)
[windows-jdk9-maven3.5.x]     at org.apache.maven.cli.MavenCli.main (MavenCli.java:194)
[windows-jdk9-maven3.5.x]     at sun.reflect.NativeMethodAccessorImpl.invoke0 (Native Method)
[windows-jdk9-maven3.5.x]     at sun.reflect.NativeMethodAccessorImpl.invoke (NativeMethodAccessorImpl.java:62)
[windows-jdk9-maven3.5.x]     at sun.reflect.DelegatingMethodAccessorImpl.invoke (DelegatingMethodAccessorImpl.java:43)
[windows-jdk9-maven3.5.x]     at java.lang.reflect.Method.invoke (Method.java:498)
[windows-jdk9-maven3.5.x]     at org.codehaus.plexus.classworlds.launcher.Launcher.launchEnhanced (Launcher.java:289)
[windows-jdk9-maven3.5.x]     at org.codehaus.plexus.classworlds.launcher.Launcher.launch (Launcher.java:229)
[windows-jdk9-maven3.5.x]     at org.codehaus.plexus.classworlds.launcher.Launcher.mainWithExitCode (Launcher.java:415)
[windows-jdk9-maven3.5.x]     at org.codehaus.plexus.classworlds.launcher.Launcher.main (Launcher.java:356)
[windows-jdk9-maven3.5.x] Caused by: org.apache.maven.plugin.MojoFailureException: There are test failures.
[windows-jdk9-maven3.5.x]
[windows-jdk9-maven3.5.x] Please refer to F:\jenkins\jenkins-slave\workspace\aven-surefire_SUREFIRE-1602-PKUAZHJFJ64JC6OYM2NZCYEKIA7E26FZIZFK4NWSLYHB5HS6BNMQ\surefire-its\target\failsafe-reports for the individual test results.
[windows-jdk9-maven3.5.x]     at org.apache.maven.plugin.surefire.SurefireHelper.reportExecution (SurefireHelper.java:121)
[windows-jdk9-maven3.5.x]     at org.apache.maven.plugin.failsafe.VerifyMojo.execute (VerifyMojo.java:202)
[windows-jdk9-maven3.5.x]     at org.apache.maven.plugin.DefaultBuildPluginManager.executeMojo (DefaultBuildPluginManager.java:134)
[windows-jdk9-maven3.5.x]     at org.apache.maven.lifecycle.internal.MojoExecutor.execute (MojoExecutor.java:208)
[windows-jdk9-maven3.5.x]     at org.apache.maven.lifecycle.internal.MojoExecutor.execute (MojoExecutor.java:154)
[windows-jdk9-maven3.5.x]     at org.apache.maven.lifecycle.internal.MojoExecutor.execute (MojoExecutor.java:146)
[windows-jdk9-maven3.5.x]     at org.apache.maven.lifecycle.internal.LifecycleModuleBuilder.buildProject (LifecycleModuleBuilder.java:117)
[windows-jdk9-maven3.5.x]     at org.apache.maven.lifecycle.internal.LifecycleModuleBuilder.buildProject (LifecycleModuleBuilder.java:81)
[windows-jdk9-maven3.5.x]     at org.apache.maven.lifecycle.internal.builder.singlethreaded.SingleThreadedBuilder.build (SingleThreadedBuilder.java:51)
[windows-jdk9-maven3.5.x]     at org.apache.maven.lifecycle.internal.LifecycleStarter.execute (LifecycleStarter.java:128)
[windows-jdk9-maven3.5.x]     at org.apache.maven.DefaultMaven.doExecute (DefaultMaven.java:309)
[windows-jdk9-maven3.5.x]     at org.apache.maven.DefaultMaven.doExecute (DefaultMaven.java:194)
[windows-jdk9-maven3.5.x]     at org.apache.maven.DefaultMaven.execute (DefaultMaven.java:107)
[windows-jdk9-maven3.5.x]     at org.apache.maven.cli.MavenCli.execute (MavenCli.java:955)
[windows-jdk9-maven3.5.x]     at org.apache.maven.cli.MavenCli.doMain (MavenCli.java:290)
[windows-jdk9-maven3.5.x]     at org.apache.maven.cli.MavenCli.main (MavenCli.java:194)
[windows-jdk9-maven3.5.x]     at sun.reflect.NativeMethodAccessorImpl.invoke0 (Native Method)
[windows-jdk9-maven3.5.x]     at sun.reflect.NativeMethodAccessorImpl.invoke (NativeMethodAccessorImpl.java:62)
[windows-jdk9-maven3.5.x]     at sun.reflect.DelegatingMethodAccessorImpl.invoke (DelegatingMethodAccessorImpl.java:43)
[windows-jdk9-maven3.5.x]     at java.lang.reflect.Method.invoke (Method.java:498)
[windows-jdk9-maven3.5.x]     at org.codehaus.plexus.classworlds.launcher.Launcher.launchEnhanced (Launcher.java:289)
[windows-jdk9-maven3.5.x]     at org.codehaus.plexus.classworlds.launcher.Launcher.launch (Launcher.java:229)
[windows-jdk9-maven3.5.x]     at org.codehaus.plexus.classworlds.launcher.Launcher.mainWithExitCode (Launcher.java:415)
[windows-jdk9-maven3.5.x]     at org.codehaus.plexus.classworlds.launcher.Launcher.main (Launcher.java:356)
[windows-jdk9-maven3.5.x] [ERROR]
[windows-jdk9-maven3.5.x] [ERROR] Re-run Maven using the -X switch to enable full debug logging.
[windows-jdk9-maven3.5.x] [ERROR]
[windows-jdk9-maven3.5.x] [ERROR] For more information about the errors and possible solutions, please read the following articles:
[windows-jdk9-maven3.5.x] [ERROR] [Help 1] http://cwiki.apache.org/confluence/display/MAVEN/MojoFailureException
[windows-jdk9-maven3.5.x] [ERROR]
[windows-jdk9-maven3.5.x] [ERROR] After correcting the problems, you can resume the build with the command
[windows-jdk9-maven3.5.x] [ERROR]   mvn <goals> -rf :surefire-its
[Pipeline] [windows-jdk9-maven3.5.x] }
[Pipeline] [windows-jdk9-maven3.5.x] // withEnv
[Pipeline] [windows-jdk9-maven3.5.x] }
[Pipeline] [windows-jdk9-maven3.5.x] // stage
[Pipeline] [windows-jdk9-maven3.5.x] stage
[Pipeline] [windows-jdk9-maven3.5.x] { (reporting windows-jdk9-maven3.5.x)
[Pipeline] [windows-jdk9-maven3.5.x] fileExists
[Pipeline] [windows-jdk9-maven3.5.x] zip
[windows-jdk9-maven3.5.x] Writing zip file of f:\jenkins\jenkins-slave\workspace\aven-surefire_SUREFIRE-1602-PKUAZHJFJ64JC6OYM2NZCYEKIA7E26FZIZFK4NWSLYHB5HS6BNMQ\maven-failsafe-plugin\target\it to f:\jenkins\jenkins-slave\workspace\aven-surefire_SUREFIRE-1602-PKUAZHJFJ64JC6OYM2NZCYEKIA7E26FZIZFK4NWSLYHB5HS6BNMQ\maven-failsafe-plugin--windows-jdk9-maven3.5.x.zip
[windows-jdk9-maven3.5.x] Zipped 83 entries.
[windows-jdk9-maven3.5.x] Archiving f:\jenkins\jenkins-slave\workspace\aven-surefire_SUREFIRE-1602-PKUAZHJFJ64JC6OYM2NZCYEKIA7E26FZIZFK4NWSLYHB5HS6BNMQ\maven-failsafe-plugin--windows-jdk9-maven3.5.x.zip
[windows-jdk9-maven3.5.x] [Fast Archiver] No prior successful build to compare, so performing full copy of artifacts
[Pipeline] [windows-jdk9-maven3.5.x] fileExists
[Pipeline] [windows-jdk9-maven3.5.x] zip
[windows-jdk9-maven3.5.x] Writing zip file of f:\jenkins\jenkins-slave\workspace\aven-surefire_SUREFIRE-1602-PKUAZHJFJ64JC6OYM2NZCYEKIA7E26FZIZFK4NWSLYHB5HS6BNMQ\surefire-its\target to f:\jenkins\jenkins-slave\workspace\aven-surefire_SUREFIRE-1602-PKUAZHJFJ64JC6OYM2NZCYEKIA7E26FZIZFK4NWSLYHB5HS6BNMQ\surefire-its--windows-jdk9-maven3.5.x.zip
[windows-jdk9-maven3.5.x] Zipped 16453 entries.
[windows-jdk9-maven3.5.x] Archiving f:\jenkins\jenkins-slave\workspace\aven-surefire_SUREFIRE-1602-PKUAZHJFJ64JC6OYM2NZCYEKIA7E26FZIZFK4NWSLYHB5HS6BNMQ\surefire-its--windows-jdk9-maven3.5.x.zip
[windows-jdk9-maven3.5.x] [Fast Archiver] No prior successful build to compare, so performing full copy of artifacts
[Pipeline] [windows-jdk9-maven3.5.x] archiveArtifacts
[windows-jdk9-maven3.5.x] Archiving artifacts
[windows-jdk9-maven3.5.x] [Fast Archiver] No prior successful build to compare, so performing full copy of artifacts
[Pipeline] [windows-jdk9-maven3.5.x] }
[Pipeline] [windows-jdk9-maven3.5.x] // stage
[Pipeline] [windows-jdk9-maven3.5.x] stage
[Pipeline] [windows-jdk9-maven3.5.x] { (cleanup windows-jdk9-maven3.5.x)
[Pipeline] [windows-jdk9-maven3.5.x] cleanWs
[windows-jdk9-maven3.5.x] [WS-CLEANUP] Deleting project workspace...[WS-CLEANUP] done
[Pipeline] [windows-jdk9-maven3.5.x] }
[Pipeline] [windows-jdk9-maven3.5.x] // stage
[Pipeline] [windows-jdk9-maven3.5.x] }
[Pipeline] [windows-jdk9-maven3.5.x] // timestamps
[Pipeline] [windows-jdk9-maven3.5.x] }
[Pipeline] [windows-jdk9-maven3.5.x] // node
[Pipeline] [windows-jdk9-maven3.5.x] }
[windows-jdk9-maven3.5.x] Failed in branch windows-jdk9-maven3.5.x
[windows-jdk7-maven3.5.x] Running org.apache.maven.surefire.its.jiras.Surefire946KillMainProcessInReusableForkIT
[windows-jdk7-maven3.5.x] Tests run: 3, Failures: 0, Errors: 0, Skipped: 0, Time elapsed: 25.592 sec
[windows-jdk7-maven3.5.x] Running org.apache.maven.surefire.its.jiras.Surefire972BizarreNoClassDefIT
[windows-jdk7-maven3.5.x] Tests run: 1, Failures: 0, Errors: 0, Skipped: 0, Time elapsed: 9.168 sec
[windows-jdk7-maven3.5.x] Running org.apache.maven.surefire.its.jiras.Surefire975DefaultVMEncodingIT
[windows-jdk7-maven3.5.x] Tests run: 1, Failures: 0, Errors: 0, Skipped: 0, Time elapsed: 7.591 sec
[windows-jdk7-maven3.5.x] Running org.apache.maven.surefire.its.jiras.Surefire979WrongClassLoaderIT
[windows-jdk7-maven3.5.x] Tests run: 1, Failures: 0, Errors: 0, Skipped: 0, Time elapsed: 6.637 sec
[windows-jdk7-maven3.5.x] Running org.apache.maven.surefire.its.jiras.Surefire985ParameterizedRunnerAndCategoriesIT
[windows-jdk7-maven3.5.x] Tests run: 1, Failures: 0, Errors: 0, Skipped: 0, Time elapsed: 5.933 sec
[windows-jdk7-maven3.5.x] Running org.apache.maven.surefire.its.ModulePathIT
[windows-jdk7-maven3.5.x] Tests run: 2, Failures: 0, Errors: 0, Skipped: 2, Time elapsed: 0.001 sec
[windows-jdk7-maven3.5.x] Running org.apache.maven.surefire.its.JUnitPlatformIT
[windows-jdk7-maven3.5.x] Tests run: 5, Failures: 0, Errors: 0, Skipped: 5, Time elapsed: 0.001 sec
[windows-jdk7-maven3.5.x] Running org.apache.maven.surefire.its.jiras.Surefire1295AttributeJvmCrashesToTestsIT
[windows-jdk7-maven3.5.x] Tests run: 9, Failures: 0, Errors: 0, Skipped: 9, Time elapsed: 0.002 sec
[windows-jdk7-maven3.5.x] Running org.apache.maven.surefire.its.jiras.Surefire1265Java9IT
[windows-jdk7-maven3.5.x] Tests run: 1, Failures: 0, Errors: 0, Skipped: 1, Time elapsed: 0 sec
[windows-jdk7-maven3.5.x] Running org.apache.maven.surefire.its.JUnitPlatformEnginesIT
[windows-jdk7-maven3.5.x] Tests run: 10, Failures: 0, Errors: 0, Skipped: 10, Time elapsed: 0.006 sec
[windows-jdk7-maven3.5.x] Running org.apache.maven.surefire.its.TestMultipleMethodPatternsIT
[windows-jdk7-maven3.5.x] Tests run: 180, Failures: 0, Errors: 0, Skipped: 87, Time elapsed: 528.875 sec
[windows-jdk7-maven3.5.x] Running org.apache.maven.surefire.its.jiras.Surefire260TestWithIdenticalNamesIT
[windows-jdk7-maven3.5.x] Tests run: 1, Failures: 0, Errors: 0, Skipped: 1, Time elapsed: 0.001 sec
[windows-jdk7-maven3.5.x] Running org.apache.maven.surefire.its.jiras.Surefire995CategoryInheritanceIT
[windows-jdk7-maven3.5.x] Tests run: 5, Failures: 0, Errors: 0, Skipped: 0, Time elapsed: 27.164 sec
[windows-jdk7-maven3.5.x] Running org.apache.maven.surefire.its.TestMultipleMethodPatternsTestNGIT
[windows-jdk7-maven3.5.x] Tests run: 90, Failures: 0, Errors: 0, Skipped: 41, Time elapsed: 281.32 sec
[windows-jdk7-maven3.5.x] Running org.apache.maven.surefire.its.Java9FullApiIT
[windows-jdk7-maven3.5.x] Tests run: 3, Failures: 0, Errors: 0, Skipped: 3, Time elapsed: 0.007 sec
[windows-jdk7-maven3.5.x]
[windows-jdk7-maven3.5.x] Results :
[windows-jdk7-maven3.5.x]
[windows-jdk7-maven3.5.x] Tests run: 782, Failures: 0, Errors: 0, Skipped: 163
[windows-jdk7-maven3.5.x]
[windows-jdk7-maven3.5.x] [INFO]
[windows-jdk7-maven3.5.x] [INFO] --- maven-checkstyle-plugin:3.0.0:check (checkstyle-check) @ surefire-its ---
[windows-jdk7-maven3.5.x] [INFO]
[windows-jdk7-maven3.5.x] [INFO] --- maven-failsafe-plugin:2.12.4:verify (default) @ surefire-its ---
[windows-jdk7-maven3.5.x] [INFO] Failsafe report directory: F:\jenkins\jenkins-slave\workspace\aven-surefire_SUREFIRE-1602-PKUAZHJFJ64JC6OYM2NZCYEKIA7E26FZIZFK4NWSLYHB5HS6BNMQ\surefire-its\target\failsafe-reports
[windows-jdk7-maven3.5.x] [INFO]
[windows-jdk7-maven3.5.x] [INFO] --- maven-install-plugin:2.5.2:install (default-install) @ surefire-its ---
[windows-jdk7-maven3.5.x] [INFO] Skipping artifact installation
[windows-jdk7-maven3.5.x] [INFO]
[windows-jdk7-maven3.5.x] [INFO] --- jacoco-maven-plugin:0.8.2:report (default-cli) @ surefire-its ---
[windows-jdk7-maven3.5.x] [INFO] Skipping JaCoCo execution because property jacoco.skip is set.
[windows-jdk7-maven3.5.x] [INFO] ------------------------------------------------------------------------
[windows-jdk7-maven3.5.x] [INFO] Reactor Summary:
[windows-jdk7-maven3.5.x] [INFO]
[windows-jdk7-maven3.5.x] [INFO] Apache Maven Surefire .............................. SUCCESS [ 30.410 s]
[windows-jdk7-maven3.5.x] [INFO] SureFire Logger API ................................ SUCCESS [  6.747 s]
[windows-jdk7-maven3.5.x] [INFO] SureFire API ....................................... SUCCESS [ 11.422 s]
[windows-jdk7-maven3.5.x] [INFO] SureFire Booter .................................... SUCCESS [ 13.911 s]
[windows-jdk7-maven3.5.x] [INFO] Maven Surefire Test-Grouping Support ............... SUCCESS [  7.366 s]
[windows-jdk7-maven3.5.x] [INFO] SureFire Providers ................................. SUCCESS [  1.327 s]
[windows-jdk7-maven3.5.x] [INFO] Shared JUnit3 Provider Code ........................ SUCCESS [  4.748 s]
[windows-jdk7-maven3.5.x] [INFO] Shared Java 5 Provider Base ........................ SUCCESS [  5.393 s]
[windows-jdk7-maven3.5.x] [INFO] Shared JUnit4 Provider Code ........................ SUCCESS [  5.915 s]
[windows-jdk7-maven3.5.x] [INFO] Shared JUnit48 Provider Code ....................... SUCCESS [  6.152 s]
[windows-jdk7-maven3.5.x] [INFO] SureFire JUnit Runner .............................. SUCCESS [  4.978 s]
[windows-jdk7-maven3.5.x] [INFO] SureFire JUnit4 Runner ............................. SUCCESS [  5.440 s]
[windows-jdk7-maven3.5.x] [INFO] Maven Surefire Common .............................. SUCCESS [ 29.167 s]
[windows-jdk7-maven3.5.x] [INFO] SureFire JUnitCore Runner .......................... SUCCESS [02:09 min]
[windows-jdk7-maven3.5.x] [INFO] SureFire JUnit Platform Runner ..................... SUCCESS [  9.659 s]
[windows-jdk7-maven3.5.x] [INFO] SureFire TestNG Utils .............................. SUCCESS [  5.378 s]
[windows-jdk7-maven3.5.x] [INFO] SureFire TestNG Runner ............................. SUCCESS [  5.719 s]
[windows-jdk7-maven3.5.x] [INFO] ShadeFire JUnit3 Provider .......................... SUCCESS [  1.738 s]
[windows-jdk7-maven3.5.x] [INFO] Surefire Report Parser ............................. SUCCESS [  6.008 s]
[windows-jdk7-maven3.5.x] [INFO] Maven Surefire Plugin .............................. SUCCESS [ 12.318 s]
[windows-jdk7-maven3.5.x] [INFO] Maven Failsafe Plugin .............................. SUCCESS [01:20 min]
[windows-jdk7-maven3.5.x] [INFO] Maven Surefire Report Plugin ....................... SUCCESS [ 16.492 s]
[windows-jdk7-maven3.5.x] [INFO] Maven Surefire Integration Tests ................... SUCCESS [  01:20 h]
[windows-jdk7-maven3.5.x] [INFO] ------------------------------------------------------------------------
[windows-jdk7-maven3.5.x] [INFO] BUILD SUCCESS
[windows-jdk7-maven3.5.x] [INFO] ------------------------------------------------------------------------
[windows-jdk7-maven3.5.x] [INFO] Total time: 01:27 h
[windows-jdk7-maven3.5.x] [INFO] Finished at: 2018-12-04T18:04:21Z
[windows-jdk7-maven3.5.x] [INFO] Final Memory: 50M/169M
[windows-jdk7-maven3.5.x] [INFO] ------------------------------------------------------------------------
[Pipeline] [windows-jdk7-maven3.5.x] }
[Pipeline] [windows-jdk7-maven3.5.x] // withEnv
[Pipeline] [windows-jdk7-maven3.5.x] }
[Pipeline] [windows-jdk7-maven3.5.x] // stage
[Pipeline] [windows-jdk7-maven3.5.x] stage
[Pipeline] [windows-jdk7-maven3.5.x] { (reporting windows-jdk7-maven3.5.x)
[Pipeline] [windows-jdk7-maven3.5.x] fileExists
[Pipeline] [windows-jdk7-maven3.5.x] zip
[windows-jdk7-maven3.5.x] Writing zip file of f:\jenkins\jenkins-slave\workspace\aven-surefire_SUREFIRE-1602-PKUAZHJFJ64JC6OYM2NZCYEKIA7E26FZIZFK4NWSLYHB5HS6BNMQ\maven-failsafe-plugin\target\it to f:\jenkins\jenkins-slave\workspace\aven-surefire_SUREFIRE-1602-PKUAZHJFJ64JC6OYM2NZCYEKIA7E26FZIZFK4NWSLYHB5HS6BNMQ\maven-failsafe-plugin--windows-jdk7-maven3.5.x.zip
[windows-jdk7-maven3.5.x] Zipped 83 entries.
[windows-jdk7-maven3.5.x] Archiving f:\jenkins\jenkins-slave\workspace\aven-surefire_SUREFIRE-1602-PKUAZHJFJ64JC6OYM2NZCYEKIA7E26FZIZFK4NWSLYHB5HS6BNMQ\maven-failsafe-plugin--windows-jdk7-maven3.5.x.zip
[windows-jdk7-maven3.5.x] [Fast Archiver] No prior successful build to compare, so performing full copy of artifacts
[Pipeline] [windows-jdk7-maven3.5.x] fileExists
[Pipeline] [windows-jdk7-maven3.5.x] zip
[windows-jdk7-maven3.5.x] Writing zip file of f:\jenkins\jenkins-slave\workspace\aven-surefire_SUREFIRE-1602-PKUAZHJFJ64JC6OYM2NZCYEKIA7E26FZIZFK4NWSLYHB5HS6BNMQ\surefire-its\target to f:\jenkins\jenkins-slave\workspace\aven-surefire_SUREFIRE-1602-PKUAZHJFJ64JC6OYM2NZCYEKIA7E26FZIZFK4NWSLYHB5HS6BNMQ\surefire-its--windows-jdk7-maven3.5.x.zip
[windows-jdk7-maven3.5.x] Zipped 16065 entries.
[windows-jdk7-maven3.5.x] Archiving f:\jenkins\jenkins-slave\workspace\aven-surefire_SUREFIRE-1602-PKUAZHJFJ64JC6OYM2NZCYEKIA7E26FZIZFK4NWSLYHB5HS6BNMQ\surefire-its--windows-jdk7-maven3.5.x.zip
[windows-jdk7-maven3.5.x] [Fast Archiver] No prior successful build to compare, so performing full copy of artifacts
[Pipeline] [windows-jdk7-maven3.5.x] archiveArtifacts
[windows-jdk7-maven3.5.x] Archiving artifacts
[windows-jdk7-maven3.5.x] [Fast Archiver] No prior successful build to compare, so performing full copy of artifacts
[Pipeline] [windows-jdk7-maven3.5.x] }
[Pipeline] [windows-jdk7-maven3.5.x] // stage
[Pipeline] [windows-jdk7-maven3.5.x] stage
[Pipeline] [windows-jdk7-maven3.5.x] { (cleanup windows-jdk7-maven3.5.x)
[Pipeline] [windows-jdk7-maven3.5.x] cleanWs
[windows-jdk7-maven3.5.x] [WS-CLEANUP] Deleting project workspace...[WS-CLEANUP] done
[Pipeline] [windows-jdk7-maven3.5.x] }
[Pipeline] [windows-jdk7-maven3.5.x] // stage
[Pipeline] [windows-jdk7-maven3.5.x] }
[Pipeline] [windows-jdk7-maven3.5.x] // timestamps
[Pipeline] [windows-jdk7-maven3.5.x] }
[Pipeline] [windows-jdk7-maven3.5.x] // node
[Pipeline] [windows-jdk7-maven3.5.x] }
[Pipeline] // parallel
[Pipeline] echo
hudson.AbortException: hudson.AbortException: script returned exit code 1
[Pipeline] stage
[Pipeline] { (notifications)
[Pipeline] echo
Build result: FAILURE
[Pipeline] jiraIssueSelector
[Pipeline] emailext
Reply | Threaded
Open this post in threaded view
|

Build succeeded in Jenkins: Maven TLP » maven-surefire » SUREFIRE-1602 #2

Apache Jenkins Server-2