Build failed in Jenkins: Maven TLP » maven-surefire » SUREFIRE-1585-tibor2 #1

classic Classic list List threaded Threaded
3 messages Options
Reply | Threaded
Open this post in threaded view
|

Build failed in Jenkins: Maven TLP » maven-surefire » SUREFIRE-1585-tibor2 #1

Apache Jenkins Server-2
See https://builds.apache.org/job/maven-box/job/maven-surefire/job/SUREFIRE-1585-tibor2/1/

No changes.

All tests passed

Build log:
[...truncated 18431 lines...]
[INFO] Tests run: 2, Failures: 0, Errors: 0, Skipped: 0, Time elapsed: 0.089 s - in org.apache.maven.surefire.junit4.JUnit4ProviderTest
[INFO]
[INFO] Results:
[INFO]
[INFO] Tests run: 2, Failures: 0, Errors: 0, Skipped: 0
[INFO]
[INFO]
[INFO] --- maven-jar-plugin:3.1.0:jar (default-jar) @ surefire-junit4 ---
[INFO] Building jar: C:\Users\jenkins\AppData\Local\Temp\2\jenkins-maven-box-maven-surefire-SUREFIRE-1585-tibor2-1\surefire-providers\surefire-junit4\target\surefire-junit4-3.0.0-M4-SNAPSHOT.jar
[INFO]
[INFO] --- maven-site-plugin:3.7.1:attach-descriptor (attach-descriptor) @ surefire-junit4 ---
[INFO] Skipping because packaging 'jar' is not pom.
[INFO]
[INFO] --- maven-checkstyle-plugin:3.0.0:check (checkstyle-check) @ surefire-junit4 ---
[INFO]
[INFO] --- maven-install-plugin:2.5.2:install (default-install) @ surefire-junit4 ---
[INFO] Installing C:\Users\jenkins\AppData\Local\Temp\2\jenkins-maven-box-maven-surefire-SUREFIRE-1585-tibor2-1\surefire-providers\surefire-junit4\target\surefire-junit4-3.0.0-M4-SNAPSHOT.jar to C:\Users\jenkins\AppData\Local\Temp\2\jenkins-maven-box-maven-surefire-SUREFIRE-1585-tibor2-1\.m2\org\apache\maven\surefire\surefire-junit4\3.0.0-M4-SNAPSHOT\surefire-junit4-3.0.0-M4-SNAPSHOT.jar
[INFO] Installing C:\Users\jenkins\AppData\Local\Temp\2\jenkins-maven-box-maven-surefire-SUREFIRE-1585-tibor2-1\surefire-providers\surefire-junit4\pom.xml to C:\Users\jenkins\AppData\Local\Temp\2\jenkins-maven-box-maven-surefire-SUREFIRE-1585-tibor2-1\.m2\org\apache\maven\surefire\surefire-junit4\3.0.0-M4-SNAPSHOT\surefire-junit4-3.0.0-M4-SNAPSHOT.pom
[INFO]
[INFO] ----------< org.apache.maven.surefire:maven-surefire-common >-----------
[INFO] Building Maven Surefire Common 3.0.0-M4-SNAPSHOT                 [13/23]
[INFO] --------------------------------[ jar ]---------------------------------
[INFO] Downloading from central: https://repo.maven.apache.org/maven2/org/fusesource/jansi/jansi/1.13/jansi-1.13.pom
[INFO] Downloaded from central: https://repo.maven.apache.org/maven2/org/fusesource/jansi/jansi/1.13/jansi-1.13.pom (3.7 kB at 98 kB/s)
[INFO] Downloading from central: https://repo.maven.apache.org/maven2/org/fusesource/jansi/jansi-project/1.13/jansi-project-1.13.pom
[INFO] Downloaded from central: https://repo.maven.apache.org/maven2/org/fusesource/jansi/jansi-project/1.13/jansi-project-1.13.pom (12 kB at 311 kB/s)
[INFO] Downloading from central: https://repo.maven.apache.org/maven2/org/fusesource/fusesource-pom/1.11/fusesource-pom-1.11.pom
[INFO] Downloaded from central: https://repo.maven.apache.org/maven2/org/fusesource/fusesource-pom/1.11/fusesource-pom-1.11.pom (15 kB at 502 kB/s)
[INFO] Downloading from central: https://repo.maven.apache.org/maven2/org/fusesource/jansi/jansi/1.13/jansi-1.13.jar
[INFO] Downloaded from central: https://repo.maven.apache.org/maven2/org/fusesource/jansi/jansi/1.13/jansi-1.13.jar (152 kB at 3.1 MB/s)
[INFO]
[INFO] --- maven-clean-plugin:3.1.0:clean (default-clean) @ maven-surefire-common ---
[INFO]
[INFO] --- maven-enforcer-plugin:3.0.0-M2:enforce (enforce-maven-version) @ maven-surefire-common ---
[INFO] Skipping Rule Enforcement.
[INFO]
[INFO] --- maven-enforcer-plugin:3.0.0-M2:enforce (enforce-bytecode-version) @ maven-surefire-common ---
[INFO] Skipping Rule Enforcement.
[INFO]
[INFO] --- maven-enforcer-plugin:3.0.0-M2:enforce (ban-known-bad-maven-versions) @ maven-surefire-common ---
[INFO] Skipping Rule Enforcement.
[INFO]
[INFO] --- maven-enforcer-plugin:3.0.0-M2:enforce (enforce-java) @ maven-surefire-common ---
[INFO] Skipping Rule Enforcement.
[INFO]
[INFO] --- maven-enforcer-plugin:3.0.0-M2:enforce (enforce-maven) @ maven-surefire-common ---
[INFO] Skipping Rule Enforcement.
[INFO]
[INFO] --- apache-rat-plugin:0.12:check (rat-check) @ maven-surefire-common ---
[INFO] Enabled default license matchers.
[INFO] Will parse SCM ignores for exclusions...
[INFO] Finished adding exclusions from SCM ignore files.
[INFO] 61 implicit excludes (use -debug for more details).
[INFO] Exclude: .repository/**
[INFO] Exclude: .maven/spy.log
[INFO] Exclude: dependency-reduced-pom.xml
[INFO] Exclude: .java-version
[INFO] Exclude: Jenkinsfile
[INFO] Exclude: README.md
[INFO] Exclude: .gitignore
[INFO] Exclude: .git/**/*
[INFO] Exclude: **/.idea
[INFO] Exclude: **/.svn/**/*
[INFO] Exclude: **/*.iml
[INFO] Exclude: **/*.ipr
[INFO] Exclude: **/*.iws
[INFO] Exclude: **/*.versionsBackup
[INFO] Exclude: **/dependency-reduced-pom.xml
[INFO] Exclude: .repository/**
[INFO] Exclude: src/test/resources/**/*
[INFO] Exclude: src/test/resources/**/*.css
[INFO] Exclude: **/*.jj
[INFO] Exclude: src/main/resources/META-INF/services/org.apache.maven.surefire.providerapi.SurefireProvider
[INFO] Exclude: DEPENDENCIES
[INFO] Exclude: .m2/**
[INFO] Exclude: .m2
[INFO] Exclude: .travis.yml
[INFO] 114 resources included (use -debug for more details)
[INFO] Rat check: Summary over all files. Unapproved: 0, unknown: 0, generated: 0, approved: 114 licenses.
[INFO]
[INFO] --- jacoco-maven-plugin:0.8.3:prepare-agent (jacoco-agent) @ maven-surefire-common ---
[INFO] Skipping JaCoCo execution because property jacoco.skip is set.
[INFO] jacoco.agent set to empty
[INFO]
[INFO] --- maven-compiler-plugin:3.7.0:compile (compile-generated) @ maven-surefire-common ---
[INFO] Nothing to compile - all classes are up to date
[INFO]
[INFO] --- maven-remote-resources-plugin:1.5:process (process-resource-bundles) @ maven-surefire-common ---
[INFO]
[INFO] --- maven-resources-plugin:3.1.0:resources (default-resources) @ maven-surefire-common ---
[INFO] Using 'UTF-8' encoding to copy filtered resources.
[INFO] skip non existing resourceDirectory C:\Users\jenkins\AppData\Local\Temp\2\jenkins-maven-box-maven-surefire-SUREFIRE-1585-tibor2-1\maven-surefire-common\src\main\resources
[INFO] Copying 3 resources
[INFO]
[INFO] --- maven-compiler-plugin:3.7.0:compile (default-compile) @ maven-surefire-common ---
[INFO] Changes detected - recompiling the module!
[INFO] Compiling 69 source files to C:\Users\jenkins\AppData\Local\Temp\2\jenkins-maven-box-maven-surefire-SUREFIRE-1585-tibor2-1\maven-surefire-common\target\classes
[INFO] -------------------------------------------------------------
[ERROR] COMPILATION ERROR :
[INFO] -------------------------------------------------------------
[ERROR] C:\Users\jenkins\AppData\Local\Temp\2\jenkins-maven-box-maven-surefire-SUREFIRE-1585-tibor2-1\maven-surefire-common\src\main\java\org\apache\maven\plugin\surefire\TestClassPath.java:[63,34] error: cannot find symbol
  symbol:   class Set
  location: class TestClassPath
[ERROR] C:\Users\jenkins\AppData\Local\Temp\2\jenkins-maven-box-maven-surefire-SUREFIRE-1585-tibor2-1\maven-surefire-common\src\main\java\org\apache\maven\plugin\surefire\TestClassPath.java:[78,25] error: cannot find symbol
  symbol:   variable logger
  location: class TestClassPath
[ERROR] C:\Users\jenkins\AppData\Local\Temp\2\jenkins-maven-box-maven-surefire-SUREFIRE-1585-tibor2-1\maven-surefire-common\src\main\java\org\apache\maven\plugin\surefire\TestClassPath.java:[80,24] error: cannot find symbol
  symbol:   variable logger
  location: class TestClassPath
[ERROR] C:\Users\jenkins\AppData\Local\Temp\2\jenkins-maven-box-maven-surefire-SUREFIRE-1585-tibor2-1\maven-surefire-common\src\main\java\org\apache\maven\plugin\surefire\AbstractSurefireMojo.java:[1022,29] error: constructor SurefireDependencyResolver in class SurefireDependencyResolver cannot be applied to given types;
  required: RepositorySystem,ConsoleLogger,ArtifactRepository,List<ArtifactRepository>,List<ArtifactRepository>,String
  found: RepositorySystem,PluginConsoleLogger,ArtifactRepository,List<ArtifactRepository>,String
  reason: actual and formal argument lists differ in length
[ERROR] C:\Users\jenkins\AppData\Local\Temp\2\jenkins-maven-box-maven-surefire-SUREFIRE-1585-tibor2-1\maven-surefire-common\src\main\java\org\apache\maven\plugin\surefire\AbstractSurefireMojo.java:[2962,27] error: cannot find symbol
  symbol:   variable version
  location: class AbstractSurefireMojo.JUnitPlatformProviderInfo
[INFO] 5 errors
[INFO] -------------------------------------------------------------
[INFO] ------------------------------------------------------------------------
[INFO] Reactor Summary for Apache Maven Surefire 3.0.0-M4-SNAPSHOT:
[INFO]
[INFO] Apache Maven Surefire .............................. SUCCESS [ 49.010 s]
[INFO] SureFire Logger API ................................ SUCCESS [  9.062 s]
[INFO] SureFire API ....................................... SUCCESS [ 17.484 s]
[INFO] SureFire Booter .................................... SUCCESS [ 19.981 s]
[INFO] Maven Surefire Test-Grouping Support ............... SUCCESS [ 12.104 s]
[INFO] SureFire Providers ................................. SUCCESS [  1.636 s]
[INFO] Shared JUnit3 Provider Code ........................ SUCCESS [  6.929 s]
[INFO] Shared Java 5 Provider Base ........................ SUCCESS [  8.619 s]
[INFO] Shared JUnit4 Provider Code ........................ SUCCESS [  7.943 s]
[INFO] Shared JUnit48 Provider Code ....................... SUCCESS [  8.883 s]
[INFO] SureFire JUnit Runner .............................. SUCCESS [  7.408 s]
[INFO] SureFire JUnit4 Runner ............................. SUCCESS [  7.190 s]
[INFO] Maven Surefire Common .............................. FAILURE [  6.665 s]
[INFO] SureFire JUnitCore Runner .......................... SKIPPED
[INFO] SureFire JUnit Platform Runner ..................... SKIPPED
[INFO] SureFire TestNG Utils .............................. SKIPPED
[INFO] SureFire TestNG Runner ............................. SKIPPED
[INFO] ShadeFire JUnit3 Provider .......................... SKIPPED
[INFO] Surefire Report Parser ............................. SKIPPED
[INFO] Maven Surefire Plugin .............................. SKIPPED
[INFO] Maven Failsafe Plugin .............................. SKIPPED
[INFO] Maven Surefire Report Plugin ....................... SKIPPED
[INFO] Maven Surefire Integration Tests ................... SKIPPED
[INFO] ------------------------------------------------------------------------
[INFO] BUILD FAILURE
[INFO] ------------------------------------------------------------------------
[INFO] Total time:  02:45 min
[INFO] Finished at: 2019-02-03T14:18:05-08:00
[INFO] ------------------------------------------------------------------------
[ERROR] Failed to execute goal org.apache.maven.plugins:maven-compiler-plugin:3.7.0:compile (default-compile) on project maven-surefire-common: Compilation failure: Compilation failure:
[ERROR] C:\Users\jenkins\AppData\Local\Temp\2\jenkins-maven-box-maven-surefire-SUREFIRE-1585-tibor2-1\maven-surefire-common\src\main\java\org\apache\maven\plugin\surefire\TestClassPath.java:[63,34] error: cannot find symbol
[ERROR]   symbol:   class Set
[ERROR]   location: class TestClassPath
[ERROR] C:\Users\jenkins\AppData\Local\Temp\2\jenkins-maven-box-maven-surefire-SUREFIRE-1585-tibor2-1\maven-surefire-common\src\main\java\org\apache\maven\plugin\surefire\TestClassPath.java:[78,25] error: cannot find symbol
[ERROR]   symbol:   variable logger
[ERROR]   location: class TestClassPath
[ERROR] C:\Users\jenkins\AppData\Local\Temp\2\jenkins-maven-box-maven-surefire-SUREFIRE-1585-tibor2-1\maven-surefire-common\src\main\java\org\apache\maven\plugin\surefire\TestClassPath.java:[80,24] error: cannot find symbol
[ERROR]   symbol:   variable logger
[ERROR]   location: class TestClassPath
[ERROR] C:\Users\jenkins\AppData\Local\Temp\2\jenkins-maven-box-maven-surefire-SUREFIRE-1585-tibor2-1\maven-surefire-common\src\main\java\org\apache\maven\plugin\surefire\AbstractSurefireMojo.java:[1022,29] error: constructor SurefireDependencyResolver in class SurefireDependencyResolver cannot be applied to given types;
[ERROR]   required: RepositorySystem,ConsoleLogger,ArtifactRepository,List<ArtifactRepository>,List<ArtifactRepository>,String
[ERROR]   found: RepositorySystem,PluginConsoleLogger,ArtifactRepository,List<ArtifactRepository>,String
[ERROR]   reason: actual and formal argument lists differ in length
[ERROR] C:\Users\jenkins\AppData\Local\Temp\2\jenkins-maven-box-maven-surefire-SUREFIRE-1585-tibor2-1\maven-surefire-common\src\main\java\org\apache\maven\plugin\surefire\AbstractSurefireMojo.java:[2962,27] error: cannot find symbol
[ERROR]   symbol:   variable version
[ERROR]   location: class AbstractSurefireMojo.JUnitPlatformProviderInfo
[ERROR] -> [Help 1]
org.apache.maven.lifecycle.LifecycleExecutionException: Failed to execute goal org.apache.maven.plugins:maven-compiler-plugin:3.7.0:compile (default-compile) on project maven-surefire-common: Compilation failure
    at org.apache.maven.lifecycle.internal.MojoExecutor.execute (MojoExecutor.java:215)
    at org.apache.maven.lifecycle.internal.MojoExecutor.execute (MojoExecutor.java:156)
    at org.apache.maven.lifecycle.internal.MojoExecutor.execute (MojoExecutor.java:148)
    at org.apache.maven.lifecycle.internal.LifecycleModuleBuilder.buildProject (LifecycleModuleBuilder.java:117)
    at org.apache.maven.lifecycle.internal.LifecycleModuleBuilder.buildProject (LifecycleModuleBuilder.java:81)
    at org.apache.maven.lifecycle.internal.builder.singlethreaded.SingleThreadedBuilder.build (SingleThreadedBuilder.java:56)
    at org.apache.maven.lifecycle.internal.LifecycleStarter.execute (LifecycleStarter.java:128)
    at org.apache.maven.DefaultMaven.doExecute (DefaultMaven.java:305)
    at org.apache.maven.DefaultMaven.doExecute (DefaultMaven.java:192)
    at org.apache.maven.DefaultMaven.execute (DefaultMaven.java:105)
    at org.apache.maven.cli.MavenCli.execute (MavenCli.java:956)
    at org.apache.maven.cli.MavenCli.doMain (MavenCli.java:288)
    at org.apache.maven.cli.MavenCli.main (MavenCli.java:192)
    at sun.reflect.NativeMethodAccessorImpl.invoke0 (Native Method)
    at sun.reflect.NativeMethodAccessorImpl.invoke (NativeMethodAccessorImpl.java:62)
    at sun.reflect.DelegatingMethodAccessorImpl.invoke (DelegatingMethodAccessorImpl.java:43)
    at java.lang.reflect.Method.invoke (Method.java:498)
    at org.codehaus.plexus.classworlds.launcher.Launcher.launchEnhanced (Launcher.java:289)
    at org.codehaus.plexus.classworlds.launcher.Launcher.launch (Launcher.java:229)
    at org.codehaus.plexus.classworlds.launcher.Launcher.mainWithExitCode (Launcher.java:415)
    at org.codehaus.plexus.classworlds.launcher.Launcher.main (Launcher.java:356)
Caused by: org.apache.maven.plugin.compiler.CompilationFailureException: Compilation failure
    at org.apache.maven.plugin.compiler.AbstractCompilerMojo.execute (AbstractCompilerMojo.java:1161)
    at org.apache.maven.plugin.compiler.CompilerMojo.execute (CompilerMojo.java:168)
    at org.apache.maven.plugin.DefaultBuildPluginManager.executeMojo (DefaultBuildPluginManager.java:137)
    at org.apache.maven.lifecycle.internal.MojoExecutor.execute (MojoExecutor.java:210)
    at org.apache.maven.lifecycle.internal.MojoExecutor.execute (MojoExecutor.java:156)
    at org.apache.maven.lifecycle.internal.MojoExecutor.execute (MojoExecutor.java:148)
    at org.apache.maven.lifecycle.internal.LifecycleModuleBuilder.buildProject (LifecycleModuleBuilder.java:117)
    at org.apache.maven.lifecycle.internal.LifecycleModuleBuilder.buildProject (LifecycleModuleBuilder.java:81)
    at org.apache.maven.lifecycle.internal.builder.singlethreaded.SingleThreadedBuilder.build (SingleThreadedBuilder.java:56)
    at org.apache.maven.lifecycle.internal.LifecycleStarter.execute (LifecycleStarter.java:128)
    at org.apache.maven.DefaultMaven.doExecute (DefaultMaven.java:305)
    at org.apache.maven.DefaultMaven.doExecute (DefaultMaven.java:192)
    at org.apache.maven.DefaultMaven.execute (DefaultMaven.java:105)
    at org.apache.maven.cli.MavenCli.execute (MavenCli.java:956)
    at org.apache.maven.cli.MavenCli.doMain (MavenCli.java:288)
    at org.apache.maven.cli.MavenCli.main (MavenCli.java:192)
    at sun.reflect.NativeMethodAccessorImpl.invoke0 (Native Method)
    at sun.reflect.NativeMethodAccessorImpl.invoke (NativeMethodAccessorImpl.java:62)
    at sun.reflect.DelegatingMethodAccessorImpl.invoke (DelegatingMethodAccessorImpl.java:43)
    at java.lang.reflect.Method.invoke (Method.java:498)
    at org.codehaus.plexus.classworlds.launcher.Launcher.launchEnhanced (Launcher.java:289)
    at org.codehaus.plexus.classworlds.launcher.Launcher.launch (Launcher.java:229)
    at org.codehaus.plexus.classworlds.launcher.Launcher.mainWithExitCode (Launcher.java:415)
    at org.codehaus.plexus.classworlds.launcher.Launcher.main (Launcher.java:356)
[ERROR]
[ERROR] Re-run Maven using the -X switch to enable full debug logging.
[ERROR]
[ERROR] For more information about the errors and possible solutions, please read the following articles:
[ERROR] [Help 1] http://cwiki.apache.org/confluence/display/MAVEN/MojoFailureException
[ERROR]
[ERROR] After correcting the problems, you can resume the build with the command
[ERROR]   mvn <goals> -rf :maven-surefire-common
[Pipeline] }
[Pipeline] // withEnv
[Pipeline] }
[Pipeline] // stage
[Pipeline] fileExists
[Pipeline] fileExists
[Pipeline] archiveArtifacts
Archiving artifacts
[Pipeline] cleanWs
[WS-CLEANUP] Deleting project workspace...
[WS-CLEANUP] Deferred wipeout is used...
[WS-CLEANUP] done
[Pipeline] }
[Pipeline] // ws
[Pipeline] }
[Pipeline] // timestamps
[Pipeline] }
[Pipeline] // node
[Pipeline] }
[Pipeline] // parallel
[Pipeline] echo
Throwable: hudson.plugins.git.GitException: Could not checkout cb00ee2536d2e3406a2de4af213286062947afe9
[Pipeline] echo
Build result: FAILURE
[Pipeline] jiraIssueSelector
[Pipeline] emailext
Reply | Threaded
Open this post in threaded view
|

Build failed in Jenkins: Maven TLP » maven-surefire » SUREFIRE-1585-tibor2 #2

Apache Jenkins Server-2
See https://builds.apache.org/job/maven-box/job/maven-surefire/job/SUREFIRE-1585-tibor2/2/

No changes.

All tests passed

Build log:
[...truncated 29245 lines...]
[Pipeline] }
[Pipeline] // node
[Pipeline] }
[INFO]
[INFO] Results:
[INFO]
[INFO] Tests run: 2, Failures: 0, Errors: 0, Skipped: 0
[INFO]
[INFO]
[INFO] --- maven-jar-plugin:3.1.0:jar (default-jar) @ surefire-junit4 ---
[INFO] Building jar: C:\Users\jenkins\AppData\Local\Temp\2\jenkins-maven-box-maven-surefire-SUREFIRE-1585-tibor2-2@2\surefire-providers\surefire-junit4\target\surefire-junit4-3.0.0-M4-SNAPSHOT.jar
[INFO]
[INFO] --- maven-site-plugin:3.7.1:attach-descriptor (attach-descriptor) @ surefire-junit4 ---
[INFO] Skipping because packaging 'jar' is not pom.
[INFO]
[INFO] --- maven-checkstyle-plugin:3.0.0:check (checkstyle-check) @ surefire-junit4 ---
[INFO]
[INFO] --- maven-install-plugin:2.5.2:install (default-install) @ surefire-junit4 ---
[INFO] Installing C:\Users\jenkins\AppData\Local\Temp\2\jenkins-maven-box-maven-surefire-SUREFIRE-1585-tibor2-2@2\surefire-providers\surefire-junit4\target\surefire-junit4-3.0.0-M4-SNAPSHOT.jar to C:\Users\jenkins\AppData\Local\Temp\2\jenkins-maven-box-maven-surefire-SUREFIRE-1585-tibor2-2@2\.m2\org\apache\maven\surefire\surefire-junit4\3.0.0-M4-SNAPSHOT\surefire-junit4-3.0.0-M4-SNAPSHOT.jar
[INFO] Installing C:\Users\jenkins\AppData\Local\Temp\2\jenkins-maven-box-maven-surefire-SUREFIRE-1585-tibor2-2@2\surefire-providers\surefire-junit4\pom.xml to C:\Users\jenkins\AppData\Local\Temp\2\jenkins-maven-box-maven-surefire-SUREFIRE-1585-tibor2-2@2\.m2\org\apache\maven\surefire\surefire-junit4\3.0.0-M4-SNAPSHOT\surefire-junit4-3.0.0-M4-SNAPSHOT.pom
[INFO]
[INFO] ----------< org.apache.maven.surefire:maven-surefire-common >-----------
[INFO] Building Maven Surefire Common 3.0.0-M4-SNAPSHOT                 [13/23]
[INFO] --------------------------------[ jar ]---------------------------------
[INFO] Downloading from central: https://repo.maven.apache.org/maven2/org/fusesource/jansi/jansi/1.13/jansi-1.13.pom
[INFO] Downloaded from central: https://repo.maven.apache.org/maven2/org/fusesource/jansi/jansi/1.13/jansi-1.13.pom (3.7 kB at 116 kB/s)
[INFO] Downloading from central: https://repo.maven.apache.org/maven2/org/fusesource/jansi/jansi-project/1.13/jansi-project-1.13.pom
[INFO] Downloaded from central: https://repo.maven.apache.org/maven2/org/fusesource/jansi/jansi-project/1.13/jansi-project-1.13.pom (12 kB at 407 kB/s)
[INFO] Downloading from central: https://repo.maven.apache.org/maven2/org/fusesource/fusesource-pom/1.11/fusesource-pom-1.11.pom
[INFO] Downloaded from central: https://repo.maven.apache.org/maven2/org/fusesource/fusesource-pom/1.11/fusesource-pom-1.11.pom (15 kB at 374 kB/s)
[INFO] Downloading from central: https://repo.maven.apache.org/maven2/org/fusesource/jansi/jansi/1.13/jansi-1.13.jar
[INFO] Downloaded from central: https://repo.maven.apache.org/maven2/org/fusesource/jansi/jansi/1.13/jansi-1.13.jar (152 kB at 4.3 MB/s)
[INFO]
[INFO] --- maven-clean-plugin:3.1.0:clean (default-clean) @ maven-surefire-common ---
[INFO]
[INFO] --- maven-enforcer-plugin:3.0.0-M2:enforce (enforce-maven-version) @ maven-surefire-common ---
[INFO] Skipping Rule Enforcement.
[INFO]
[INFO] --- maven-enforcer-plugin:3.0.0-M2:enforce (enforce-bytecode-version) @ maven-surefire-common ---
[INFO] Skipping Rule Enforcement.
[INFO]
[INFO] --- maven-enforcer-plugin:3.0.0-M2:enforce (ban-known-bad-maven-versions) @ maven-surefire-common ---
[INFO] Skipping Rule Enforcement.
[INFO]
[INFO] --- maven-enforcer-plugin:3.0.0-M2:enforce (enforce-java) @ maven-surefire-common ---
[INFO] Skipping Rule Enforcement.
[INFO]
[INFO] --- maven-enforcer-plugin:3.0.0-M2:enforce (enforce-maven) @ maven-surefire-common ---
[INFO] Skipping Rule Enforcement.
[INFO]
[INFO] --- apache-rat-plugin:0.12:check (rat-check) @ maven-surefire-common ---
[INFO] Enabled default license matchers.
[INFO] Will parse SCM ignores for exclusions...
[INFO] Finished adding exclusions from SCM ignore files.
[INFO] 61 implicit excludes (use -debug for more details).
[INFO] Exclude: .repository/**
[INFO] Exclude: .maven/spy.log
[INFO] Exclude: dependency-reduced-pom.xml
[INFO] Exclude: .java-version
[INFO] Exclude: Jenkinsfile
[INFO] Exclude: README.md
[INFO] Exclude: .gitignore
[INFO] Exclude: .git/**/*
[INFO] Exclude: **/.idea
[INFO] Exclude: **/.svn/**/*
[INFO] Exclude: **/*.iml
[INFO] Exclude: **/*.ipr
[INFO] Exclude: **/*.iws
[INFO] Exclude: **/*.versionsBackup
[INFO] Exclude: **/dependency-reduced-pom.xml
[INFO] Exclude: .repository/**
[INFO] Exclude: src/test/resources/**/*
[INFO] Exclude: src/test/resources/**/*.css
[INFO] Exclude: **/*.jj
[INFO] Exclude: src/main/resources/META-INF/services/org.apache.maven.surefire.providerapi.SurefireProvider
[INFO] Exclude: DEPENDENCIES
[INFO] Exclude: .m2/**
[INFO] Exclude: .m2
[INFO] Exclude: .travis.yml
[INFO] 114 resources included (use -debug for more details)
[INFO] Rat check: Summary over all files. Unapproved: 0, unknown: 0, generated: 0, approved: 114 licenses.
[INFO]
[INFO] --- jacoco-maven-plugin:0.8.3:prepare-agent (jacoco-agent) @ maven-surefire-common ---
[INFO] Skipping JaCoCo execution because property jacoco.skip is set.
[INFO] jacoco.agent set to empty
[INFO]
[INFO] --- maven-compiler-plugin:3.7.0:compile (compile-generated) @ maven-surefire-common ---
[INFO] Nothing to compile - all classes are up to date
[INFO]
[INFO] --- maven-remote-resources-plugin:1.5:process (process-resource-bundles) @ maven-surefire-common ---
[INFO]
[INFO] --- maven-resources-plugin:3.1.0:resources (default-resources) @ maven-surefire-common ---
[INFO] Using 'UTF-8' encoding to copy filtered resources.
[INFO] skip non existing resourceDirectory C:\Users\jenkins\AppData\Local\Temp\2\jenkins-maven-box-maven-surefire-SUREFIRE-1585-tibor2-2@2\maven-surefire-common\src\main\resources
[INFO] Copying 3 resources
[INFO]
[INFO] --- maven-compiler-plugin:3.7.0:compile (default-compile) @ maven-surefire-common ---
[INFO] Changes detected - recompiling the module!
[INFO] Compiling 69 source files to C:\Users\jenkins\AppData\Local\Temp\2\jenkins-maven-box-maven-surefire-SUREFIRE-1585-tibor2-2@2\maven-surefire-common\target\classes
[INFO] -------------------------------------------------------------
[ERROR] COMPILATION ERROR :
[INFO] -------------------------------------------------------------
[ERROR] C:\Users\jenkins\AppData\Local\Temp\2\jenkins-maven-box-maven-surefire-SUREFIRE-1585-tibor2-2@2\maven-surefire-common\src\main\java\org\apache\maven\plugin\surefire\TestClassPath.java:[63,34] error: cannot find symbol
  symbol:   class Set
  location: class TestClassPath
[ERROR] C:\Users\jenkins\AppData\Local\Temp\2\jenkins-maven-box-maven-surefire-SUREFIRE-1585-tibor2-2@2\maven-surefire-common\src\main\java\org\apache\maven\plugin\surefire\TestClassPath.java:[78,25] error: cannot find symbol
  symbol:   variable logger
  location: class TestClassPath
[ERROR] C:\Users\jenkins\AppData\Local\Temp\2\jenkins-maven-box-maven-surefire-SUREFIRE-1585-tibor2-2@2\maven-surefire-common\src\main\java\org\apache\maven\plugin\surefire\TestClassPath.java:[80,24] error: cannot find symbol
  symbol:   variable logger
  location: class TestClassPath
[ERROR] C:\Users\jenkins\AppData\Local\Temp\2\jenkins-maven-box-maven-surefire-SUREFIRE-1585-tibor2-2@2\maven-surefire-common\src\main\java\org\apache\maven\plugin\surefire\AbstractSurefireMojo.java:[1022,29] error: constructor SurefireDependencyResolver in class SurefireDependencyResolver cannot be applied to given types;
  required: RepositorySystem,ConsoleLogger,ArtifactRepository,List<ArtifactRepository>,List<ArtifactRepository>,String
  found: RepositorySystem,PluginConsoleLogger,ArtifactRepository,List<ArtifactRepository>,String
  reason: actual and formal argument lists differ in length
[ERROR] C:\Users\jenkins\AppData\Local\Temp\2\jenkins-maven-box-maven-surefire-SUREFIRE-1585-tibor2-2@2\maven-surefire-common\src\main\java\org\apache\maven\plugin\surefire\AbstractSurefireMojo.java:[2962,27] error: cannot find symbol
  symbol:   variable version
  location: class AbstractSurefireMojo.JUnitPlatformProviderInfo
[INFO] 5 errors
[INFO] -------------------------------------------------------------
[INFO] ------------------------------------------------------------------------
[INFO] Reactor Summary for Apache Maven Surefire 3.0.0-M4-SNAPSHOT:
[INFO]
[INFO] Apache Maven Surefire .............................. SUCCESS [ 58.385 s]
[INFO] SureFire Logger API ................................ SUCCESS [ 10.722 s]
[INFO] SureFire API ....................................... SUCCESS [ 21.297 s]
[INFO] SureFire Booter .................................... SUCCESS [ 24.241 s]
[INFO] Maven Surefire Test-Grouping Support ............... SUCCESS [ 13.597 s]
[INFO] SureFire Providers ................................. SUCCESS [  1.965 s]
[INFO] Shared JUnit3 Provider Code ........................ SUCCESS [  7.366 s]
[INFO] Shared Java 5 Provider Base ........................ SUCCESS [  8.659 s]
[INFO] Shared JUnit4 Provider Code ........................ SUCCESS [  9.730 s]
[INFO] Shared JUnit48 Provider Code ....................... SUCCESS [ 10.101 s]
[INFO] SureFire JUnit Runner .............................. SUCCESS [  8.119 s]
[INFO] SureFire JUnit4 Runner ............................. SUCCESS [ 38.308 s]
[INFO] Maven Surefire Common .............................. FAILURE [  5.697 s]
[INFO] SureFire JUnitCore Runner .......................... SKIPPED
[INFO] SureFire JUnit Platform Runner ..................... SKIPPED
[INFO] SureFire TestNG Utils .............................. SKIPPED
[INFO] SureFire TestNG Runner ............................. SKIPPED
[INFO] ShadeFire JUnit3 Provider .......................... SKIPPED
[INFO] Surefire Report Parser ............................. SKIPPED
[INFO] Maven Surefire Plugin .............................. SKIPPED
[INFO] Maven Failsafe Plugin .............................. SKIPPED
[INFO] Maven Surefire Report Plugin ....................... SKIPPED
[INFO] Maven Surefire Integration Tests ................... SKIPPED
[INFO] ------------------------------------------------------------------------
[INFO] BUILD FAILURE
[INFO] ------------------------------------------------------------------------
[INFO] Total time:  03:40 min
[INFO] Finished at: 2019-02-03T16:30:40-08:00
[INFO] ------------------------------------------------------------------------
[ERROR] Failed to execute goal org.apache.maven.plugins:maven-compiler-plugin:3.7.0:compile (default-compile) on project maven-surefire-common: Compilation failure: Compilation failure:
[ERROR] C:\Users\jenkins\AppData\Local\Temp\2\jenkins-maven-box-maven-surefire-SUREFIRE-1585-tibor2-2@2\maven-surefire-common\src\main\java\org\apache\maven\plugin\surefire\TestClassPath.java:[63,34] error: cannot find symbol
[ERROR]   symbol:   class Set
[ERROR]   location: class TestClassPath
[ERROR] C:\Users\jenkins\AppData\Local\Temp\2\jenkins-maven-box-maven-surefire-SUREFIRE-1585-tibor2-2@2\maven-surefire-common\src\main\java\org\apache\maven\plugin\surefire\TestClassPath.java:[78,25] error: cannot find symbol
[ERROR]   symbol:   variable logger
[ERROR]   location: class TestClassPath
[ERROR] C:\Users\jenkins\AppData\Local\Temp\2\jenkins-maven-box-maven-surefire-SUREFIRE-1585-tibor2-2@2\maven-surefire-common\src\main\java\org\apache\maven\plugin\surefire\TestClassPath.java:[80,24] error: cannot find symbol
[ERROR]   symbol:   variable logger
[ERROR]   location: class TestClassPath
[ERROR] C:\Users\jenkins\AppData\Local\Temp\2\jenkins-maven-box-maven-surefire-SUREFIRE-1585-tibor2-2@2\maven-surefire-common\src\main\java\org\apache\maven\plugin\surefire\AbstractSurefireMojo.java:[1022,29] error: constructor SurefireDependencyResolver in class SurefireDependencyResolver cannot be applied to given types;
[ERROR]   required: RepositorySystem,ConsoleLogger,ArtifactRepository,List<ArtifactRepository>,List<ArtifactRepository>,String
[ERROR]   found: RepositorySystem,PluginConsoleLogger,ArtifactRepository,List<ArtifactRepository>,String
[ERROR]   reason: actual and formal argument lists differ in length
[ERROR] C:\Users\jenkins\AppData\Local\Temp\2\jenkins-maven-box-maven-surefire-SUREFIRE-1585-tibor2-2@2\maven-surefire-common\src\main\java\org\apache\maven\plugin\surefire\AbstractSurefireMojo.java:[2962,27] error: cannot find symbol
[ERROR]   symbol:   variable version
[ERROR]   location: class AbstractSurefireMojo.JUnitPlatformProviderInfo
[ERROR] -> [Help 1]
org.apache.maven.lifecycle.LifecycleExecutionException: Failed to execute goal org.apache.maven.plugins:maven-compiler-plugin:3.7.0:compile (default-compile) on project maven-surefire-common: Compilation failure
    at org.apache.maven.lifecycle.internal.MojoExecutor.execute (MojoExecutor.java:215)
    at org.apache.maven.lifecycle.internal.MojoExecutor.execute (MojoExecutor.java:156)
    at org.apache.maven.lifecycle.internal.MojoExecutor.execute (MojoExecutor.java:148)
    at org.apache.maven.lifecycle.internal.LifecycleModuleBuilder.buildProject (LifecycleModuleBuilder.java:117)
    at org.apache.maven.lifecycle.internal.LifecycleModuleBuilder.buildProject (LifecycleModuleBuilder.java:81)
    at org.apache.maven.lifecycle.internal.builder.singlethreaded.SingleThreadedBuilder.build (SingleThreadedBuilder.java:56)
    at org.apache.maven.lifecycle.internal.LifecycleStarter.execute (LifecycleStarter.java:128)
    at org.apache.maven.DefaultMaven.doExecute (DefaultMaven.java:305)
    at org.apache.maven.DefaultMaven.doExecute (DefaultMaven.java:192)
    at org.apache.maven.DefaultMaven.execute (DefaultMaven.java:105)
    at org.apache.maven.cli.MavenCli.execute (MavenCli.java:956)
    at org.apache.maven.cli.MavenCli.doMain (MavenCli.java:288)
    at org.apache.maven.cli.MavenCli.main (MavenCli.java:192)
    at sun.reflect.NativeMethodAccessorImpl.invoke0 (Native Method)
    at sun.reflect.NativeMethodAccessorImpl.invoke (NativeMethodAccessorImpl.java:62)
    at sun.reflect.DelegatingMethodAccessorImpl.invoke (DelegatingMethodAccessorImpl.java:43)
    at java.lang.reflect.Method.invoke (Method.java:498)
    at org.codehaus.plexus.classworlds.launcher.Launcher.launchEnhanced (Launcher.java:289)
    at org.codehaus.plexus.classworlds.launcher.Launcher.launch (Launcher.java:229)
    at org.codehaus.plexus.classworlds.launcher.Launcher.mainWithExitCode (Launcher.java:415)
    at org.codehaus.plexus.classworlds.launcher.Launcher.main (Launcher.java:356)
Caused by: org.apache.maven.plugin.compiler.CompilationFailureException: Compilation failure
    at org.apache.maven.plugin.compiler.AbstractCompilerMojo.execute (AbstractCompilerMojo.java:1161)
    at org.apache.maven.plugin.compiler.CompilerMojo.execute (CompilerMojo.java:168)
    at org.apache.maven.plugin.DefaultBuildPluginManager.executeMojo (DefaultBuildPluginManager.java:137)
    at org.apache.maven.lifecycle.internal.MojoExecutor.execute (MojoExecutor.java:210)
    at org.apache.maven.lifecycle.internal.MojoExecutor.execute (MojoExecutor.java:156)
    at org.apache.maven.lifecycle.internal.MojoExecutor.execute (MojoExecutor.java:148)
    at org.apache.maven.lifecycle.internal.LifecycleModuleBuilder.buildProject (LifecycleModuleBuilder.java:117)
    at org.apache.maven.lifecycle.internal.LifecycleModuleBuilder.buildProject (LifecycleModuleBuilder.java:81)
    at org.apache.maven.lifecycle.internal.builder.singlethreaded.SingleThreadedBuilder.build (SingleThreadedBuilder.java:56)
    at org.apache.maven.lifecycle.internal.LifecycleStarter.execute (LifecycleStarter.java:128)
    at org.apache.maven.DefaultMaven.doExecute (DefaultMaven.java:305)
    at org.apache.maven.DefaultMaven.doExecute (DefaultMaven.java:192)
    at org.apache.maven.DefaultMaven.execute (DefaultMaven.java:105)
    at org.apache.maven.cli.MavenCli.execute (MavenCli.java:956)
    at org.apache.maven.cli.MavenCli.doMain (MavenCli.java:288)
    at org.apache.maven.cli.MavenCli.main (MavenCli.java:192)
    at sun.reflect.NativeMethodAccessorImpl.invoke0 (Native Method)
    at sun.reflect.NativeMethodAccessorImpl.invoke (NativeMethodAccessorImpl.java:62)
    at sun.reflect.DelegatingMethodAccessorImpl.invoke (DelegatingMethodAccessorImpl.java:43)
    at java.lang.reflect.Method.invoke (Method.java:498)
    at org.codehaus.plexus.classworlds.launcher.Launcher.launchEnhanced (Launcher.java:289)
    at org.codehaus.plexus.classworlds.launcher.Launcher.launch (Launcher.java:229)
    at org.codehaus.plexus.classworlds.launcher.Launcher.mainWithExitCode (Launcher.java:415)
    at org.codehaus.plexus.classworlds.launcher.Launcher.main (Launcher.java:356)
[ERROR]
[ERROR] Re-run Maven using the -X switch to enable full debug logging.
[ERROR]
[ERROR] For more information about the errors and possible solutions, please read the following articles:
[ERROR] [Help 1] http://cwiki.apache.org/confluence/display/MAVEN/MojoFailureException
[ERROR]
[ERROR] After correcting the problems, you can resume the build with the command
[ERROR]   mvn <goals> -rf :maven-surefire-common
[Pipeline] }
[Pipeline] // withEnv
[Pipeline] }
[Pipeline] // stage
[Pipeline] fileExists
[Pipeline] fileExists
[Pipeline] archiveArtifacts
Archiving artifacts
[Pipeline] cleanWs
[WS-CLEANUP] Deleting project workspace...
[WS-CLEANUP] Deferred wipeout is used...
[WS-CLEANUP] done
[Pipeline] }
[Pipeline] // ws
[Pipeline] }
[Pipeline] // timestamps
[Pipeline] }
[Pipeline] // node
[Pipeline] }
[Pipeline] // parallel
[Pipeline] echo
Build result: FAILURE
[Pipeline] jiraIssueSelector
[Pipeline] emailext
Reply | Threaded
Open this post in threaded view
|

Build succeeded in Jenkins: Maven TLP » maven-surefire » SUREFIRE-1585-tibor2 #3

Apache Jenkins Server-2