Build failed in Jenkins: Maven TLP » maven-surefire » SUREFIRE-1570 #8

classic Classic list List threaded Threaded
3 messages Options
Reply | Threaded
Open this post in threaded view
|

Build failed in Jenkins: Maven TLP » maven-surefire » SUREFIRE-1570 #8

Apache Jenkins Server-2
See https://builds.apache.org/job/maven-box/job/maven-surefire/job/SUREFIRE-1570/8/

Changes:

* improved coverage in getEffectiveJvm()

No tests ran.

Build log:
[...truncated 15068 lines...]
[2020-05-16T04:32:59.348Z] [WARNING]   - META-INF/LICENSE.txt
[2020-05-16T04:32:59.348Z] [WARNING]   - META-INF/NOTICE.txt
[2020-05-16T04:32:59.348Z] [WARNING] maven-shared-utils-3.1.0.jar, surefire-shared-utils-3.0.0-SNAPSHOT.jar define 3 overlapping resources:
[2020-05-16T04:32:59.348Z] [WARNING]   - META-INF/DEPENDENCIES
[2020-05-16T04:32:59.348Z] [WARNING]   - META-INF/LICENSE
[2020-05-16T04:32:59.348Z] [WARNING]   - META-INF/NOTICE
[2020-05-16T04:32:59.348Z] [WARNING] commons-codec-1.11.jar, commons-compress-1.20.jar, commons-io-2.6.jar, commons-lang3-3.8.1.jar, maven-shared-utils-3.1.0.jar, surefire-shared-utils-3.0.0-SNAPSHOT.jar define 1 overlapping resources:
[2020-05-16T04:32:59.348Z] [WARNING]   - META-INF/MANIFEST.MF
[2020-05-16T04:32:59.348Z] [WARNING] maven-shade-plugin has detected that some class files are
[2020-05-16T04:32:59.348Z] [WARNING] present in two or more JARs. When this happens, only one
[2020-05-16T04:32:59.349Z] [WARNING] single version of the class is copied to the uber jar.
[2020-05-16T04:32:59.349Z] [WARNING] Usually this is not harmful and you can skip these warnings,
[2020-05-16T04:32:59.349Z] [WARNING] otherwise try to manually exclude artifacts based on
[2020-05-16T04:32:59.349Z] [WARNING] mvn dependency:tree -Ddetail=true and the above output.
[2020-05-16T04:32:59.349Z] [WARNING] See http://maven.apache.org/plugins/maven-shade-plugin/
[2020-05-16T04:32:59.349Z] [INFO] Replacing original artifact with shaded artifact.
[2020-05-16T04:32:59.349Z] [INFO] Replacing C:\Users\jenkins\AppData\Local\Temp\2\jenkins-maven-box-maven-surefire-SUREFIRE-1570-8\surefire-shared-utils\target\surefire-shared-utils-3.0.0-SNAPSHOT.jar with C:\Users\jenkins\AppData\Local\Temp\2\jenkins-maven-box-maven-surefire-SUREFIRE-1570-8\surefire-shared-utils\target\surefire-shared-utils-3.0.0-SNAPSHOT-shaded.jar
[2020-05-16T04:32:59.349Z] [INFO] Dependency-reduced POM written at: C:\Users\jenkins\AppData\Local\Temp\2\jenkins-maven-box-maven-surefire-SUREFIRE-1570-8\surefire-shared-utils\dependency-reduced-pom.xml
[2020-05-16T04:32:59.647Z] [INFO]
[2020-05-16T04:32:59.647Z] [INFO] --- maven-checkstyle-plugin:3.0.0:check (checkstyle-check) @ surefire-shared-utils ---
[2020-05-16T04:32:59.647Z] [INFO]
[2020-05-16T04:32:59.647Z] [INFO] --- maven-install-plugin:2.5.2:install (default-install) @ surefire-shared-utils ---
[2020-05-16T04:32:59.647Z] [INFO] Installing C:\Users\jenkins\AppData\Local\Temp\2\jenkins-maven-box-maven-surefire-SUREFIRE-1570-8\surefire-shared-utils\target\surefire-shared-utils-3.0.0-SNAPSHOT.jar to C:\Users\jenkins\AppData\Local\Temp\2\jenkins-maven-box-maven-surefire-SUREFIRE-1570-8\.m2\org\apache\maven\surefire\surefire-shared-utils\3.0.0-SNAPSHOT\surefire-shared-utils-3.0.0-SNAPSHOT.jar
[2020-05-16T04:32:59.917Z] [INFO] Installing C:\Users\jenkins\AppData\Local\Temp\2\jenkins-maven-box-maven-surefire-SUREFIRE-1570-8\surefire-shared-utils\dependency-reduced-pom.xml to C:\Users\jenkins\AppData\Local\Temp\2\jenkins-maven-box-maven-surefire-SUREFIRE-1570-8\.m2\org\apache\maven\surefire\surefire-shared-utils\3.0.0-SNAPSHOT\surefire-shared-utils-3.0.0-SNAPSHOT.pom
[2020-05-16T04:32:59.917Z] [INFO] ------------------------------------------------------------------------
[2020-05-16T04:32:59.917Z] [INFO] Reactor Summary for Apache Maven Surefire 3.0.0-SNAPSHOT:
[2020-05-16T04:32:59.917Z] [INFO]
[2020-05-16T04:32:59.917Z] [INFO] Apache Maven Surefire .............................. SUCCESS [ 47.926 s]
[2020-05-16T04:32:59.917Z] [INFO] SureFire Logger API ................................ SUCCESS [ 18.939 s]
[2020-05-16T04:32:59.917Z] [INFO] SureFire API ....................................... SUCCESS [ 21.222 s]
[2020-05-16T04:32:59.917Z] [INFO] Surefire Extensions API ............................ SUCCESS [  5.694 s]
[2020-05-16T04:32:59.917Z] [INFO] Surefire Extensions SPI ............................ SUCCESS [  2.052 s]
[2020-05-16T04:32:59.917Z] [INFO] SureFire Booter .................................... SUCCESS [ 20.636 s]
[2020-05-16T04:32:59.917Z] [INFO] Maven Surefire Test-Grouping Support ............... SUCCESS [  8.497 s]
[2020-05-16T04:32:59.917Z] [INFO] SureFire Providers ................................. SUCCESS [  0.876 s]
[2020-05-16T04:32:59.917Z] [INFO] Shared JUnit3 Provider Code ........................ SUCCESS [  4.276 s]
[2020-05-16T04:32:59.917Z] [INFO] Shared Java 5 Provider Base ........................ SUCCESS [  4.864 s]
[2020-05-16T04:32:59.917Z] [INFO] Shared JUnit4 Provider Code ........................ SUCCESS [  5.793 s]
[2020-05-16T04:32:59.917Z] [INFO] Shared JUnit48 Provider Code ....................... SUCCESS [  8.043 s]
[2020-05-16T04:32:59.917Z] [INFO] SureFire JUnit Runner .............................. SUCCESS [  4.239 s]
[2020-05-16T04:32:59.917Z] [INFO] SureFire JUnit4 Runner ............................. SUCCESS [  4.783 s]
[2020-05-16T04:32:59.917Z] [INFO] Maven Surefire Common .............................. SUCCESS [ 54.872 s]
[2020-05-16T04:32:59.917Z] [INFO] SureFire JUnitCore Runner .......................... SUCCESS [02:14 min]
[2020-05-16T04:32:59.917Z] [INFO] SureFire JUnit Platform Runner ..................... SUCCESS [ 11.595 s]
[2020-05-16T04:32:59.917Z] [INFO] SureFire TestNG Utils .............................. SUCCESS [  4.626 s]
[2020-05-16T04:32:59.917Z] [INFO] SureFire TestNG Runner ............................. SUCCESS [  7.238 s]
[2020-05-16T04:32:59.917Z] [INFO] ShadeFire JUnit3 Provider .......................... SUCCESS [  1.988 s]
[2020-05-16T04:32:59.917Z] [INFO] Surefire Report Parser ............................. SUCCESS [  6.957 s]
[2020-05-16T04:32:59.917Z] [INFO] Maven Surefire Plugin .............................. SUCCESS [ 11.609 s]
[2020-05-16T04:32:59.917Z] [INFO] Maven Failsafe Plugin .............................. SUCCESS [01:36 min]
[2020-05-16T04:32:59.917Z] [INFO] Maven Surefire Report Plugin ....................... SUCCESS [ 18.062 s]
[2020-05-16T04:32:59.917Z] [INFO] Maven Surefire Integration Tests ................... SUCCESS [  01:35 h]
[2020-05-16T04:32:59.917Z] [INFO] Surefire Shared Utils .............................. SUCCESS [  2.155 s]
[2020-05-16T04:32:59.917Z] [INFO] ------------------------------------------------------------------------
[2020-05-16T04:32:59.917Z] [INFO] BUILD SUCCESS
[2020-05-16T04:32:59.917Z] [INFO] ------------------------------------------------------------------------
[2020-05-16T04:32:59.917Z] [INFO] Total time:  01:43 h
[2020-05-16T04:32:59.917Z] [INFO] Finished at: 2020-05-15T21:32:59-07:00
[2020-05-16T04:32:59.918Z] [INFO] ------------------------------------------------------------------------
[Pipeline] }
[Pipeline] // withEnv
[Pipeline] }
[Pipeline] // stage
[Pipeline] cleanWs
[2020-05-16T04:33:00.019Z] [WS-CLEANUP] Deleting project workspace...
[2020-05-16T04:33:00.020Z] [WS-CLEANUP] Deferred wipeout is used...
[2020-05-16T04:33:00.143Z] [WS-CLEANUP] done
[Pipeline] }
[Pipeline] // ws
[Pipeline] }
[Pipeline] // timestamps
[Pipeline] }
[Pipeline] // node
[Pipeline] }
[2020-05-16T04:33:28.011Z] [INFO] Tests run: 6, Failures: 0, Errors: 0, Skipped: 0, Time elapsed: 116.348 s - in org.apache.maven.surefire.its.jiras.Surefire946KillMainProcessInReusableForkIT
[2020-05-16T04:33:28.011Z] [INFO] Running org.apache.maven.surefire.its.jiras.Surefire972BizarreNoClassDefIT
[2020-05-16T04:33:28.011Z] [INFO] Tests run: 1, Failures: 0, Errors: 0, Skipped: 0, Time elapsed: 9.751 s - in org.apache.maven.surefire.its.jiras.Surefire972BizarreNoClassDefIT
[2020-05-16T04:33:28.011Z] [INFO] Running org.apache.maven.surefire.its.jiras.Surefire975DefaultVMEncodingIT
[2020-05-16T04:33:32.303Z] [INFO] Tests run: 1, Failures: 0, Errors: 0, Skipped: 0, Time elapsed: 5.946 s - in org.apache.maven.surefire.its.jiras.Surefire975DefaultVMEncodingIT
[2020-05-16T04:33:32.303Z] [INFO] Running org.apache.maven.surefire.its.jiras.Surefire979WrongClassLoaderIT
[2020-05-16T04:33:38.987Z] [INFO] Tests run: 1, Failures: 0, Errors: 0, Skipped: 0, Time elapsed: 6.466 s - in org.apache.maven.surefire.its.jiras.Surefire979WrongClassLoaderIT
[2020-05-16T04:33:38.987Z] [INFO] Running org.apache.maven.surefire.its.jiras.Surefire985ParameterizedRunnerAndCategoriesIT
[2020-05-16T04:33:44.378Z] [INFO] Tests run: 1, Failures: 0, Errors: 0, Skipped: 0, Time elapsed: 5.949 s - in org.apache.maven.surefire.its.jiras.Surefire985ParameterizedRunnerAndCategoriesIT
[2020-05-16T04:33:44.378Z] [INFO] Running org.apache.maven.surefire.its.jiras.Surefire995CategoryInheritanceIT
[2020-05-16T04:34:31.264Z] [INFO] Tests run: 7, Failures: 0, Errors: 0, Skipped: 0, Time elapsed: 40.845 s - in org.apache.maven.surefire.its.jiras.Surefire995CategoryInheritanceIT
[2020-05-16T04:34:31.264Z] [INFO]
[2020-05-16T04:34:31.265Z] [INFO] Results:
[2020-05-16T04:34:31.265Z] [INFO]
[2020-05-16T04:34:31.265Z] [WARNING] Tests run: 955, Failures: 0, Errors: 0, Skipped: 146
[2020-05-16T04:34:31.265Z] [INFO]
[2020-05-16T04:34:31.265Z] [INFO]
[2020-05-16T04:34:31.265Z] [INFO] --- maven-checkstyle-plugin:3.0.0:check (checkstyle-check) @ surefire-its ---
[2020-05-16T04:34:31.265Z] [INFO]
[2020-05-16T04:34:31.265Z] [INFO] --- maven-failsafe-plugin:3.0.0-M4:verify (default) @ surefire-its ---
[2020-05-16T04:34:31.265Z] [INFO] Failsafe report directory: C:\Windows\System32\config\systemprofile\AppData\Local\Temp\jenkins-maven-box-maven-surefire-SUREFIRE-1570-8\surefire-its\target\failsafe-reports
[2020-05-16T04:34:31.265Z] [INFO]
[2020-05-16T04:34:31.265Z] [INFO] --- maven-install-plugin:2.5.2:install (default-install) @ surefire-its ---
[2020-05-16T04:34:31.265Z] [INFO] Skipping artifact installation
[2020-05-16T04:34:31.265Z] [INFO]
[2020-05-16T04:34:31.265Z] [INFO] ----------< org.apache.maven.surefire:surefire-shared-utils >-----------
[2020-05-16T04:34:31.265Z] [INFO] Building Surefire Shared Utils 3.0.0-SNAPSHOT                    [26/26]
[2020-05-16T04:34:31.265Z] [INFO] --------------------------------[ jar ]---------------------------------
[2020-05-16T04:34:31.265Z] [INFO]
[2020-05-16T04:34:31.265Z] [INFO] --- maven-clean-plugin:3.1.0:clean (default-clean) @ surefire-shared-utils ---
[2020-05-16T04:34:31.265Z] [INFO]
[2020-05-16T04:34:31.265Z] [INFO] --- maven-enforcer-plugin:3.0.0-M3:enforce (enforce-maven-version) @ surefire-shared-utils ---
[2020-05-16T04:34:31.265Z] [INFO]
[2020-05-16T04:34:31.265Z] [INFO] --- maven-enforcer-plugin:3.0.0-M3:enforce (enforce-bytecode-version) @ surefire-shared-utils ---
[2020-05-16T04:34:31.265Z] [INFO] Adding ignore: module-info
[2020-05-16T04:34:31.265Z] [INFO]
[2020-05-16T04:34:31.265Z] [INFO] --- maven-enforcer-plugin:3.0.0-M3:enforce (enforce-java) @ surefire-shared-utils ---
[2020-05-16T04:34:31.265Z] [INFO]
[2020-05-16T04:34:31.265Z] [INFO] --- maven-enforcer-plugin:3.0.0-M3:enforce (enforce-maven) @ surefire-shared-utils ---
[2020-05-16T04:34:31.265Z] [INFO]
[2020-05-16T04:34:31.265Z] [INFO] --- apache-rat-plugin:0.13:check (rat-check) @ surefire-shared-utils ---
[2020-05-16T04:34:31.265Z] [INFO] Enabled default license matchers.
[2020-05-16T04:34:31.265Z] [INFO] Will parse SCM ignores for exclusions...
[2020-05-16T04:34:31.265Z] [INFO] Finished adding exclusions from SCM ignore files.
[2020-05-16T04:34:31.265Z] [INFO] 62 implicit excludes (use -debug for more details).
[2020-05-16T04:34:31.265Z] [INFO] 27 explicit excludes (use -debug for more details).
[2020-05-16T04:34:31.265Z] [INFO] 1 resources included (use -debug for more details)
[2020-05-16T04:34:31.265Z] [INFO] Rat check: Summary over all files. Unapproved: 0, unknown: 0, generated: 0, approved: 1 licenses.
[2020-05-16T04:34:31.265Z] [INFO]
[2020-05-16T04:34:31.265Z] [INFO] --- maven-compiler-plugin:3.8.1:compile (compile-generated) @ surefire-shared-utils ---
[2020-05-16T04:34:31.265Z] [INFO] No sources to compile
[2020-05-16T04:34:31.265Z] [INFO]
[2020-05-16T04:34:31.265Z] [INFO] --- maven-remote-resources-plugin:1.7.0:process (process-resource-bundles) @ surefire-shared-utils ---
[2020-05-16T04:34:31.265Z] [INFO] Preparing remote bundle org.apache:apache-jar-resource-bundle:1.4
[2020-05-16T04:34:31.265Z] [INFO] Copying 3 resources from 1 bundle.
[2020-05-16T04:34:31.265Z] [INFO]
[2020-05-16T04:34:31.265Z] [INFO] --- maven-resources-plugin:3.1.0:resources (default-resources) @ surefire-shared-utils ---
[2020-05-16T04:34:31.265Z] [INFO] Using 'UTF-8' encoding to copy filtered resources.
[2020-05-16T04:34:31.265Z] [INFO] skip non existing resourceDirectory C:\Windows\System32\config\systemprofile\AppData\Local\Temp\jenkins-maven-box-maven-surefire-SUREFIRE-1570-8\surefire-shared-utils\src\main\resources
[2020-05-16T04:34:31.265Z] [INFO] Copying 3 resources
[2020-05-16T04:34:31.265Z] [INFO]
[2020-05-16T04:34:31.265Z] [INFO] --- maven-compiler-plugin:3.8.1:compile (default-compile) @ surefire-shared-utils ---
[2020-05-16T04:34:31.265Z] [INFO] No sources to compile
[2020-05-16T04:34:31.265Z] [INFO]
[2020-05-16T04:34:31.265Z] [INFO] --- animal-sniffer-maven-plugin:1.17:check (signature-check) @ surefire-shared-utils ---
[2020-05-16T04:34:31.265Z] [INFO] Checking unresolved references to org.codehaus.mojo.signature:java17:1.0
[2020-05-16T04:34:31.265Z] [INFO]
[2020-05-16T04:34:31.265Z] [INFO] --- maven-resources-plugin:3.1.0:testResources (default-testResources) @ surefire-shared-utils ---
[2020-05-16T04:34:31.265Z] [INFO] Using 'UTF-8' encoding to copy filtered resources.
[2020-05-16T04:34:31.265Z] [INFO] skip non existing resourceDirectory C:\Windows\System32\config\systemprofile\AppData\Local\Temp\jenkins-maven-box-maven-surefire-SUREFIRE-1570-8\surefire-shared-utils\src\test\resources
[2020-05-16T04:34:31.265Z] [INFO] Copying 3 resources
[2020-05-16T04:34:31.265Z] [INFO]
[2020-05-16T04:34:31.265Z] [INFO] --- maven-compiler-plugin:3.8.1:testCompile (default-testCompile) @ surefire-shared-utils ---
[2020-05-16T04:34:31.265Z] [INFO] No sources to compile
[2020-05-16T04:34:31.265Z] [INFO]
[2020-05-16T04:34:31.265Z] [INFO] --- maven-surefire-plugin:3.0.0-M4:test (default-test) @ surefire-shared-utils ---
[2020-05-16T04:34:31.265Z] [INFO]
[2020-05-16T04:34:31.265Z] [INFO] --- maven-jar-plugin:3.2.0:jar (default-jar) @ surefire-shared-utils ---
[2020-05-16T04:34:31.266Z] [INFO] Building jar: C:\Windows\System32\config\systemprofile\AppData\Local\Temp\jenkins-maven-box-maven-surefire-SUREFIRE-1570-8\surefire-shared-utils\target\surefire-shared-utils-3.0.0-SNAPSHOT.jar
[2020-05-16T04:34:31.266Z] [INFO]
[2020-05-16T04:34:31.266Z] [INFO] --- maven-site-plugin:3.8.2:attach-descriptor (attach-descriptor) @ surefire-shared-utils ---
[2020-05-16T04:34:31.266Z] [INFO] Skipping because packaging 'jar' is not pom.
[2020-05-16T04:34:31.266Z] [INFO]
[2020-05-16T04:34:31.266Z] [INFO] --- maven-shade-plugin:3.2.3:shade (default) @ surefire-shared-utils ---
[2020-05-16T04:34:31.266Z] [INFO] Including org.apache.maven.shared:maven-shared-utils:jar:3.1.0 in the shaded jar.
[2020-05-16T04:34:31.266Z] [INFO] Including commons-io:commons-io:jar:2.6 in the shaded jar.
[2020-05-16T04:34:31.266Z] [INFO] Including org.apache.commons:commons-lang3:jar:3.8.1 in the shaded jar.
[2020-05-16T04:34:31.266Z] [INFO] Including org.apache.commons:commons-compress:jar:1.20 in the shaded jar.
[2020-05-16T04:34:31.266Z] [INFO] Including commons-codec:commons-codec:jar:1.11 in the shaded jar.
[2020-05-16T04:34:31.266Z] [WARNING] commons-codec-1.11.jar, commons-compress-1.20.jar, commons-io-2.6.jar, commons-lang3-3.8.1.jar, maven-shared-utils-3.1.0.jar, surefire-shared-utils-3.0.0-SNAPSHOT.jar define 1 overlapping resources:
[2020-05-16T04:34:31.266Z] [WARNING]   - META-INF/MANIFEST.MF
[2020-05-16T04:34:31.266Z] [WARNING] maven-shared-utils-3.1.0.jar, surefire-shared-utils-3.0.0-SNAPSHOT.jar define 3 overlapping resources:
[2020-05-16T04:34:31.266Z] [WARNING]   - META-INF/DEPENDENCIES
[2020-05-16T04:34:31.266Z] [WARNING]   - META-INF/LICENSE
[2020-05-16T04:34:31.266Z] [WARNING]   - META-INF/NOTICE
[2020-05-16T04:34:31.266Z] [WARNING] commons-codec-1.11.jar, commons-compress-1.20.jar, commons-io-2.6.jar, commons-lang3-3.8.1.jar define 2 overlapping resources:
[2020-05-16T04:34:31.266Z] [WARNING]   - META-INF/LICENSE.txt
[2020-05-16T04:34:31.266Z] [WARNING]   - META-INF/NOTICE.txt
[2020-05-16T04:34:31.266Z] [WARNING] maven-shade-plugin has detected that some class files are
[2020-05-16T04:34:31.266Z] [WARNING] present in two or more JARs. When this happens, only one
[2020-05-16T04:34:31.266Z] [WARNING] single version of the class is copied to the uber jar.
[2020-05-16T04:34:31.266Z] [WARNING] Usually this is not harmful and you can skip these warnings,
[2020-05-16T04:34:31.266Z] [WARNING] otherwise try to manually exclude artifacts based on
[2020-05-16T04:34:31.266Z] [WARNING] mvn dependency:tree -Ddetail=true and the above output.
[2020-05-16T04:34:31.266Z] [WARNING] See http://maven.apache.org/plugins/maven-shade-plugin/
[2020-05-16T04:34:31.266Z] [INFO] Replacing original artifact with shaded artifact.
[2020-05-16T04:34:31.266Z] [INFO] Replacing C:\Windows\System32\config\systemprofile\AppData\Local\Temp\jenkins-maven-box-maven-surefire-SUREFIRE-1570-8\surefire-shared-utils\target\surefire-shared-utils-3.0.0-SNAPSHOT.jar with C:\Windows\System32\config\systemprofile\AppData\Local\Temp\jenkins-maven-box-maven-surefire-SUREFIRE-1570-8\surefire-shared-utils\target\surefire-shared-utils-3.0.0-SNAPSHOT-shaded.jar
[2020-05-16T04:34:31.266Z] [INFO] Dependency-reduced POM written at: C:\Windows\System32\config\systemprofile\AppData\Local\Temp\jenkins-maven-box-maven-surefire-SUREFIRE-1570-8\surefire-shared-utils\dependency-reduced-pom.xml
[2020-05-16T04:34:31.266Z] [INFO]
[2020-05-16T04:34:31.266Z] [INFO] --- maven-checkstyle-plugin:3.0.0:check (checkstyle-check) @ surefire-shared-utils ---
[2020-05-16T04:34:31.266Z] [INFO]
[2020-05-16T04:34:31.266Z] [INFO] --- maven-install-plugin:2.5.2:install (default-install) @ surefire-shared-utils ---
[2020-05-16T04:34:31.266Z] [INFO] Installing C:\Windows\System32\config\systemprofile\AppData\Local\Temp\jenkins-maven-box-maven-surefire-SUREFIRE-1570-8\surefire-shared-utils\target\surefire-shared-utils-3.0.0-SNAPSHOT.jar to C:\Windows\system32\config\systemprofile\AppData\Local\Temp\jenkins-maven-box-maven-surefire-SUREFIRE-1570-8\.m2\org\apache\maven\surefire\surefire-shared-utils\3.0.0-SNAPSHOT\surefire-shared-utils-3.0.0-SNAPSHOT.jar
[2020-05-16T04:34:31.266Z] [INFO] Installing C:\Windows\System32\config\systemprofile\AppData\Local\Temp\jenkins-maven-box-maven-surefire-SUREFIRE-1570-8\surefire-shared-utils\dependency-reduced-pom.xml to C:\Windows\system32\config\systemprofile\AppData\Local\Temp\jenkins-maven-box-maven-surefire-SUREFIRE-1570-8\.m2\org\apache\maven\surefire\surefire-shared-utils\3.0.0-SNAPSHOT\surefire-shared-utils-3.0.0-SNAPSHOT.pom
[2020-05-16T04:34:31.266Z] [INFO] ------------------------------------------------------------------------
[2020-05-16T04:34:31.266Z] [INFO] Reactor Summary for Apache Maven Surefire 3.0.0-SNAPSHOT:
[2020-05-16T04:34:31.266Z] [INFO]
[2020-05-16T04:34:31.266Z] [INFO] Apache Maven Surefire .............................. SUCCESS [01:09 min]
[2020-05-16T04:34:31.266Z] [INFO] SureFire Logger API ................................ SUCCESS [ 20.229 s]
[2020-05-16T04:34:31.266Z] [INFO] SureFire API ....................................... SUCCESS [ 23.924 s]
[2020-05-16T04:34:31.266Z] [INFO] Surefire Extensions API ............................ SUCCESS [  7.252 s]
[2020-05-16T04:34:31.266Z] [INFO] Surefire Extensions SPI ............................ SUCCESS [  2.275 s]
[2020-05-16T04:34:31.267Z] [INFO] SureFire Booter .................................... SUCCESS [ 21.224 s]
[2020-05-16T04:34:31.267Z] [INFO] Maven Surefire Test-Grouping Support ............... SUCCESS [ 10.001 s]
[2020-05-16T04:34:31.267Z] [INFO] SureFire Providers ................................. SUCCESS [  0.746 s]
[2020-05-16T04:34:31.267Z] [INFO] Shared JUnit3 Provider Code ........................ SUCCESS [  4.951 s]
[2020-05-16T04:34:31.267Z] [INFO] Shared Java 5 Provider Base ........................ SUCCESS [  5.435 s]
[2020-05-16T04:34:31.267Z] [INFO] Shared JUnit4 Provider Code ........................ SUCCESS [  6.091 s]
[2020-05-16T04:34:31.267Z] [INFO] Shared JUnit48 Provider Code ....................... SUCCESS [ 12.946 s]
[2020-05-16T04:34:31.267Z] [INFO] SureFire JUnit Runner .............................. SUCCESS [  4.938 s]
[2020-05-16T04:34:31.267Z] [INFO] SureFire JUnit4 Runner ............................. SUCCESS [  5.056 s]
[2020-05-16T04:34:31.267Z] [INFO] Maven Surefire Common .............................. SUCCESS [ 58.789 s]
[2020-05-16T04:34:31.267Z] [INFO] SureFire JUnitCore Runner .......................... SUCCESS [02:23 min]
[2020-05-16T04:34:31.267Z] [INFO] SureFire JUnit Platform Runner ..................... SUCCESS [ 11.659 s]
[2020-05-16T04:34:31.267Z] [INFO] SureFire TestNG Utils .............................. SUCCESS [  5.308 s]
[2020-05-16T04:34:31.267Z] [INFO] SureFire TestNG Runner ............................. SUCCESS [  6.905 s]
[2020-05-16T04:34:31.267Z] [INFO] ShadeFire JUnit3 Provider .......................... SUCCESS [  2.312 s]
[2020-05-16T04:34:31.267Z] [INFO] Surefire Report Parser ............................. SUCCESS [  7.612 s]
[2020-05-16T04:34:31.267Z] [INFO] Maven Surefire Plugin .............................. SUCCESS [ 12.095 s]
[2020-05-16T04:34:31.267Z] [INFO] Maven Failsafe Plugin .............................. SUCCESS [01:42 min]
[2020-05-16T04:34:31.267Z] [INFO] Maven Surefire Report Plugin ....................... SUCCESS [ 19.616 s]
[2020-05-16T04:34:31.267Z] [INFO] Maven Surefire Integration Tests ................... SUCCESS [  01:35 h]
[2020-05-16T04:34:31.267Z] [INFO] Surefire Shared Utils .............................. SUCCESS [  2.306 s]
[2020-05-16T04:34:31.267Z] [INFO] ------------------------------------------------------------------------
[2020-05-16T04:34:31.267Z] [INFO] BUILD SUCCESS
[2020-05-16T04:34:31.267Z] [INFO] ------------------------------------------------------------------------
[2020-05-16T04:34:31.267Z] [INFO] Total time:  01:44 h
[2020-05-16T04:34:31.267Z] [INFO] Finished at: 2020-05-15T21:34:29-07:00
[2020-05-16T04:34:31.267Z] [INFO] ------------------------------------------------------------------------
[Pipeline] }
[Pipeline] // withEnv
[Pipeline] }
[Pipeline] // stage
[Pipeline] cleanWs
[2020-05-16T04:34:31.396Z] [WS-CLEANUP] Deleting project workspace...
[2020-05-16T04:34:31.396Z] [WS-CLEANUP] Deferred wipeout is used...
[2020-05-16T04:34:31.551Z] [WS-CLEANUP] done
[Pipeline] }
[Pipeline] // ws
[Pipeline] }
[Pipeline] // timestamps
[Pipeline] }
[Pipeline] // node
[Pipeline] }
[Pipeline] // parallel
[Pipeline] echo
hudson.AbortException: hudson.AbortException: Error cloning remote repo 'origin'
[Pipeline] echo
Build result: FAILURE
[Pipeline] jiraIssueSelector
[Pipeline] echo
The authors of changes [tibordigana].
[Pipeline] echo
Sending email ...
[Pipeline] emailext
Reply | Threaded
Open this post in threaded view
|

Build failed in Jenkins: Maven TLP » maven-surefire » SUREFIRE-1570 #9

Apache Jenkins Server-2
See https://builds.apache.org/job/maven-box/job/maven-surefire/job/SUREFIRE-1570/9/

Changes:

* IT

All tests passed

Build log:
[...truncated 30574 lines...]
[2020-05-16T06:18:13.485Z] [WARNING]   - META-INF/MANIFEST.MF
[2020-05-16T06:18:13.485Z] [WARNING] commons-codec-1.11.jar, commons-compress-1.20.jar, commons-io-2.6.jar, commons-lang3-3.8.1.jar define 2 overlapping resources:
[2020-05-16T06:18:13.485Z] [WARNING]   - META-INF/LICENSE.txt
[2020-05-16T06:18:13.485Z] [WARNING]   - META-INF/NOTICE.txt
[2020-05-16T06:18:13.485Z] [WARNING] maven-shade-plugin has detected that some class files are
[2020-05-16T06:18:13.485Z] [WARNING] present in two or more JARs. When this happens, only one
[2020-05-16T06:18:13.485Z] [WARNING] single version of the class is copied to the uber jar.
[2020-05-16T06:18:13.485Z] [WARNING] Usually this is not harmful and you can skip these warnings,
[2020-05-16T06:18:13.485Z] [WARNING] otherwise try to manually exclude artifacts based on
[2020-05-16T06:18:13.485Z] [WARNING] mvn dependency:tree -Ddetail=true and the above output.
[2020-05-16T06:18:13.485Z] [WARNING] See http://maven.apache.org/plugins/maven-shade-plugin/
[2020-05-16T06:18:13.485Z] [INFO] Replacing original artifact with shaded artifact.
[2020-05-16T06:18:13.485Z] [INFO] Replacing C:\Users\jenkins\AppData\Local\Temp\2\jenkins-maven-box-maven-surefire-SUREFIRE-1570-9@2\surefire-shared-utils\target\surefire-shared-utils-3.0.0-SNAPSHOT.jar with C:\Users\jenkins\AppData\Local\Temp\2\jenkins-maven-box-maven-surefire-SUREFIRE-1570-9@2\surefire-shared-utils\target\surefire-shared-utils-3.0.0-SNAPSHOT-shaded.jar
[2020-05-16T06:18:13.485Z] [INFO] Dependency-reduced POM written at: C:\Users\jenkins\AppData\Local\Temp\2\jenkins-maven-box-maven-surefire-SUREFIRE-1570-9@2\surefire-shared-utils\dependency-reduced-pom.xml
[2020-05-16T06:18:13.485Z] [INFO]
[2020-05-16T06:18:13.485Z] [INFO] --- maven-checkstyle-plugin:3.0.0:check (checkstyle-check) @ surefire-shared-utils ---
[2020-05-16T06:18:13.485Z] [INFO]
[2020-05-16T06:18:13.485Z] [INFO] --- maven-install-plugin:2.5.2:install (default-install) @ surefire-shared-utils ---
[2020-05-16T06:18:13.485Z] [INFO] Installing C:\Users\jenkins\AppData\Local\Temp\2\jenkins-maven-box-maven-surefire-SUREFIRE-1570-9@2\surefire-shared-utils\target\surefire-shared-utils-3.0.0-SNAPSHOT.jar to C:\Users\jenkins\AppData\Local\Temp\2\jenkins-maven-box-maven-surefire-SUREFIRE-1570-9@2\.m2\org\apache\maven\surefire\surefire-shared-utils\3.0.0-SNAPSHOT\surefire-shared-utils-3.0.0-SNAPSHOT.jar
[2020-05-16T06:18:13.485Z] [INFO] Installing C:\Users\jenkins\AppData\Local\Temp\2\jenkins-maven-box-maven-surefire-SUREFIRE-1570-9@2\surefire-shared-utils\dependency-reduced-pom.xml to C:\Users\jenkins\AppData\Local\Temp\2\jenkins-maven-box-maven-surefire-SUREFIRE-1570-9@2\.m2\org\apache\maven\surefire\surefire-shared-utils\3.0.0-SNAPSHOT\surefire-shared-utils-3.0.0-SNAPSHOT.pom
[2020-05-16T06:18:13.485Z] [INFO] ------------------------------------------------------------------------
[2020-05-16T06:18:13.485Z] [INFO] Reactor Summary for Apache Maven Surefire 3.0.0-SNAPSHOT:
[2020-05-16T06:18:13.485Z] [INFO]
[2020-05-16T06:18:13.485Z] [INFO] Apache Maven Surefire .............................. SUCCESS [ 46.138 s]
[2020-05-16T06:18:13.485Z] [INFO] SureFire Logger API ................................ SUCCESS [ 18.283 s]
[2020-05-16T06:18:13.485Z] [INFO] SureFire API ....................................... SUCCESS [ 21.166 s]
[2020-05-16T06:18:13.485Z] [INFO] Surefire Extensions API ............................ SUCCESS [  6.502 s]
[2020-05-16T06:18:13.485Z] [INFO] Surefire Extensions SPI ............................ SUCCESS [  2.101 s]
[2020-05-16T06:18:13.485Z] [INFO] SureFire Booter .................................... SUCCESS [ 20.936 s]
[2020-05-16T06:18:13.485Z] [INFO] Maven Surefire Test-Grouping Support ............... SUCCESS [  8.651 s]
[2020-05-16T06:18:13.485Z] [INFO] SureFire Providers ................................. SUCCESS [  0.761 s]
[2020-05-16T06:18:13.485Z] [INFO] Shared JUnit3 Provider Code ........................ SUCCESS [  4.266 s]
[2020-05-16T06:18:13.485Z] [INFO] Shared Java 5 Provider Base ........................ SUCCESS [  5.720 s]
[2020-05-16T06:18:13.485Z] [INFO] Shared JUnit4 Provider Code ........................ SUCCESS [  6.292 s]
[2020-05-16T06:18:13.485Z] [INFO] Shared JUnit48 Provider Code ....................... SUCCESS [  9.426 s]
[2020-05-16T06:18:13.485Z] [INFO] SureFire JUnit Runner .............................. SUCCESS [  6.277 s]
[2020-05-16T06:18:13.485Z] [INFO] SureFire JUnit4 Runner ............................. SUCCESS [  5.022 s]
[2020-05-16T06:18:13.485Z] [INFO] Maven Surefire Common .............................. SUCCESS [ 56.887 s]
[2020-05-16T06:18:13.486Z] [INFO] SureFire JUnitCore Runner .......................... SUCCESS [02:22 min]
[2020-05-16T06:18:13.486Z] [INFO] SureFire JUnit Platform Runner ..................... SUCCESS [ 11.129 s]
[2020-05-16T06:18:13.486Z] [INFO] SureFire TestNG Utils .............................. SUCCESS [  5.045 s]
[2020-05-16T06:18:13.486Z] [INFO] SureFire TestNG Runner ............................. SUCCESS [  6.827 s]
[2020-05-16T06:18:13.486Z] [INFO] ShadeFire JUnit3 Provider .......................... SUCCESS [  2.437 s]
[2020-05-16T06:18:13.486Z] [INFO] Surefire Report Parser ............................. SUCCESS [  6.772 s]
[2020-05-16T06:18:13.486Z] [INFO] Maven Surefire Plugin .............................. SUCCESS [ 12.304 s]
[2020-05-16T06:18:13.486Z] [INFO] Maven Failsafe Plugin .............................. SUCCESS [01:35 min]
[2020-05-16T06:18:13.486Z] [INFO] Maven Surefire Report Plugin ....................... SUCCESS [ 17.699 s]
[2020-05-16T06:18:13.486Z] [INFO] Maven Surefire Integration Tests ................... SUCCESS [  01:34 h]
[2020-05-16T06:18:13.486Z] [INFO] Surefire Shared Utils .............................. SUCCESS [  2.381 s]
[2020-05-16T06:18:13.486Z] [INFO] ------------------------------------------------------------------------
[2020-05-16T06:18:13.486Z] [INFO] BUILD SUCCESS
[2020-05-16T06:18:13.486Z] [INFO] ------------------------------------------------------------------------
[2020-05-16T06:18:13.486Z] [INFO] Total time:  01:43 h
[2020-05-16T06:18:13.486Z] [INFO] Finished at: 2020-05-15T23:18:10-07:00
[2020-05-16T06:18:13.486Z] [INFO] ------------------------------------------------------------------------
[Pipeline] }
[Pipeline] // withEnv
[Pipeline] }
[Pipeline] // stage
[Pipeline] cleanWs
[2020-05-16T06:18:13.606Z] [WS-CLEANUP] Deleting project workspace...
[2020-05-16T06:18:13.606Z] [WS-CLEANUP] Deferred wipeout is used...
[2020-05-16T06:18:13.740Z] [WS-CLEANUP] done
[Pipeline] }
[Pipeline] // ws
[Pipeline] }
[Pipeline] // timestamps
[Pipeline] }
[Pipeline] // node
[Pipeline] }
[2020-05-16T06:18:26.857Z] [INFO] Tests run: 4, Failures: 0, Errors: 0, Skipped: 0, Time elapsed: 58.06 s - in org.apache.maven.surefire.its.jiras.Surefire855AllowFailsafeUseArtifactFileIT
[2020-05-16T06:18:26.857Z] [INFO] Running org.apache.maven.surefire.its.jiras.Surefire901MIssingResultfileWhenNoTestsIT
[2020-05-16T06:18:26.857Z] [INFO] Tests run: 1, Failures: 0, Errors: 0, Skipped: 0, Time elapsed: 5.07 s - in org.apache.maven.surefire.its.jiras.Surefire901MIssingResultfileWhenNoTestsIT
[2020-05-16T06:18:26.857Z] [INFO] Running org.apache.maven.surefire.its.jiras.Surefire907PerThreadWithoutThreadCountIT
[2020-05-16T06:18:26.857Z] [INFO] Tests run: 1, Failures: 0, Errors: 0, Skipped: 0, Time elapsed: 4.627 s - in org.apache.maven.surefire.its.jiras.Surefire907PerThreadWithoutThreadCountIT
[2020-05-16T06:18:26.857Z] [INFO] Running org.apache.maven.surefire.its.jiras.Surefire920TestFailureIgnoreWithTimeoutIT
[2020-05-16T06:18:41.917Z] [INFO] Tests run: 2, Failures: 0, Errors: 0, Skipped: 0, Time elapsed: 15.236 s - in org.apache.maven.surefire.its.jiras.Surefire920TestFailureIgnoreWithTimeoutIT
[2020-05-16T06:18:41.917Z] [INFO] Running org.apache.maven.surefire.its.jiras.Surefire926FailureWith2ProvidersIT
[2020-05-16T06:18:46.238Z] [INFO] Tests run: 1, Failures: 0, Errors: 0, Skipped: 0, Time elapsed: 4.774 s - in org.apache.maven.surefire.its.jiras.Surefire926FailureWith2ProvidersIT
[2020-05-16T06:18:46.238Z] [INFO] Running org.apache.maven.surefire.its.jiras.Surefire930TestNgSuiteXmlIT
[2020-05-16T06:18:56.399Z] [INFO] Tests run: 1, Failures: 0, Errors: 0, Skipped: 0, Time elapsed: 8.508 s - in org.apache.maven.surefire.its.jiras.Surefire930TestNgSuiteXmlIT
[2020-05-16T06:18:56.399Z] [INFO] Running org.apache.maven.surefire.its.jiras.Surefire943ReportContentIT
[2020-05-16T06:19:28.713Z] [INFO] Tests run: 2, Failures: 0, Errors: 0, Skipped: 0, Time elapsed: 30.594 s - in org.apache.maven.surefire.its.jiras.Surefire943ReportContentIT
[2020-05-16T06:19:28.713Z] [INFO] Running org.apache.maven.surefire.its.jiras.Surefire946KillMainProcessInReusableForkIT
[2020-05-16T06:21:35.513Z] [INFO] Tests run: 6, Failures: 0, Errors: 0, Skipped: 0, Time elapsed: 115.803 s - in org.apache.maven.surefire.its.jiras.Surefire946KillMainProcessInReusableForkIT
[2020-05-16T06:21:35.513Z] [INFO] Running org.apache.maven.surefire.its.jiras.Surefire972BizarreNoClassDefIT
[2020-05-16T06:21:35.513Z] [INFO] Tests run: 1, Failures: 0, Errors: 0, Skipped: 0, Time elapsed: 10.099 s - in org.apache.maven.surefire.its.jiras.Surefire972BizarreNoClassDefIT
[2020-05-16T06:21:35.513Z] [INFO] Running org.apache.maven.surefire.its.jiras.Surefire975DefaultVMEncodingIT
[2020-05-16T06:21:37.513Z] [INFO] Tests run: 1, Failures: 0, Errors: 0, Skipped: 0, Time elapsed: 6.128 s - in org.apache.maven.surefire.its.jiras.Surefire975DefaultVMEncodingIT
[2020-05-16T06:21:37.513Z] [INFO] Running org.apache.maven.surefire.its.jiras.Surefire979WrongClassLoaderIT
[2020-05-16T06:21:44.222Z] [INFO] Tests run: 1, Failures: 0, Errors: 0, Skipped: 0, Time elapsed: 6.319 s - in org.apache.maven.surefire.its.jiras.Surefire979WrongClassLoaderIT
[2020-05-16T06:21:44.222Z] [INFO] Running org.apache.maven.surefire.its.jiras.Surefire985ParameterizedRunnerAndCategoriesIT
[2020-05-16T06:21:49.632Z] [INFO] Tests run: 1, Failures: 0, Errors: 0, Skipped: 0, Time elapsed: 5.718 s - in org.apache.maven.surefire.its.jiras.Surefire985ParameterizedRunnerAndCategoriesIT
[2020-05-16T06:21:49.632Z] [INFO] Running org.apache.maven.surefire.its.jiras.Surefire995CategoryInheritanceIT
[2020-05-16T06:22:28.736Z] [INFO] Tests run: 7, Failures: 0, Errors: 0, Skipped: 0, Time elapsed: 37.841 s - in org.apache.maven.surefire.its.jiras.Surefire995CategoryInheritanceIT
[2020-05-16T06:22:28.736Z] [INFO]
[2020-05-16T06:22:28.736Z] [INFO] Results:
[2020-05-16T06:22:28.736Z] [INFO]
[2020-05-16T06:22:28.736Z] [ERROR] Errors:
[2020-05-16T06:22:28.736Z] [ERROR]   Surefire1534ReuseForksFalseWithJavaModuleIT.testExecuteWithReuseForksFalseWithJavaModuleWithFilter:67 » SurefireVerifier
[2020-05-16T06:22:28.736Z] [INFO]
[2020-05-16T06:22:28.736Z] [ERROR] Tests run: 956, Failures: 0, Errors: 1, Skipped: 146
[2020-05-16T06:22:28.736Z] [INFO]
[2020-05-16T06:22:28.736Z] [INFO]
[2020-05-16T06:22:28.736Z] [INFO] --- maven-checkstyle-plugin:3.0.0:check (checkstyle-check) @ surefire-its ---
[2020-05-16T06:22:31.372Z] [INFO]
[2020-05-16T06:22:31.372Z] [INFO] --- maven-failsafe-plugin:3.0.0-M4:verify (default) @ surefire-its ---
[2020-05-16T06:22:31.372Z] [INFO] Failsafe report directory: C:\Windows\System32\config\systemprofile\AppData\Local\Temp\jenkins-maven-box-maven-surefire-SUREFIRE-1570-9\surefire-its\target\failsafe-reports
[2020-05-16T06:22:31.372Z] [INFO] ------------------------------------------------------------------------
[2020-05-16T06:22:31.372Z] [INFO] Reactor Summary for Apache Maven Surefire 3.0.0-SNAPSHOT:
[2020-05-16T06:22:31.372Z] [INFO]
[2020-05-16T06:22:31.372Z] [INFO] Apache Maven Surefire .............................. SUCCESS [ 57.577 s]
[2020-05-16T06:22:31.372Z] [INFO] SureFire Logger API ................................ SUCCESS [ 21.072 s]
[2020-05-16T06:22:31.372Z] [INFO] SureFire API ....................................... SUCCESS [ 22.216 s]
[2020-05-16T06:22:31.372Z] [INFO] Surefire Extensions API ............................ SUCCESS [  6.686 s]
[2020-05-16T06:22:31.373Z] [INFO] Surefire Extensions SPI ............................ SUCCESS [  2.697 s]
[2020-05-16T06:22:31.373Z] [INFO] SureFire Booter .................................... SUCCESS [ 20.699 s]
[2020-05-16T06:22:31.373Z] [INFO] Maven Surefire Test-Grouping Support ............... SUCCESS [  9.394 s]
[2020-05-16T06:22:31.373Z] [INFO] SureFire Providers ................................. SUCCESS [  0.996 s]
[2020-05-16T06:22:31.373Z] [INFO] Shared JUnit3 Provider Code ........................ SUCCESS [  4.134 s]
[2020-05-16T06:22:31.373Z] [INFO] Shared Java 5 Provider Base ........................ SUCCESS [  5.740 s]
[2020-05-16T06:22:31.373Z] [INFO] Shared JUnit4 Provider Code ........................ SUCCESS [  6.463 s]
[2020-05-16T06:22:31.373Z] [INFO] Shared JUnit48 Provider Code ....................... SUCCESS [  9.342 s]
[2020-05-16T06:22:31.373Z] [INFO] SureFire JUnit Runner .............................. SUCCESS [  5.287 s]
[2020-05-16T06:22:31.373Z] [INFO] SureFire JUnit4 Runner ............................. SUCCESS [  5.444 s]
[2020-05-16T06:22:31.373Z] [INFO] Maven Surefire Common .............................. SUCCESS [01:03 min]
[2020-05-16T06:22:31.373Z] [INFO] SureFire JUnitCore Runner .......................... SUCCESS [02:20 min]
[2020-05-16T06:22:31.373Z] [INFO] SureFire JUnit Platform Runner ..................... SUCCESS [ 13.236 s]
[2020-05-16T06:22:31.373Z] [INFO] SureFire TestNG Utils .............................. SUCCESS [  5.101 s]
[2020-05-16T06:22:31.373Z] [INFO] SureFire TestNG Runner ............................. SUCCESS [  7.565 s]
[2020-05-16T06:22:31.373Z] [INFO] ShadeFire JUnit3 Provider .......................... SUCCESS [  3.189 s]
[2020-05-16T06:22:31.373Z] [INFO] Surefire Report Parser ............................. SUCCESS [  7.437 s]
[2020-05-16T06:22:31.373Z] [INFO] Maven Surefire Plugin .............................. SUCCESS [ 13.433 s]
[2020-05-16T06:22:31.373Z] [INFO] Maven Failsafe Plugin .............................. SUCCESS [01:48 min]
[2020-05-16T06:22:31.373Z] [INFO] Maven Surefire Report Plugin ....................... SUCCESS [ 18.780 s]
[2020-05-16T06:22:31.373Z] [INFO] Maven Surefire Integration Tests ................... FAILURE [  01:37 h]
[2020-05-16T06:22:31.373Z] [INFO] Surefire Shared Utils .............................. SKIPPED
[2020-05-16T06:22:31.373Z] [INFO] ------------------------------------------------------------------------
[2020-05-16T06:22:31.373Z] [INFO] BUILD FAILURE
[2020-05-16T06:22:31.373Z] [INFO] ------------------------------------------------------------------------
[2020-05-16T06:22:31.373Z] [INFO] Total time:  01:46 h
[2020-05-16T06:22:31.373Z] [INFO] Finished at: 2020-05-15T23:22:31-07:00
[2020-05-16T06:22:31.373Z] [INFO] ------------------------------------------------------------------------
[2020-05-16T06:22:31.373Z] [ERROR] Failed to execute goal org.apache.maven.plugins:maven-failsafe-plugin:3.0.0-M4:verify (default) on project surefire-its: There are test failures.
[2020-05-16T06:22:31.373Z] [ERROR]
[2020-05-16T06:22:31.373Z] [ERROR] Please refer to C:\Windows\System32\config\systemprofile\AppData\Local\Temp\jenkins-maven-box-maven-surefire-SUREFIRE-1570-9\surefire-its\target\failsafe-reports for the individual test results.
[2020-05-16T06:22:31.373Z] [ERROR] Please refer to dump files (if any exist) [date].dump, [date]-jvmRun[N].dump and [date].dumpstream.
[2020-05-16T06:22:31.373Z] [ERROR] -> [Help 1]
[2020-05-16T06:22:31.373Z] org.apache.maven.lifecycle.LifecycleExecutionException: Failed to execute goal org.apache.maven.plugins:maven-failsafe-plugin:3.0.0-M4:verify (default) on project surefire-its: There are test failures.
[2020-05-16T06:22:31.373Z]
[2020-05-16T06:22:31.373Z] Please refer to C:\Windows\System32\config\systemprofile\AppData\Local\Temp\jenkins-maven-box-maven-surefire-SUREFIRE-1570-9\surefire-its\target\failsafe-reports for the individual test results.
[2020-05-16T06:22:31.373Z] Please refer to dump files (if any exist) [date].dump, [date]-jvmRun[N].dump and [date].dumpstream.
[2020-05-16T06:22:31.373Z]     at org.apache.maven.lifecycle.internal.MojoExecutor.execute (MojoExecutor.java:215)
[2020-05-16T06:22:31.373Z]     at org.apache.maven.lifecycle.internal.MojoExecutor.execute (MojoExecutor.java:156)
[2020-05-16T06:22:31.373Z]     at org.apache.maven.lifecycle.internal.MojoExecutor.execute (MojoExecutor.java:148)
[2020-05-16T06:22:31.373Z]     at org.apache.maven.lifecycle.internal.LifecycleModuleBuilder.buildProject (LifecycleModuleBuilder.java:117)
[2020-05-16T06:22:31.373Z]     at org.apache.maven.lifecycle.internal.LifecycleModuleBuilder.buildProject (LifecycleModuleBuilder.java:81)
[2020-05-16T06:22:31.373Z]     at org.apache.maven.lifecycle.internal.builder.singlethreaded.SingleThreadedBuilder.build (SingleThreadedBuilder.java:56)
[2020-05-16T06:22:31.373Z]     at org.apache.maven.lifecycle.internal.LifecycleStarter.execute (LifecycleStarter.java:128)
[2020-05-16T06:22:31.373Z]     at org.apache.maven.DefaultMaven.doExecute (DefaultMaven.java:305)
[2020-05-16T06:22:31.373Z]     at org.apache.maven.DefaultMaven.doExecute (DefaultMaven.java:192)
[2020-05-16T06:22:31.373Z]     at org.apache.maven.DefaultMaven.execute (DefaultMaven.java:105)
[2020-05-16T06:22:31.373Z]     at org.apache.maven.cli.MavenCli.execute (MavenCli.java:956)
[2020-05-16T06:22:31.373Z]     at org.apache.maven.cli.MavenCli.doMain (MavenCli.java:288)
[2020-05-16T06:22:31.373Z]     at org.apache.maven.cli.MavenCli.main (MavenCli.java:192)
[2020-05-16T06:22:31.373Z]     at sun.reflect.NativeMethodAccessorImpl.invoke0 (Native Method)
[2020-05-16T06:22:31.373Z]     at sun.reflect.NativeMethodAccessorImpl.invoke (NativeMethodAccessorImpl.java:62)
[2020-05-16T06:22:31.373Z]     at sun.reflect.DelegatingMethodAccessorImpl.invoke (DelegatingMethodAccessorImpl.java:43)
[2020-05-16T06:22:31.373Z]     at java.lang.reflect.Method.invoke (Method.java:498)
[2020-05-16T06:22:31.373Z]     at org.codehaus.plexus.classworlds.launcher.Launcher.launchEnhanced (Launcher.java:282)
[2020-05-16T06:22:31.373Z]     at org.codehaus.plexus.classworlds.launcher.Launcher.launch (Launcher.java:225)
[2020-05-16T06:22:31.373Z]     at org.codehaus.plexus.classworlds.launcher.Launcher.mainWithExitCode (Launcher.java:406)
[2020-05-16T06:22:31.373Z]     at org.codehaus.plexus.classworlds.launcher.Launcher.main (Launcher.java:347)
[2020-05-16T06:22:31.373Z] Caused by: org.apache.maven.plugin.MojoFailureException: There are test failures.
[2020-05-16T06:22:31.373Z]
[2020-05-16T06:22:31.373Z] Please refer to C:\Windows\System32\config\systemprofile\AppData\Local\Temp\jenkins-maven-box-maven-surefire-SUREFIRE-1570-9\surefire-its\target\failsafe-reports for the individual test results.
[2020-05-16T06:22:31.373Z] Please refer to dump files (if any exist) [date].dump, [date]-jvmRun[N].dump and [date].dumpstream.
[2020-05-16T06:22:31.373Z]     at org.apache.maven.plugin.surefire.SurefireHelper.throwException (SurefireHelper.java:271)
[2020-05-16T06:22:31.373Z]     at org.apache.maven.plugin.surefire.SurefireHelper.reportExecution (SurefireHelper.java:159)
[2020-05-16T06:22:31.373Z]     at org.apache.maven.plugin.failsafe.VerifyMojo.execute (VerifyMojo.java:192)
[2020-05-16T06:22:31.373Z]     at org.apache.maven.plugin.DefaultBuildPluginManager.executeMojo (DefaultBuildPluginManager.java:137)
[2020-05-16T06:22:31.373Z]     at org.apache.maven.lifecycle.internal.MojoExecutor.execute (MojoExecutor.java:210)
[2020-05-16T06:22:31.373Z]     at org.apache.maven.lifecycle.internal.MojoExecutor.execute (MojoExecutor.java:156)
[2020-05-16T06:22:31.373Z]     at org.apache.maven.lifecycle.internal.MojoExecutor.execute (MojoExecutor.java:148)
[2020-05-16T06:22:31.373Z]     at org.apache.maven.lifecycle.internal.LifecycleModuleBuilder.buildProject (LifecycleModuleBuilder.java:117)
[2020-05-16T06:22:31.373Z]     at org.apache.maven.lifecycle.internal.LifecycleModuleBuilder.buildProject (LifecycleModuleBuilder.java:81)
[2020-05-16T06:22:31.373Z]     at org.apache.maven.lifecycle.internal.builder.singlethreaded.SingleThreadedBuilder.build (SingleThreadedBuilder.java:56)
[2020-05-16T06:22:31.373Z]     at org.apache.maven.lifecycle.internal.LifecycleStarter.execute (LifecycleStarter.java:128)
[2020-05-16T06:22:31.373Z]     at org.apache.maven.DefaultMaven.doExecute (DefaultMaven.java:305)
[2020-05-16T06:22:31.373Z]     at org.apache.maven.DefaultMaven.doExecute (DefaultMaven.java:192)
[2020-05-16T06:22:31.373Z]     at org.apache.maven.DefaultMaven.execute (DefaultMaven.java:105)
[2020-05-16T06:22:31.373Z]     at org.apache.maven.cli.MavenCli.execute (MavenCli.java:956)
[2020-05-16T06:22:31.373Z]     at org.apache.maven.cli.MavenCli.doMain (MavenCli.java:288)
[2020-05-16T06:22:31.373Z]     at org.apache.maven.cli.MavenCli.main (MavenCli.java:192)
[2020-05-16T06:22:31.373Z]     at sun.reflect.NativeMethodAccessorImpl.invoke0 (Native Method)
[2020-05-16T06:22:31.373Z]     at sun.reflect.NativeMethodAccessorImpl.invoke (NativeMethodAccessorImpl.java:62)
[2020-05-16T06:22:31.373Z]     at sun.reflect.DelegatingMethodAccessorImpl.invoke (DelegatingMethodAccessorImpl.java:43)
[2020-05-16T06:22:31.373Z]     at java.lang.reflect.Method.invoke (Method.java:498)
[2020-05-16T06:22:31.373Z]     at org.codehaus.plexus.classworlds.launcher.Launcher.launchEnhanced (Launcher.java:282)
[2020-05-16T06:22:31.373Z]     at org.codehaus.plexus.classworlds.launcher.Launcher.launch (Launcher.java:225)
[2020-05-16T06:22:31.373Z]     at org.codehaus.plexus.classworlds.launcher.Launcher.mainWithExitCode (Launcher.java:406)
[2020-05-16T06:22:31.373Z]     at org.codehaus.plexus.classworlds.launcher.Launcher.main (Launcher.java:347)
[2020-05-16T06:22:31.373Z] [ERROR]
[2020-05-16T06:22:31.373Z] [ERROR] Re-run Maven using the -X switch to enable full debug logging.
[2020-05-16T06:22:31.373Z] [ERROR]
[2020-05-16T06:22:31.373Z] [ERROR] For more information about the errors and possible solutions, please read the following articles:
[2020-05-16T06:22:31.373Z] [ERROR] [Help 1] http://cwiki.apache.org/confluence/display/MAVEN/MojoFailureException
[2020-05-16T06:22:31.373Z] [ERROR]
[2020-05-16T06:22:31.373Z] [ERROR] After correcting the problems, you can resume the build with the command
[2020-05-16T06:22:31.373Z] [ERROR]   mvn <args> -rf :surefire-its
[Pipeline] }
[Pipeline] // withEnv
[Pipeline] }
[Pipeline] // stage
[Pipeline] fileExists
[Pipeline] zip
[2020-05-16T06:22:31.861Z] Writing zip file of C:\Windows\system32\config\systemprofile\AppData\Local\Temp\jenkins-maven-box-maven-surefire-SUREFIRE-1570-9\maven-failsafe-plugin\target\it to C:\Windows\system32\config\systemprofile\AppData\Local\Temp\jenkins-maven-box-maven-surefire-SUREFIRE-1570-9\maven-failsafe-plugin--windows-jdk11-maven3.6.x.zip
[2020-05-16T06:22:32.494Z] Zipped 78 entries.
[2020-05-16T06:22:32.494Z] Archiving C:\Windows\system32\config\systemprofile\AppData\Local\Temp\jenkins-maven-box-maven-surefire-SUREFIRE-1570-9\maven-failsafe-plugin--windows-jdk11-maven3.6.x.zip
[2020-05-16T06:22:32.523Z] [Fast Archiver] No prior successful build to compare, so performing full copy of artifacts
[Pipeline] fileExists
[Pipeline] zip
[2020-05-16T06:22:32.629Z] Writing zip file of C:\Windows\system32\config\systemprofile\AppData\Local\Temp\jenkins-maven-box-maven-surefire-SUREFIRE-1570-9\surefire-its\target to C:\Windows\system32\config\systemprofile\AppData\Local\Temp\jenkins-maven-box-maven-surefire-SUREFIRE-1570-9\surefire-its--windows-jdk11-maven3.6.x.zip
[2020-05-16T06:24:23.713Z] Zipped 18894 entries.
[2020-05-16T06:24:23.713Z] Archiving C:\Windows\system32\config\systemprofile\AppData\Local\Temp\jenkins-maven-box-maven-surefire-SUREFIRE-1570-9\surefire-its--windows-jdk11-maven3.6.x.zip
[2020-05-16T06:24:23.713Z] [Fast Archiver] No prior successful build to compare, so performing full copy of artifacts
[Pipeline] archiveArtifacts
[2020-05-16T06:24:25.131Z] Archiving artifacts
[2020-05-16T06:24:25.155Z] [Fast Archiver] No prior successful build to compare, so performing full copy of artifacts
[Pipeline] cleanWs
[2020-05-16T06:24:26.843Z] [WS-CLEANUP] Deleting project workspace...
[2020-05-16T06:24:26.843Z] [WS-CLEANUP] Deferred wipeout is used...
[2020-05-16T06:24:26.997Z] [WS-CLEANUP] done
[Pipeline] }
[Pipeline] // ws
[Pipeline] }
[Pipeline] // timestamps
[Pipeline] }
[Pipeline] // node
[Pipeline] }
[Pipeline] // parallel
[Pipeline] echo
Build result: FAILURE
[Pipeline] jiraIssueSelector
[Pipeline] echo
The authors of changes [tibordigana].
[Pipeline] echo
Sending email ...
[Pipeline] emailext
Reply | Threaded
Open this post in threaded view
|

Build succeeded in Jenkins: Maven TLP » maven-surefire » SUREFIRE-1570 #10

Apache Jenkins Server-2
See https://builds.apache.org/job/maven-box/job/maven-surefire/job/SUREFIRE-1570/10/

Changes:

* early initialized Platform and ResolvePathResultWrapper to gain the

All tests passed