Build failed in Jenkins: Maven TLP » maven-surefire » SUREFIRE-1004 #1

classic Classic list List threaded Threaded
2 messages Options
Reply | Threaded
Open this post in threaded view
|

Build failed in Jenkins: Maven TLP » maven-surefire » SUREFIRE-1004 #1

Apache Jenkins Server-2
See https://builds.apache.org/job/maven-box/job/maven-surefire/job/SUREFIRE-1004/1/

No changes.

1 tests failed.
FAILED:  org.apache.maven.surefire.its.JUnitPlatformEnginesIT.platform[1.4.0-SNAPSHOT]

Error Message:

Expected: <[\[DEBUG\] test\(compact\) classpath:  test-classes  classes  junit-jupiter-engine-5\.4\.0-SNAPSHOT\.jar  apiguardian-api-1\.0\.0\.jar  junit-platform-engine-1\.4\.0-SNAPSHOT\.jar  junit-platform-commons-1\.4\.0-SNAPSHOT\.jar  opentest4j-1\.1\.1\.jar  junit-jupiter-api-5\.4\.0-SNAPSHOT\.jar]>
     but: was <[[DEBUG] test(compact) classpath:  test-classes  classes  junit-jupiter-engine-5.4.0-SNAPSHOT.jar  apiguardian-api-1.0.0.jar  junit-platform-engine-1.4.0-SNAPSHOT.jar  opentest4j-1.1.1.jar  junit-platform-commons-1.4.0-SNAPSHOT.jar  junit-jupiter-api-5.4.0-SNAPSHOT.jar]>

Stack Trace:
java.lang.AssertionError:

Expected: <[\[DEBUG\] test\(compact\) classpath:  test-classes  classes  junit-jupiter-engine-5\.4\.0-SNAPSHOT\.jar  apiguardian-api-1\.0\.0\.jar  junit-platform-engine-1\.4\.0-SNAPSHOT\.jar  junit-platform-commons-1\.4\.0-SNAPSHOT\.jar  opentest4j-1\.1\.1\.jar  junit-jupiter-api-5\.4\.0-SNAPSHOT\.jar]>
     but: was <[[DEBUG] test(compact) classpath:  test-classes  classes  junit-jupiter-engine-5.4.0-SNAPSHOT.jar  apiguardian-api-1.0.0.jar  junit-platform-engine-1.4.0-SNAPSHOT.jar  opentest4j-1.1.1.jar  junit-platform-commons-1.4.0-SNAPSHOT.jar  junit-jupiter-api-5.4.0-SNAPSHOT.jar]>
        at org.apache.maven.surefire.its.JUnitPlatformEnginesIT.platform(JUnitPlatformEnginesIT.java:110)




Build log:
[...truncated 47486 lines...]
    at org.apache.maven.DefaultMaven.execute (DefaultMaven.java:105)
    at org.apache.maven.cli.MavenCli.execute (MavenCli.java:956)
    at org.apache.maven.cli.MavenCli.doMain (MavenCli.java:288)
    at org.apache.maven.cli.MavenCli.main (MavenCli.java:192)
    at sun.reflect.NativeMethodAccessorImpl.invoke0 (Native Method)
    at sun.reflect.NativeMethodAccessorImpl.invoke (NativeMethodAccessorImpl.java:62)
    at sun.reflect.DelegatingMethodAccessorImpl.invoke (DelegatingMethodAccessorImpl.java:43)
    at java.lang.reflect.Method.invoke (Method.java:498)
    at org.codehaus.plexus.classworlds.launcher.Launcher.launchEnhanced (Launcher.java:289)
    at org.codehaus.plexus.classworlds.launcher.Launcher.launch (Launcher.java:229)
    at org.codehaus.plexus.classworlds.launcher.Launcher.mainWithExitCode (Launcher.java:415)
    at org.codehaus.plexus.classworlds.launcher.Launcher.main (Launcher.java:356)
Caused by: org.apache.maven.plugin.MojoFailureException: There are test failures.

Please refer to F:\jenkins\jenkins-slave\temp\2\jenkins-maven-box-maven-surefire-SUREFIRE-1004-1\surefire-its\target\failsafe-reports for the individual test results.
Please refer to dump files (if any exist) [date].dump, [date]-jvmRun[N].dump and [date].dumpstream.
    at org.apache.maven.plugin.surefire.SurefireHelper.throwException (SurefireHelper.java:271)
    at org.apache.maven.plugin.surefire.SurefireHelper.reportExecution (SurefireHelper.java:159)
    at org.apache.maven.plugin.failsafe.VerifyMojo.execute (VerifyMojo.java:192)
    at org.apache.maven.plugin.DefaultBuildPluginManager.executeMojo (DefaultBuildPluginManager.java:137)
    at org.apache.maven.lifecycle.internal.MojoExecutor.execute (MojoExecutor.java:210)
    at org.apache.maven.lifecycle.internal.MojoExecutor.execute (MojoExecutor.java:156)
    at org.apache.maven.lifecycle.internal.MojoExecutor.execute (MojoExecutor.java:148)
    at org.apache.maven.lifecycle.internal.LifecycleModuleBuilder.buildProject (LifecycleModuleBuilder.java:117)
    at org.apache.maven.lifecycle.internal.LifecycleModuleBuilder.buildProject (LifecycleModuleBuilder.java:81)
    at org.apache.maven.lifecycle.internal.builder.singlethreaded.SingleThreadedBuilder.build (SingleThreadedBuilder.java:56)
    at org.apache.maven.lifecycle.internal.LifecycleStarter.execute (LifecycleStarter.java:128)
    at org.apache.maven.DefaultMaven.doExecute (DefaultMaven.java:305)
    at org.apache.maven.DefaultMaven.doExecute (DefaultMaven.java:192)
    at org.apache.maven.DefaultMaven.execute (DefaultMaven.java:105)
    at org.apache.maven.cli.MavenCli.execute (MavenCli.java:956)
    at org.apache.maven.cli.MavenCli.doMain (MavenCli.java:288)
    at org.apache.maven.cli.MavenCli.main (MavenCli.java:192)
    at sun.reflect.NativeMethodAccessorImpl.invoke0 (Native Method)
    at sun.reflect.NativeMethodAccessorImpl.invoke (NativeMethodAccessorImpl.java:62)
    at sun.reflect.DelegatingMethodAccessorImpl.invoke (DelegatingMethodAccessorImpl.java:43)
    at java.lang.reflect.Method.invoke (Method.java:498)
    at org.codehaus.plexus.classworlds.launcher.Launcher.launchEnhanced (Launcher.java:289)
    at org.codehaus.plexus.classworlds.launcher.Launcher.launch (Launcher.java:229)
    at org.codehaus.plexus.classworlds.launcher.Launcher.mainWithExitCode (Launcher.java:415)
    at org.codehaus.plexus.classworlds.launcher.Launcher.main (Launcher.java:356)
[ERROR]
[ERROR] Re-run Maven using the -X switch to enable full debug logging.
[ERROR]
[ERROR] For more information about the errors and possible solutions, please read the following articles:
[ERROR] [Help 1] http://cwiki.apache.org/confluence/display/MAVEN/MojoFailureException
[ERROR]
[ERROR] After correcting the problems, you can resume the build with the command
[ERROR]   mvn <goals> -rf :surefire-its
[Pipeline] }
[Pipeline] // withEnv
[Pipeline] }
[Pipeline] // stage
[Pipeline] fileExists
[Pipeline] zip
Writing zip file of F:\jenkins\jenkins-slave\temp\2\jenkins-maven-box-maven-surefire-SUREFIRE-1004-1\maven-failsafe-plugin\target\it to F:\jenkins\jenkins-slave\temp\2\jenkins-maven-box-maven-surefire-SUREFIRE-1004-1\maven-failsafe-plugin--windows-jdk12-maven3.6.x.zip
Zipped 78 entries.
Archiving F:\jenkins\jenkins-slave\temp\2\jenkins-maven-box-maven-surefire-SUREFIRE-1004-1\maven-failsafe-plugin--windows-jdk12-maven3.6.x.zip
[Fast Archiver] No prior successful build to compare, so performing full copy of artifacts
[Pipeline] fileExists
[Pipeline] zip
Writing zip file of F:\jenkins\jenkins-slave\temp\2\jenkins-maven-box-maven-surefire-SUREFIRE-1004-1\surefire-its\target to F:\jenkins\jenkins-slave\temp\2\jenkins-maven-box-maven-surefire-SUREFIRE-1004-1\surefire-its--windows-jdk12-maven3.6.x.zip
[INFO] Tests run: 1, Failures: 0, Errors: 0, Skipped: 0, Time elapsed: 5.808 s - in org.apache.maven.surefire.its.jiras.Surefire907PerThreadWithoutThreadCountIT
[INFO] Running org.apache.maven.surefire.its.jiras.Surefire920TestFailureIgnoreWithTimeoutIT
Zipped 16305 entries.
Archiving F:\jenkins\jenkins-slave\temp\2\jenkins-maven-box-maven-surefire-SUREFIRE-1004-1\surefire-its--windows-jdk12-maven3.6.x.zip
[Fast Archiver] No prior successful build to compare, so performing full copy of artifacts
[Pipeline] archiveArtifacts
Archiving artifacts
[Fast Archiver] No prior successful build to compare, so performing full copy of artifacts
[Pipeline] cleanWs
[WS-CLEANUP] Deleting project workspace...
[WS-CLEANUP] Deferred wipeout is used...
[WS-CLEANUP] done
[Pipeline] }
[Pipeline] // ws
[Pipeline] }
[Pipeline] // timestamps
[Pipeline] }
[Pipeline] // node
[Pipeline] }
[INFO] Tests run: 2, Failures: 0, Errors: 0, Skipped: 0, Time elapsed: 18.202 s - in org.apache.maven.surefire.its.jiras.Surefire920TestFailureIgnoreWithTimeoutIT
[INFO] Running org.apache.maven.surefire.its.jiras.Surefire926FailureWith2ProvidersIT
[INFO] Tests run: 1, Failures: 0, Errors: 0, Skipped: 0, Time elapsed: 6.067 s - in org.apache.maven.surefire.its.jiras.Surefire926FailureWith2ProvidersIT
[INFO] Running org.apache.maven.surefire.its.jiras.Surefire930TestNgSuiteXmlIT
[INFO] Tests run: 1, Failures: 0, Errors: 0, Skipped: 0, Time elapsed: 10.139 s - in org.apache.maven.surefire.its.jiras.Surefire930TestNgSuiteXmlIT
[INFO] Running org.apache.maven.surefire.its.jiras.Surefire943ReportContentIT
[INFO] Tests run: 2, Failures: 0, Errors: 0, Skipped: 0, Time elapsed: 36.558 s - in org.apache.maven.surefire.its.jiras.Surefire943ReportContentIT
[INFO] Running org.apache.maven.surefire.its.jiras.Surefire946KillMainProcessInReusableForkIT
[INFO] Tests run: 3, Failures: 0, Errors: 0, Skipped: 0, Time elapsed: 26.603 s - in org.apache.maven.surefire.its.jiras.Surefire946KillMainProcessInReusableForkIT
[INFO] Running org.apache.maven.surefire.its.jiras.Surefire972BizarreNoClassDefIT
[INFO] Tests run: 1, Failures: 0, Errors: 0, Skipped: 0, Time elapsed: 12.669 s - in org.apache.maven.surefire.its.jiras.Surefire972BizarreNoClassDefIT
[INFO] Running org.apache.maven.surefire.its.jiras.Surefire975DefaultVMEncodingIT
[INFO] Tests run: 1, Failures: 0, Errors: 0, Skipped: 0, Time elapsed: 8.15 s - in org.apache.maven.surefire.its.jiras.Surefire975DefaultVMEncodingIT
[INFO] Running org.apache.maven.surefire.its.jiras.Surefire979WrongClassLoaderIT
[INFO] Tests run: 1, Failures: 0, Errors: 0, Skipped: 0, Time elapsed: 8.858 s - in org.apache.maven.surefire.its.jiras.Surefire979WrongClassLoaderIT
[INFO] Running org.apache.maven.surefire.its.jiras.Surefire985ParameterizedRunnerAndCategoriesIT
[INFO] Tests run: 1, Failures: 0, Errors: 0, Skipped: 0, Time elapsed: 6.33 s - in org.apache.maven.surefire.its.jiras.Surefire985ParameterizedRunnerAndCategoriesIT
[INFO] Running org.apache.maven.surefire.its.jiras.Surefire995CategoryInheritanceIT
[INFO] Tests run: 5, Failures: 0, Errors: 0, Skipped: 0, Time elapsed: 33.256 s - in org.apache.maven.surefire.its.jiras.Surefire995CategoryInheritanceIT
[INFO]
[INFO] Results:
[INFO]
[ERROR] Failures:
[ERROR]   JUnitPlatformEnginesIT.platform:110
Expected: <[\[DEBUG\] test\(compact\) classpath:  test-classes  classes  junit-jupiter-engine-5\.4\.0-SNAPSHOT\.jar  apiguardian-api-1\.0\.0\.jar  junit-platform-engine-1\.4\.0-SNAPSHOT\.jar  junit-platform-commons-1\.4\.0-SNAPSHOT\.jar  opentest4j-1\.1\.1\.jar  junit-jupiter-api-5\.4\.0-SNAPSHOT\.jar]>
     but: was <[[DEBUG] test(compact) classpath:  test-classes  classes  junit-jupiter-engine-5.4.0-SNAPSHOT.jar  apiguardian-api-1.0.0.jar  junit-platform-engine-1.4.0-SNAPSHOT.jar  opentest4j-1.1.1.jar  junit-platform-commons-1.4.0-SNAPSHOT.jar  junit-jupiter-api-5.4.0-SNAPSHOT.jar]>
[INFO]
[ERROR] Tests run: 787, Failures: 1, Errors: 0, Skipped: 141
[INFO]
[INFO]
[INFO] --- maven-checkstyle-plugin:3.0.0:check (checkstyle-check) @ surefire-its ---
[INFO]
[INFO] --- maven-failsafe-plugin:3.0.0-M3:verify (default) @ surefire-its ---
[INFO] Failsafe report directory: F:\jenkins\jenkins-slave\temp\2\jenkins-maven-box-maven-surefire-SUREFIRE-1004-1@2\surefire-its\target\failsafe-reports
[INFO] ------------------------------------------------------------------------
[INFO] Reactor Summary for Apache Maven Surefire 3.0.0-M4-SNAPSHOT:
[INFO]
[INFO] Apache Maven Surefire .............................. SUCCESS [01:09 min]
[INFO] SureFire Logger API ................................ SUCCESS [ 13.115 s]
[INFO] SureFire API ....................................... SUCCESS [ 23.356 s]
[INFO] SureFire Booter .................................... SUCCESS [ 25.250 s]
[INFO] Maven Surefire Test-Grouping Support ............... SUCCESS [ 14.584 s]
[INFO] SureFire Providers ................................. SUCCESS [  1.800 s]
[INFO] Shared JUnit3 Provider Code ........................ SUCCESS [  7.570 s]
[INFO] Shared Java 5 Provider Base ........................ SUCCESS [  9.159 s]
[INFO] Shared JUnit4 Provider Code ........................ SUCCESS [  9.298 s]
[INFO] Shared JUnit48 Provider Code ....................... SUCCESS [ 10.023 s]
[INFO] SureFire JUnit Runner .............................. SUCCESS [  7.630 s]
[INFO] SureFire JUnit4 Runner ............................. SUCCESS [  8.253 s]
[INFO] Maven Surefire Common .............................. SUCCESS [ 42.232 s]
[INFO] SureFire JUnitCore Runner .......................... SUCCESS [02:26 min]
[INFO] SureFire JUnit Platform Runner ..................... SUCCESS [ 11.843 s]
[INFO] SureFire TestNG Utils .............................. SUCCESS [  8.437 s]
[INFO] SureFire TestNG Runner ............................. SUCCESS [  8.933 s]
[INFO] ShadeFire JUnit3 Provider .......................... SUCCESS [  4.730 s]
[INFO] Surefire Report Parser ............................. SUCCESS [ 10.962 s]
[INFO] Maven Surefire Plugin .............................. SUCCESS [ 20.269 s]
[INFO] Maven Failsafe Plugin .............................. SUCCESS [02:17 min]
[INFO] Maven Surefire Report Plugin ....................... SUCCESS [ 23.714 s]
[INFO] Maven Surefire Integration Tests ................... FAILURE [  01:37 h]
[INFO] ------------------------------------------------------------------------
[INFO] BUILD FAILURE
[INFO] ------------------------------------------------------------------------
[INFO] Total time:  01:48 h
[INFO] Finished at: 2019-02-05T17:23:53-08:00
[INFO] ------------------------------------------------------------------------
[ERROR] Failed to execute goal org.apache.maven.plugins:maven-failsafe-plugin:3.0.0-M3:verify (default) on project surefire-its: There are test failures.
[ERROR]
[ERROR] Please refer to F:\jenkins\jenkins-slave\temp\2\jenkins-maven-box-maven-surefire-SUREFIRE-1004-1@2\surefire-its\target\failsafe-reports for the individual test results.
[ERROR] Please refer to dump files (if any exist) [date].dump, [date]-jvmRun[N].dump and [date].dumpstream.
[ERROR] -> [Help 1]
org.apache.maven.lifecycle.LifecycleExecutionException: Failed to execute goal org.apache.maven.plugins:maven-failsafe-plugin:3.0.0-M3:verify (default) on project surefire-its: There are test failures.

Please refer to F:\jenkins\jenkins-slave\temp\2\jenkins-maven-box-maven-surefire-SUREFIRE-1004-1@2\surefire-its\target\failsafe-reports for the individual test results.
Please refer to dump files (if any exist) [date].dump, [date]-jvmRun[N].dump and [date].dumpstream.
    at org.apache.maven.lifecycle.internal.MojoExecutor.execute (MojoExecutor.java:215)
    at org.apache.maven.lifecycle.internal.MojoExecutor.execute (MojoExecutor.java:156)
    at org.apache.maven.lifecycle.internal.MojoExecutor.execute (MojoExecutor.java:148)
    at org.apache.maven.lifecycle.internal.LifecycleModuleBuilder.buildProject (LifecycleModuleBuilder.java:117)
    at org.apache.maven.lifecycle.internal.LifecycleModuleBuilder.buildProject (LifecycleModuleBuilder.java:81)
    at org.apache.maven.lifecycle.internal.builder.singlethreaded.SingleThreadedBuilder.build (SingleThreadedBuilder.java:56)
    at org.apache.maven.lifecycle.internal.LifecycleStarter.execute (LifecycleStarter.java:128)
    at org.apache.maven.DefaultMaven.doExecute (DefaultMaven.java:305)
    at org.apache.maven.DefaultMaven.doExecute (DefaultMaven.java:192)
    at org.apache.maven.DefaultMaven.execute (DefaultMaven.java:105)
    at org.apache.maven.cli.MavenCli.execute (MavenCli.java:956)
    at org.apache.maven.cli.MavenCli.doMain (MavenCli.java:288)
    at org.apache.maven.cli.MavenCli.main (MavenCli.java:192)
    at sun.reflect.NativeMethodAccessorImpl.invoke0 (Native Method)
    at sun.reflect.NativeMethodAccessorImpl.invoke (NativeMethodAccessorImpl.java:62)
    at sun.reflect.DelegatingMethodAccessorImpl.invoke (DelegatingMethodAccessorImpl.java:43)
    at java.lang.reflect.Method.invoke (Method.java:498)
    at org.codehaus.plexus.classworlds.launcher.Launcher.launchEnhanced (Launcher.java:289)
    at org.codehaus.plexus.classworlds.launcher.Launcher.launch (Launcher.java:229)
    at org.codehaus.plexus.classworlds.launcher.Launcher.mainWithExitCode (Launcher.java:415)
    at org.codehaus.plexus.classworlds.launcher.Launcher.main (Launcher.java:356)
Caused by: org.apache.maven.plugin.MojoFailureException: There are test failures.

Please refer to F:\jenkins\jenkins-slave\temp\2\jenkins-maven-box-maven-surefire-SUREFIRE-1004-1@2\surefire-its\target\failsafe-reports for the individual test results.
Please refer to dump files (if any exist) [date].dump, [date]-jvmRun[N].dump and [date].dumpstream.
    at org.apache.maven.plugin.surefire.SurefireHelper.throwException (SurefireHelper.java:271)
    at org.apache.maven.plugin.surefire.SurefireHelper.reportExecution (SurefireHelper.java:159)
    at org.apache.maven.plugin.failsafe.VerifyMojo.execute (VerifyMojo.java:192)
    at org.apache.maven.plugin.DefaultBuildPluginManager.executeMojo (DefaultBuildPluginManager.java:137)
    at org.apache.maven.lifecycle.internal.MojoExecutor.execute (MojoExecutor.java:210)
    at org.apache.maven.lifecycle.internal.MojoExecutor.execute (MojoExecutor.java:156)
    at org.apache.maven.lifecycle.internal.MojoExecutor.execute (MojoExecutor.java:148)
    at org.apache.maven.lifecycle.internal.LifecycleModuleBuilder.buildProject (LifecycleModuleBuilder.java:117)
    at org.apache.maven.lifecycle.internal.LifecycleModuleBuilder.buildProject (LifecycleModuleBuilder.java:81)
    at org.apache.maven.lifecycle.internal.builder.singlethreaded.SingleThreadedBuilder.build (SingleThreadedBuilder.java:56)
    at org.apache.maven.lifecycle.internal.LifecycleStarter.execute (LifecycleStarter.java:128)
    at org.apache.maven.DefaultMaven.doExecute (DefaultMaven.java:305)
    at org.apache.maven.DefaultMaven.doExecute (DefaultMaven.java:192)
    at org.apache.maven.DefaultMaven.execute (DefaultMaven.java:105)
    at org.apache.maven.cli.MavenCli.execute (MavenCli.java:956)
    at org.apache.maven.cli.MavenCli.doMain (MavenCli.java:288)
    at org.apache.maven.cli.MavenCli.main (MavenCli.java:192)
    at sun.reflect.NativeMethodAccessorImpl.invoke0 (Native Method)
    at sun.reflect.NativeMethodAccessorImpl.invoke (NativeMethodAccessorImpl.java:62)
    at sun.reflect.DelegatingMethodAccessorImpl.invoke (DelegatingMethodAccessorImpl.java:43)
    at java.lang.reflect.Method.invoke (Method.java:498)
    at org.codehaus.plexus.classworlds.launcher.Launcher.launchEnhanced (Launcher.java:289)
    at org.codehaus.plexus.classworlds.launcher.Launcher.launch (Launcher.java:229)
    at org.codehaus.plexus.classworlds.launcher.Launcher.mainWithExitCode (Launcher.java:415)
    at org.codehaus.plexus.classworlds.launcher.Launcher.main (Launcher.java:356)
[ERROR]
[ERROR] Re-run Maven using the -X switch to enable full debug logging.
[ERROR]
[ERROR] For more information about the errors and possible solutions, please read the following articles:
[ERROR] [Help 1] http://cwiki.apache.org/confluence/display/MAVEN/MojoFailureException
[ERROR]
[ERROR] After correcting the problems, you can resume the build with the command
[ERROR]   mvn <goals> -rf :surefire-its
[Pipeline] }
[Pipeline] // withEnv
[Pipeline] }
[Pipeline] // stage
[Pipeline] fileExists
[Pipeline] zip
Writing zip file of F:\jenkins\jenkins-slave\temp\2\jenkins-maven-box-maven-surefire-SUREFIRE-1004-1@2\maven-failsafe-plugin\target\it to F:\jenkins\jenkins-slave\temp\2\jenkins-maven-box-maven-surefire-SUREFIRE-1004-1@2\maven-failsafe-plugin--windows-jdk11-maven3.6.x.zip
Zipped 78 entries.
Archiving F:\jenkins\jenkins-slave\temp\2\jenkins-maven-box-maven-surefire-SUREFIRE-1004-1@2\maven-failsafe-plugin--windows-jdk11-maven3.6.x.zip
[Fast Archiver] No prior successful build to compare, so performing full copy of artifacts
[Pipeline] fileExists
[Pipeline] zip
Writing zip file of F:\jenkins\jenkins-slave\temp\2\jenkins-maven-box-maven-surefire-SUREFIRE-1004-1@2\surefire-its\target to F:\jenkins\jenkins-slave\temp\2\jenkins-maven-box-maven-surefire-SUREFIRE-1004-1@2\surefire-its--windows-jdk11-maven3.6.x.zip
Zipped 16317 entries.
Archiving F:\jenkins\jenkins-slave\temp\2\jenkins-maven-box-maven-surefire-SUREFIRE-1004-1@2\surefire-its--windows-jdk11-maven3.6.x.zip
[Fast Archiver] No prior successful build to compare, so performing full copy of artifacts
[Pipeline] archiveArtifacts
Archiving artifacts
[Fast Archiver] No prior successful build to compare, so performing full copy of artifacts
[Pipeline] cleanWs
[WS-CLEANUP] Deleting project workspace...
[WS-CLEANUP] Deferred wipeout is used...
[WS-CLEANUP] done
[Pipeline] }
[Pipeline] // ws
[Pipeline] }
[Pipeline] // timestamps
[Pipeline] }
[Pipeline] // node
[Pipeline] }
[Pipeline] // parallel
[Pipeline] echo
Build result: FAILURE
[Pipeline] jiraIssueSelector
[Pipeline] emailext
Reply | Threaded
Open this post in threaded view
|

Build failed in Jenkins: Maven TLP » maven-surefire » SUREFIRE-1004 #2

Apache Jenkins Server-2
See https://builds.apache.org/job/maven-box/job/maven-surefire/job/SUREFIRE-1004/2/

Changes:

* JDK 12 is now in the Release Candidate Phase
* [INFRA-17514] Jenkins invoker-plugin updated by INFRA

1 tests failed.
FAILED:  org.apache.maven.surefire.its.JUnitPlatformEnginesIT.platform[1.4.0-SNAPSHOT]

Error Message:

Expected: <[\[DEBUG\] test\(compact\) classpath:  test-classes  classes  junit-jupiter-engine-5\.4\.0-SNAPSHOT\.jar  apiguardian-api-1\.0\.0\.jar  junit-platform-engine-1\.4\.0-SNAPSHOT\.jar  junit-platform-commons-1\.4\.0-SNAPSHOT\.jar  opentest4j-1\.1\.1\.jar  junit-jupiter-api-5\.4\.0-SNAPSHOT\.jar]>
     but: was <[[DEBUG] test(compact) classpath:  test-classes  classes  junit-jupiter-engine-5.4.0-SNAPSHOT.jar  apiguardian-api-1.0.0.jar  junit-platform-engine-1.4.0-SNAPSHOT.jar  opentest4j-1.1.1.jar  junit-platform-commons-1.4.0-SNAPSHOT.jar  junit-jupiter-api-5.4.0-SNAPSHOT.jar]>

Stack Trace:
java.lang.AssertionError:

Expected: <[\[DEBUG\] test\(compact\) classpath:  test-classes  classes  junit-jupiter-engine-5\.4\.0-SNAPSHOT\.jar  apiguardian-api-1\.0\.0\.jar  junit-platform-engine-1\.4\.0-SNAPSHOT\.jar  junit-platform-commons-1\.4\.0-SNAPSHOT\.jar  opentest4j-1\.1\.1\.jar  junit-jupiter-api-5\.4\.0-SNAPSHOT\.jar]>
     but: was <[[DEBUG] test(compact) classpath:  test-classes  classes  junit-jupiter-engine-5.4.0-SNAPSHOT.jar  apiguardian-api-1.0.0.jar  junit-platform-engine-1.4.0-SNAPSHOT.jar  opentest4j-1.1.1.jar  junit-platform-commons-1.4.0-SNAPSHOT.jar  junit-jupiter-api-5.4.0-SNAPSHOT.jar]>
        at org.apache.maven.surefire.its.JUnitPlatformEnginesIT.platform(JUnitPlatformEnginesIT.java:110)




Build log:
[...truncated 46589 lines...]
[INFO] SureFire JUnit4 Runner ............................. SUCCESS [ 16.456 s]
[INFO] Maven Surefire Common .............................. SUCCESS [ 41.207 s]
[INFO] SureFire JUnitCore Runner .......................... SUCCESS [02:21 min]
[INFO] SureFire JUnit Platform Runner ..................... SUCCESS [ 13.589 s]
[INFO] SureFire TestNG Utils .............................. SUCCESS [  7.363 s]
[INFO] SureFire TestNG Runner ............................. SUCCESS [  8.853 s]
[INFO] ShadeFire JUnit3 Provider .......................... SUCCESS [  4.416 s]
[INFO] Surefire Report Parser ............................. SUCCESS [ 12.678 s]
[INFO] Maven Surefire Plugin .............................. SUCCESS [ 21.008 s]
[INFO] Maven Failsafe Plugin .............................. SUCCESS [02:20 min]
[INFO] Maven Surefire Report Plugin ....................... SUCCESS [ 25.826 s]
[INFO] Maven Surefire Integration Tests ................... FAILURE [  01:40 h]
[INFO] ------------------------------------------------------------------------
[INFO] BUILD FAILURE
[INFO] ------------------------------------------------------------------------
[INFO] Total time:  01:50 h
[INFO] Finished at: 2019-02-13T05:42:06-08:00
[INFO] ------------------------------------------------------------------------
[ERROR] Failed to execute goal org.apache.maven.plugins:maven-failsafe-plugin:3.0.0-M3:verify (default) on project surefire-its: There are test failures.
[ERROR]
[ERROR] Please refer to C:\Users\jenkins\AppData\Local\Temp\2\jenkins-maven-box-maven-surefire-SUREFIRE-1004-2@2\surefire-its\target\failsafe-reports for the individual test results.
[ERROR] Please refer to dump files (if any exist) [date].dump, [date]-jvmRun[N].dump and [date].dumpstream.
[ERROR] -> [Help 1]
org.apache.maven.lifecycle.LifecycleExecutionException: Failed to execute goal org.apache.maven.plugins:maven-failsafe-plugin:3.0.0-M3:verify (default) on project surefire-its: There are test failures.

Please refer to C:\Users\jenkins\AppData\Local\Temp\2\jenkins-maven-box-maven-surefire-SUREFIRE-1004-2@2\surefire-its\target\failsafe-reports for the individual test results.
Please refer to dump files (if any exist) [date].dump, [date]-jvmRun[N].dump and [date].dumpstream.
    at org.apache.maven.lifecycle.internal.MojoExecutor.execute (MojoExecutor.java:215)
    at org.apache.maven.lifecycle.internal.MojoExecutor.execute (MojoExecutor.java:156)
    at org.apache.maven.lifecycle.internal.MojoExecutor.execute (MojoExecutor.java:148)
    at org.apache.maven.lifecycle.internal.LifecycleModuleBuilder.buildProject (LifecycleModuleBuilder.java:117)
    at org.apache.maven.lifecycle.internal.LifecycleModuleBuilder.buildProject (LifecycleModuleBuilder.java:81)
    at org.apache.maven.lifecycle.internal.builder.singlethreaded.SingleThreadedBuilder.build (SingleThreadedBuilder.java:56)
    at org.apache.maven.lifecycle.internal.LifecycleStarter.execute (LifecycleStarter.java:128)
    at org.apache.maven.DefaultMaven.doExecute (DefaultMaven.java:305)
    at org.apache.maven.DefaultMaven.doExecute (DefaultMaven.java:192)
    at org.apache.maven.DefaultMaven.execute (DefaultMaven.java:105)
    at org.apache.maven.cli.MavenCli.execute (MavenCli.java:956)
    at org.apache.maven.cli.MavenCli.doMain (MavenCli.java:288)
    at org.apache.maven.cli.MavenCli.main (MavenCli.java:192)
    at sun.reflect.NativeMethodAccessorImpl.invoke0 (Native Method)
    at sun.reflect.NativeMethodAccessorImpl.invoke (NativeMethodAccessorImpl.java:62)
    at sun.reflect.DelegatingMethodAccessorImpl.invoke (DelegatingMethodAccessorImpl.java:43)
    at java.lang.reflect.Method.invoke (Method.java:498)
    at org.codehaus.plexus.classworlds.launcher.Launcher.launchEnhanced (Launcher.java:289)
    at org.codehaus.plexus.classworlds.launcher.Launcher.launch (Launcher.java:229)
    at org.codehaus.plexus.classworlds.launcher.Launcher.mainWithExitCode (Launcher.java:415)
    at org.codehaus.plexus.classworlds.launcher.Launcher.main (Launcher.java:356)
Caused by: org.apache.maven.plugin.MojoFailureException: There are test failures.

Please refer to C:\Users\jenkins\AppData\Local\Temp\2\jenkins-maven-box-maven-surefire-SUREFIRE-1004-2@2\surefire-its\target\failsafe-reports for the individual test results.
Please refer to dump files (if any exist) [date].dump, [date]-jvmRun[N].dump and [date].dumpstream.
    at org.apache.maven.plugin.surefire.SurefireHelper.throwException (SurefireHelper.java:271)
    at org.apache.maven.plugin.surefire.SurefireHelper.reportExecution (SurefireHelper.java:159)
    at org.apache.maven.plugin.failsafe.VerifyMojo.execute (VerifyMojo.java:192)
    at org.apache.maven.plugin.DefaultBuildPluginManager.executeMojo (DefaultBuildPluginManager.java:137)
    at org.apache.maven.lifecycle.internal.MojoExecutor.execute (MojoExecutor.java:210)
    at org.apache.maven.lifecycle.internal.MojoExecutor.execute (MojoExecutor.java:156)
    at org.apache.maven.lifecycle.internal.MojoExecutor.execute (MojoExecutor.java:148)
    at org.apache.maven.lifecycle.internal.LifecycleModuleBuilder.buildProject (LifecycleModuleBuilder.java:117)
    at org.apache.maven.lifecycle.internal.LifecycleModuleBuilder.buildProject (LifecycleModuleBuilder.java:81)
    at org.apache.maven.lifecycle.internal.builder.singlethreaded.SingleThreadedBuilder.build (SingleThreadedBuilder.java:56)
    at org.apache.maven.lifecycle.internal.LifecycleStarter.execute (LifecycleStarter.java:128)
    at org.apache.maven.DefaultMaven.doExecute (DefaultMaven.java:305)
    at org.apache.maven.DefaultMaven.doExecute (DefaultMaven.java:192)
    at org.apache.maven.DefaultMaven.execute (DefaultMaven.java:105)
    at org.apache.maven.cli.MavenCli.execute (MavenCli.java:956)
    at org.apache.maven.cli.MavenCli.doMain (MavenCli.java:288)
    at org.apache.maven.cli.MavenCli.main (MavenCli.java:192)
    at sun.reflect.NativeMethodAccessorImpl.invoke0 (Native Method)
    at sun.reflect.NativeMethodAccessorImpl.invoke (NativeMethodAccessorImpl.java:62)
    at sun.reflect.DelegatingMethodAccessorImpl.invoke (DelegatingMethodAccessorImpl.java:43)
    at java.lang.reflect.Method.invoke (Method.java:498)
    at org.codehaus.plexus.classworlds.launcher.Launcher.launchEnhanced (Launcher.java:289)
    at org.codehaus.plexus.classworlds.launcher.Launcher.launch (Launcher.java:229)
    at org.codehaus.plexus.classworlds.launcher.Launcher.mainWithExitCode (Launcher.java:415)
    at org.codehaus.plexus.classworlds.launcher.Launcher.main (Launcher.java:356)
[ERROR]
[ERROR] Re-run Maven using the -X switch to enable full debug logging.
[ERROR]
[ERROR] For more information about the errors and possible solutions, please read the following articles:
[ERROR] [Help 1] http://cwiki.apache.org/confluence/display/MAVEN/MojoFailureException
[ERROR]
[ERROR] After correcting the problems, you can resume the build with the command
[ERROR]   mvn <goals> -rf :surefire-its
[Pipeline] }
[Pipeline] // withEnv
[Pipeline] }
[Pipeline] // stage
[Pipeline] fileExists
[Pipeline] zip
Writing zip file of C:\Users\jenkins\AppData\Local\Temp\2\jenkins-maven-box-maven-surefire-SUREFIRE-1004-2@2\maven-failsafe-plugin\target\it to C:\Users\jenkins\AppData\Local\Temp\2\jenkins-maven-box-maven-surefire-SUREFIRE-1004-2@2\maven-failsafe-plugin--windows-jdk8-maven3.6.x.zip
Zipped 78 entries.
Archiving C:\Users\jenkins\AppData\Local\Temp\2\jenkins-maven-box-maven-surefire-SUREFIRE-1004-2@2\maven-failsafe-plugin--windows-jdk8-maven3.6.x.zip
[Fast Archiver] No prior successful build to compare, so performing full copy of artifacts
[Pipeline] fileExists
[Pipeline] zip
Writing zip file of C:\Users\jenkins\AppData\Local\Temp\2\jenkins-maven-box-maven-surefire-SUREFIRE-1004-2@2\surefire-its\target to C:\Users\jenkins\AppData\Local\Temp\2\jenkins-maven-box-maven-surefire-SUREFIRE-1004-2@2\surefire-its--windows-jdk8-maven3.6.x.zip
[INFO] Tests run: 4, Failures: 0, Errors: 0, Skipped: 0, Time elapsed: 8.011 s - in org.apache.maven.surefire.its.jiras.Surefire772NoSurefireReportsIT
[INFO] Running org.apache.maven.surefire.its.jiras.Surefire772SpecifiedReportsIT
[INFO] Tests run: 3, Failures: 0, Errors: 0, Skipped: 0, Time elapsed: 5.98 s - in org.apache.maven.surefire.its.jiras.Surefire772SpecifiedReportsIT
[INFO] Running org.apache.maven.surefire.its.jiras.Surefire801ForkModeNoneClassLoaderIT
[INFO] Tests run: 1, Failures: 0, Errors: 0, Skipped: 0, Time elapsed: 2.445 s - in org.apache.maven.surefire.its.jiras.Surefire801ForkModeNoneClassLoaderIT
[INFO] Running org.apache.maven.surefire.its.jiras.Surefire803MultiFailsafeExecsIT
Zipped 15992 entries.
Archiving C:\Users\jenkins\AppData\Local\Temp\2\jenkins-maven-box-maven-surefire-SUREFIRE-1004-2@2\surefire-its--windows-jdk8-maven3.6.x.zip
[Fast Archiver] No prior successful build to compare, so performing full copy of artifacts
[Pipeline] archiveArtifacts
Archiving artifacts
[Fast Archiver] No prior successful build to compare, so performing full copy of artifacts
[Pipeline] cleanWs
[WS-CLEANUP] Deleting project workspace...
[WS-CLEANUP] Deferred wipeout is used...
[WS-CLEANUP] done
[Pipeline] }
[Pipeline] // ws
[Pipeline] }
[Pipeline] // timestamps
[Pipeline] }
[Pipeline] // node
[Pipeline] }
[INFO] Tests run: 2, Failures: 0, Errors: 0, Skipped: 0, Time elapsed: 13.36 s - in org.apache.maven.surefire.its.jiras.Surefire803MultiFailsafeExecsIT
[INFO] Running org.apache.maven.surefire.its.jiras.Surefire806SpecifiedTestControlsIT
[WARNING] Tests run: 3, Failures: 0, Errors: 0, Skipped: 2, Time elapsed: 3.422 s - in org.apache.maven.surefire.its.jiras.Surefire806SpecifiedTestControlsIT
[INFO] Running org.apache.maven.surefire.its.jiras.Surefire809GroupExpressionsIT
[INFO] Tests run: 6, Failures: 0, Errors: 0, Skipped: 0, Time elapsed: 20.882 s - in org.apache.maven.surefire.its.jiras.Surefire809GroupExpressionsIT
[INFO] Running org.apache.maven.surefire.its.jiras.Surefire812Log4JClassLoaderIT
[INFO] Tests run: 1, Failures: 0, Errors: 0, Skipped: 0, Time elapsed: 3.73 s - in org.apache.maven.surefire.its.jiras.Surefire812Log4JClassLoaderIT
[INFO] Running org.apache.maven.surefire.its.jiras.Surefire817SystemExitIT
[INFO] Tests run: 1, Failures: 0, Errors: 0, Skipped: 0, Time elapsed: 3.656 s - in org.apache.maven.surefire.its.jiras.Surefire817SystemExitIT
[INFO] Running org.apache.maven.surefire.its.jiras.Surefire818NpeIgnoresTestsIT
[INFO] Tests run: 1, Failures: 0, Errors: 0, Skipped: 0, Time elapsed: 4.066 s - in org.apache.maven.surefire.its.jiras.Surefire818NpeIgnoresTestsIT
[INFO] Running org.apache.maven.surefire.its.jiras.Surefire828EmptyGroupExprIT
[INFO] Tests run: 4, Failures: 0, Errors: 0, Skipped: 0, Time elapsed: 14.673 s - in org.apache.maven.surefire.its.jiras.Surefire828EmptyGroupExprIT
[INFO] Running org.apache.maven.surefire.its.jiras.Surefire832ProviderSelectionIT
[INFO] Tests run: 1, Failures: 0, Errors: 0, Skipped: 0, Time elapsed: 3.571 s - in org.apache.maven.surefire.its.jiras.Surefire832ProviderSelectionIT
[INFO] Running org.apache.maven.surefire.its.jiras.Surefire839TestWithoutCategoriesIT
[INFO] Tests run: 2, Failures: 0, Errors: 0, Skipped: 0, Time elapsed: 7.207 s - in org.apache.maven.surefire.its.jiras.Surefire839TestWithoutCategoriesIT
[INFO] Running org.apache.maven.surefire.its.jiras.Surefire847AdditionalFailureIT
[INFO] Tests run: 1, Failures: 0, Errors: 0, Skipped: 0, Time elapsed: 4.443 s - in org.apache.maven.surefire.its.jiras.Surefire847AdditionalFailureIT
[INFO] Running org.apache.maven.surefire.its.jiras.Surefire855AllowFailsafeUseArtifactFileIT
[INFO] Tests run: 4, Failures: 0, Errors: 0, Skipped: 0, Time elapsed: 36.209 s - in org.apache.maven.surefire.its.jiras.Surefire855AllowFailsafeUseArtifactFileIT
[INFO] Running org.apache.maven.surefire.its.jiras.Surefire901MIssingResultfileWhenNoTestsIT
[INFO] Tests run: 1, Failures: 0, Errors: 0, Skipped: 0, Time elapsed: 3.001 s - in org.apache.maven.surefire.its.jiras.Surefire901MIssingResultfileWhenNoTestsIT
[INFO] Running org.apache.maven.surefire.its.jiras.Surefire907PerThreadWithoutThreadCountIT
[INFO] Tests run: 1, Failures: 0, Errors: 0, Skipped: 0, Time elapsed: 2.354 s - in org.apache.maven.surefire.its.jiras.Surefire907PerThreadWithoutThreadCountIT
[INFO] Running org.apache.maven.surefire.its.jiras.Surefire920TestFailureIgnoreWithTimeoutIT
[INFO] Tests run: 2, Failures: 0, Errors: 0, Skipped: 0, Time elapsed: 9.333 s - in org.apache.maven.surefire.its.jiras.Surefire920TestFailureIgnoreWithTimeoutIT
[INFO] Running org.apache.maven.surefire.its.jiras.Surefire926FailureWith2ProvidersIT
[INFO] Tests run: 1, Failures: 0, Errors: 0, Skipped: 0, Time elapsed: 5.609 s - in org.apache.maven.surefire.its.jiras.Surefire926FailureWith2ProvidersIT
[INFO] Running org.apache.maven.surefire.its.jiras.Surefire930TestNgSuiteXmlIT
[INFO] Tests run: 1, Failures: 0, Errors: 0, Skipped: 0, Time elapsed: 5.264 s - in org.apache.maven.surefire.its.jiras.Surefire930TestNgSuiteXmlIT
[INFO] Running org.apache.maven.surefire.its.jiras.Surefire943ReportContentIT
[INFO] Tests run: 2, Failures: 0, Errors: 0, Skipped: 0, Time elapsed: 20.627 s - in org.apache.maven.surefire.its.jiras.Surefire943ReportContentIT
[INFO] Running org.apache.maven.surefire.its.jiras.Surefire946KillMainProcessInReusableForkIT
[INFO] Tests run: 3, Failures: 0, Errors: 0, Skipped: 0, Time elapsed: 20.658 s - in org.apache.maven.surefire.its.jiras.Surefire946KillMainProcessInReusableForkIT
[INFO] Running org.apache.maven.surefire.its.jiras.Surefire972BizarreNoClassDefIT
[INFO] Tests run: 1, Failures: 0, Errors: 0, Skipped: 0, Time elapsed: 5.84 s - in org.apache.maven.surefire.its.jiras.Surefire972BizarreNoClassDefIT
[INFO] Running org.apache.maven.surefire.its.jiras.Surefire975DefaultVMEncodingIT
[INFO] Tests run: 1, Failures: 0, Errors: 0, Skipped: 0, Time elapsed: 4.443 s - in org.apache.maven.surefire.its.jiras.Surefire975DefaultVMEncodingIT
[INFO] Running org.apache.maven.surefire.its.jiras.Surefire979WrongClassLoaderIT
[INFO] Tests run: 1, Failures: 0, Errors: 0, Skipped: 0, Time elapsed: 4.164 s - in org.apache.maven.surefire.its.jiras.Surefire979WrongClassLoaderIT
[INFO] Running org.apache.maven.surefire.its.jiras.Surefire985ParameterizedRunnerAndCategoriesIT
[INFO] Tests run: 1, Failures: 0, Errors: 0, Skipped: 0, Time elapsed: 2.873 s - in org.apache.maven.surefire.its.jiras.Surefire985ParameterizedRunnerAndCategoriesIT
[INFO] Running org.apache.maven.surefire.its.jiras.Surefire995CategoryInheritanceIT
[INFO] Tests run: 5, Failures: 0, Errors: 0, Skipped: 0, Time elapsed: 13.864 s - in org.apache.maven.surefire.its.jiras.Surefire995CategoryInheritanceIT
[INFO]
[INFO] Results:
[INFO]
[WARNING] Tests run: 787, Failures: 0, Errors: 0, Skipped: 167
[INFO]
[INFO]
[INFO] --- maven-checkstyle-plugin:3.0.0:check (checkstyle-check) @ surefire-its ---
[INFO]
[INFO] --- maven-failsafe-plugin:3.0.0-M3:verify (default) @ surefire-its ---
[INFO] Failsafe report directory: C:\Users\jenkins\AppData\Local\Temp\2\jenkins-maven-box-maven-surefire-SUREFIRE-1004-2\surefire-its\target\failsafe-reports
[INFO]
[INFO] --- maven-install-plugin:2.5.2:install (default-install) @ surefire-its ---
[INFO] Skipping artifact installation
[INFO]
[INFO] --- jacoco-maven-plugin:0.8.2:report (default-cli) @ surefire-its ---
[INFO] Skipping JaCoCo execution because property jacoco.skip is set.
[INFO] ------------------------------------------------------------------------
[INFO] Reactor Summary for Apache Maven Surefire 3.0.0-M4-SNAPSHOT:
[INFO]
[INFO] Apache Maven Surefire .............................. SUCCESS [ 29.275 s]
[INFO] SureFire Logger API ................................ SUCCESS [  5.195 s]
[INFO] SureFire API ....................................... SUCCESS [ 11.233 s]
[INFO] SureFire Booter .................................... SUCCESS [ 11.499 s]
[INFO] Maven Surefire Test-Grouping Support ............... SUCCESS [  6.167 s]
[INFO] SureFire Providers ................................. SUCCESS [  0.716 s]
[INFO] Shared JUnit3 Provider Code ........................ SUCCESS [  3.241 s]
[INFO] Shared Java 5 Provider Base ........................ SUCCESS [  5.303 s]
[INFO] Shared JUnit4 Provider Code ........................ SUCCESS [  4.238 s]
[INFO] Shared JUnit48 Provider Code ....................... SUCCESS [  4.781 s]
[INFO] SureFire JUnit Runner .............................. SUCCESS [  3.631 s]
[INFO] SureFire JUnit4 Runner ............................. SUCCESS [ 33.670 s]
[INFO] Maven Surefire Common .............................. SUCCESS [ 23.085 s]
[INFO] SureFire JUnitCore Runner .......................... SUCCESS [02:14 min]
[INFO] SureFire JUnit Platform Runner ..................... SUCCESS [  6.691 s]
[INFO] SureFire TestNG Utils .............................. SUCCESS [  3.660 s]
[INFO] SureFire TestNG Runner ............................. SUCCESS [  4.391 s]
[INFO] ShadeFire JUnit3 Provider .......................... SUCCESS [  1.740 s]
[INFO] Surefire Report Parser ............................. SUCCESS [  5.711 s]
[INFO] Maven Surefire Plugin .............................. SUCCESS [ 10.535 s]
[INFO] Maven Failsafe Plugin .............................. SUCCESS [01:04 min]
[INFO] Maven Surefire Report Plugin ....................... SUCCESS [ 12.572 s]
[INFO] Maven Surefire Integration Tests ................... SUCCESS [48:11 min]
[INFO] ------------------------------------------------------------------------
[INFO] BUILD SUCCESS
[INFO] ------------------------------------------------------------------------
[INFO] Total time:  54:40 min
[INFO] Finished at: 2019-02-13T13:45:55Z
[INFO] ------------------------------------------------------------------------
[Pipeline] }
[Pipeline] // withEnv
[Pipeline] }
[Pipeline] // stage
[Pipeline] fileExists
[Pipeline] zip
Writing zip file of C:\Users\jenkins\AppData\Local\Temp\2\jenkins-maven-box-maven-surefire-SUREFIRE-1004-2\maven-failsafe-plugin\target\it to C:\Users\jenkins\AppData\Local\Temp\2\jenkins-maven-box-maven-surefire-SUREFIRE-1004-2\maven-failsafe-plugin--windows-jdk7-maven3.6.x.zip
Zipped 78 entries.
Archiving C:\Users\jenkins\AppData\Local\Temp\2\jenkins-maven-box-maven-surefire-SUREFIRE-1004-2\maven-failsafe-plugin--windows-jdk7-maven3.6.x.zip
[Fast Archiver] No prior successful build to compare, so performing full copy of artifacts
[Pipeline] fileExists
[Pipeline] zip
Writing zip file of C:\Users\jenkins\AppData\Local\Temp\2\jenkins-maven-box-maven-surefire-SUREFIRE-1004-2\surefire-its\target to C:\Users\jenkins\AppData\Local\Temp\2\jenkins-maven-box-maven-surefire-SUREFIRE-1004-2\surefire-its--windows-jdk7-maven3.6.x.zip
Zipped 15875 entries.
Archiving C:\Users\jenkins\AppData\Local\Temp\2\jenkins-maven-box-maven-surefire-SUREFIRE-1004-2\surefire-its--windows-jdk7-maven3.6.x.zip
[Fast Archiver] No prior successful build to compare, so performing full copy of artifacts
[Pipeline] archiveArtifacts
Archiving artifacts
[Fast Archiver] No prior successful build to compare, so performing full copy of artifacts
[Pipeline] cleanWs
[WS-CLEANUP] Deleting project workspace...
[WS-CLEANUP] Deferred wipeout is used...
[WS-CLEANUP] done
[Pipeline] }
[Pipeline] // ws
[Pipeline] }
[Pipeline] // timestamps
[Pipeline] }
[Pipeline] // node
[Pipeline] }
[Pipeline] // parallel
[Pipeline] echo
Build result: FAILURE
[Pipeline] jiraIssueSelector
[Pipeline] emailext