Build failed in Jenkins: Maven TLP » maven-surefire » MasterProcessChannelDecoder #8

classic Classic list List threaded Threaded
5 messages Options
Reply | Threaded
Open this post in threaded view
|

Build failed in Jenkins: Maven TLP » maven-surefire » MasterProcessChannelDecoder #8

Apache Jenkins Server-2
See https://builds.apache.org/job/maven-box/job/maven-surefire/job/MasterProcessChannelDecoder/8/

Changes:

* Log unique commits
* Other attempt due to 'Scripts not permitted to use staticMethod
* Revert "Log unique commits"

No tests ran.

Build log:
[...truncated 37123 lines...]
[2019-09-23T13:08:40.965Z] [ERROR] Please refer to dump files (if any exist) [date].dump, [date]-jvmRun[N].dump and [date].dumpstream.
[2019-09-23T13:08:40.965Z] [ERROR] -> [Help 1]
[2019-09-23T13:08:40.965Z] org.apache.maven.lifecycle.LifecycleExecutionException: Failed to execute goal org.apache.maven.plugins:maven-failsafe-plugin:3.0.0-M3:verify (default) on project surefire-its: There are test failures.
[2019-09-23T13:08:40.965Z]
[2019-09-23T13:08:40.965Z] Please refer to C:\Users\jenkins\AppData\Local\Temp\3\jenkins-maven-box-maven-surefire-MasterProcessChannelDecoder-8\surefire-its\target\failsafe-reports for the individual test results.
[2019-09-23T13:08:40.965Z] Please refer to dump files (if any exist) [date].dump, [date]-jvmRun[N].dump and [date].dumpstream.
[2019-09-23T13:08:40.965Z]     at org.apache.maven.lifecycle.internal.MojoExecutor.execute (MojoExecutor.java:215)
[2019-09-23T13:08:40.965Z]     at org.apache.maven.lifecycle.internal.MojoExecutor.execute (MojoExecutor.java:156)
[2019-09-23T13:08:40.965Z]     at org.apache.maven.lifecycle.internal.MojoExecutor.execute (MojoExecutor.java:148)
[2019-09-23T13:08:40.965Z]     at org.apache.maven.lifecycle.internal.LifecycleModuleBuilder.buildProject (LifecycleModuleBuilder.java:117)
[2019-09-23T13:08:40.965Z]     at org.apache.maven.lifecycle.internal.LifecycleModuleBuilder.buildProject (LifecycleModuleBuilder.java:81)
[2019-09-23T13:08:40.965Z]     at org.apache.maven.lifecycle.internal.builder.singlethreaded.SingleThreadedBuilder.build (SingleThreadedBuilder.java:56)
[2019-09-23T13:08:40.965Z]     at org.apache.maven.lifecycle.internal.LifecycleStarter.execute (LifecycleStarter.java:128)
[2019-09-23T13:08:40.965Z]     at org.apache.maven.DefaultMaven.doExecute (DefaultMaven.java:305)
[2019-09-23T13:08:40.965Z]     at org.apache.maven.DefaultMaven.doExecute (DefaultMaven.java:192)
[2019-09-23T13:08:40.965Z]     at org.apache.maven.DefaultMaven.execute (DefaultMaven.java:105)
[2019-09-23T13:08:40.965Z]     at org.apache.maven.cli.MavenCli.execute (MavenCli.java:956)
[2019-09-23T13:08:40.965Z]     at org.apache.maven.cli.MavenCli.doMain (MavenCli.java:288)
[2019-09-23T13:08:40.965Z]     at org.apache.maven.cli.MavenCli.main (MavenCli.java:192)
[2019-09-23T13:08:40.965Z]     at sun.reflect.NativeMethodAccessorImpl.invoke0 (Native Method)
[2019-09-23T13:08:40.965Z]     at sun.reflect.NativeMethodAccessorImpl.invoke (NativeMethodAccessorImpl.java:62)
[2019-09-23T13:08:40.965Z]     at sun.reflect.DelegatingMethodAccessorImpl.invoke (DelegatingMethodAccessorImpl.java:43)
[2019-09-23T13:08:40.965Z]     at java.lang.reflect.Method.invoke (Method.java:498)
[2019-09-23T13:08:40.965Z]     at org.codehaus.plexus.classworlds.launcher.Launcher.launchEnhanced (Launcher.java:289)
[2019-09-23T13:08:40.965Z]     at org.codehaus.plexus.classworlds.launcher.Launcher.launch (Launcher.java:229)
[2019-09-23T13:08:40.965Z]     at org.codehaus.plexus.classworlds.launcher.Launcher.mainWithExitCode (Launcher.java:415)
[2019-09-23T13:08:40.965Z]     at org.codehaus.plexus.classworlds.launcher.Launcher.main (Launcher.java:356)
[2019-09-23T13:08:40.965Z] Caused by: org.apache.maven.plugin.MojoFailureException: There are test failures.
[2019-09-23T13:08:40.965Z]
[2019-09-23T13:08:40.965Z] Please refer to C:\Users\jenkins\AppData\Local\Temp\3\jenkins-maven-box-maven-surefire-MasterProcessChannelDecoder-8\surefire-its\target\failsafe-reports for the individual test results.
[2019-09-23T13:08:40.965Z] Please refer to dump files (if any exist) [date].dump, [date]-jvmRun[N].dump and [date].dumpstream.
[2019-09-23T13:08:40.965Z]     at org.apache.maven.plugin.surefire.SurefireHelper.throwException (SurefireHelper.java:271)
[2019-09-23T13:08:40.965Z]     at org.apache.maven.plugin.surefire.SurefireHelper.reportExecution (SurefireHelper.java:159)
[2019-09-23T13:08:40.965Z]     at org.apache.maven.plugin.failsafe.VerifyMojo.execute (VerifyMojo.java:192)
[2019-09-23T13:08:40.965Z]     at org.apache.maven.plugin.DefaultBuildPluginManager.executeMojo (DefaultBuildPluginManager.java:137)
[2019-09-23T13:08:40.965Z]     at org.apache.maven.lifecycle.internal.MojoExecutor.execute (MojoExecutor.java:210)
[2019-09-23T13:08:40.965Z]     at org.apache.maven.lifecycle.internal.MojoExecutor.execute (MojoExecutor.java:156)
[2019-09-23T13:08:40.965Z]     at org.apache.maven.lifecycle.internal.MojoExecutor.execute (MojoExecutor.java:148)
[2019-09-23T13:08:40.965Z]     at org.apache.maven.lifecycle.internal.LifecycleModuleBuilder.buildProject (LifecycleModuleBuilder.java:117)
[2019-09-23T13:08:40.965Z]     at org.apache.maven.lifecycle.internal.LifecycleModuleBuilder.buildProject (LifecycleModuleBuilder.java:81)
[2019-09-23T13:08:40.965Z]     at org.apache.maven.lifecycle.internal.builder.singlethreaded.SingleThreadedBuilder.build (SingleThreadedBuilder.java:56)
[2019-09-23T13:08:40.965Z]     at org.apache.maven.lifecycle.internal.LifecycleStarter.execute (LifecycleStarter.java:128)
[2019-09-23T13:08:40.965Z]     at org.apache.maven.DefaultMaven.doExecute (DefaultMaven.java:305)
[2019-09-23T13:08:40.966Z]     at org.apache.maven.DefaultMaven.doExecute (DefaultMaven.java:192)
[2019-09-23T13:08:40.966Z]     at org.apache.maven.DefaultMaven.execute (DefaultMaven.java:105)
[2019-09-23T13:08:40.966Z]     at org.apache.maven.cli.MavenCli.execute (MavenCli.java:956)
[2019-09-23T13:08:40.966Z]     at org.apache.maven.cli.MavenCli.doMain (MavenCli.java:288)
[2019-09-23T13:08:40.966Z]     at org.apache.maven.cli.MavenCli.main (MavenCli.java:192)
[2019-09-23T13:08:40.966Z]     at sun.reflect.NativeMethodAccessorImpl.invoke0 (Native Method)
[2019-09-23T13:08:40.966Z]     at sun.reflect.NativeMethodAccessorImpl.invoke (NativeMethodAccessorImpl.java:62)
[2019-09-23T13:08:40.966Z]     at sun.reflect.DelegatingMethodAccessorImpl.invoke (DelegatingMethodAccessorImpl.java:43)
[2019-09-23T13:08:40.966Z]     at java.lang.reflect.Method.invoke (Method.java:498)
[2019-09-23T13:08:40.966Z]     at org.codehaus.plexus.classworlds.launcher.Launcher.launchEnhanced (Launcher.java:289)
[2019-09-23T13:08:40.966Z]     at org.codehaus.plexus.classworlds.launcher.Launcher.launch (Launcher.java:229)
[2019-09-23T13:08:40.966Z]     at org.codehaus.plexus.classworlds.launcher.Launcher.mainWithExitCode (Launcher.java:415)
[2019-09-23T13:08:40.966Z]     at org.codehaus.plexus.classworlds.launcher.Launcher.main (Launcher.java:356)
[2019-09-23T13:08:40.966Z] [ERROR]
[2019-09-23T13:08:40.966Z] [ERROR] Re-run Maven using the -X switch to enable full debug logging.
[2019-09-23T13:08:40.966Z] [ERROR]
[2019-09-23T13:08:40.966Z] [ERROR] For more information about the errors and possible solutions, please read the following articles:
[2019-09-23T13:08:40.966Z] [ERROR] [Help 1] http://cwiki.apache.org/confluence/display/MAVEN/MojoFailureException
[2019-09-23T13:08:40.966Z] [ERROR]
[2019-09-23T13:08:40.966Z] [ERROR] After correcting the problems, you can resume the build with the command
[2019-09-23T13:08:40.966Z] [ERROR]   mvn <goals> -rf :surefire-its
[Pipeline] }
[Pipeline] // withEnv
[Pipeline] }
[Pipeline] // stage
[Pipeline] fileExists
[Pipeline] zip
[2019-09-23T13:08:41.105Z] Writing zip file of C:\Users\jenkins\AppData\Local\Temp\3\jenkins-maven-box-maven-surefire-MasterProcessChannelDecoder-8\maven-failsafe-plugin\target\it to C:\Users\jenkins\AppData\Local\Temp\3\jenkins-maven-box-maven-surefire-MasterProcessChannelDecoder-8\maven-failsafe-plugin--windows-jdk12-maven3.6.x.zip
[2019-09-23T13:08:41.266Z] Zipped 78 entries.
[2019-09-23T13:08:41.266Z] Archiving C:\Users\jenkins\AppData\Local\Temp\3\jenkins-maven-box-maven-surefire-MasterProcessChannelDecoder-8\maven-failsafe-plugin--windows-jdk12-maven3.6.x.zip
[2019-09-23T13:08:41.267Z] [Fast Archiver] No artifacts from Maven TLP » maven-surefire » MasterProcessChannelDecoder #1 to compare, so performing full copy of artifacts
[Pipeline] fileExists
[Pipeline] zip
[2019-09-23T13:08:41.353Z] Writing zip file of C:\Users\jenkins\AppData\Local\Temp\3\jenkins-maven-box-maven-surefire-MasterProcessChannelDecoder-8\surefire-its\target to C:\Users\jenkins\AppData\Local\Temp\3\jenkins-maven-box-maven-surefire-MasterProcessChannelDecoder-8\surefire-its--windows-jdk12-maven3.6.x.zip
[2019-09-23T13:08:49.394Z] [INFO] Tests run: 5, Failures: 0, Errors: 0, Skipped: 0, Time elapsed: 29.143 s - in org.apache.maven.surefire.its.jiras.Surefire995CategoryInheritanceIT
[2019-09-23T13:08:49.394Z] [INFO]
[2019-09-23T13:08:49.394Z] [INFO] Results:
[2019-09-23T13:08:49.394Z] [INFO]
[2019-09-23T13:08:49.394Z] [ERROR] Failures:
[2019-09-23T13:08:49.394Z] [ERROR]   JUnitPlatformEnginesIT.platform:103
[2019-09-23T13:08:49.394Z] Expected: (<[.*\[DEBUG\] test\(compact\) classpath:.*]> and <[.*  test-classes.*]> and <[.*  classes.*]> and <[.*junit-jupiter-engine-5\.5\.0-SNAPSHOT\.jar.*]> and <[.*apiguardian-api-1\.0\.0\.jar.*]> and <[.*junit-platform-engine-1\.5\.0-SNAPSHOT\.jar.*]> and <[.*junit-platform-commons-1\.5\.0-SNAPSHOT\.jar.*]> and <[.*opentest4j-1\.2\.0-SNAPSHOT\.jar.*]> and <[.*junit-jupiter-api-5\.5\.0-SNAPSHOT\.jar.*]>)
[2019-09-23T13:08:49.394Z]      but: <[.*apiguardian-api-1\.0\.0\.jar.*]> was <[[DEBUG] test(compact) classpath:  test-classes  classes  junit-jupiter-engine-5.5.0-SNAPSHOT.jar  apiguardian-api-1.1.0.jar  junit-platform-engine-1.5.0-SNAPSHOT.jar  opentest4j-1.2.0.jar  junit-platform-commons-1.5.0-SNAPSHOT.jar  junit-jupiter-api-5.5.0-SNAPSHOT.jar]>
[2019-09-23T13:08:49.394Z] [INFO]
[2019-09-23T13:08:49.394Z] [ERROR] Tests run: 796, Failures: 1, Errors: 0, Skipped: 143
[2019-09-23T13:08:49.394Z] [INFO]
[2019-09-23T13:08:49.394Z] [INFO]
[2019-09-23T13:08:49.394Z] [INFO] --- maven-checkstyle-plugin:3.0.0:check (checkstyle-check) @ surefire-its ---
[2019-09-23T13:08:49.394Z] [INFO]
[2019-09-23T13:08:49.394Z] [INFO] --- maven-failsafe-plugin:3.0.0-M3:verify (default) @ surefire-its ---
[2019-09-23T13:08:49.394Z] [INFO] Failsafe report directory: C:\Users\jenkins\AppData\Local\Temp\2\jenkins-maven-box-maven-surefire-MasterProcessChannelDecoder-8\surefire-its\target\failsafe-reports
[2019-09-23T13:08:49.394Z] [INFO] ------------------------------------------------------------------------
[2019-09-23T13:08:49.394Z] [INFO] Reactor Summary for Apache Maven Surefire 3.0.0-SNAPSHOT:
[2019-09-23T13:08:49.394Z] [INFO]
[2019-09-23T13:08:49.394Z] [INFO] Apache Maven Surefire .............................. SUCCESS [01:08 min]
[2019-09-23T13:08:49.394Z] [INFO] SureFire Logger API ................................ SUCCESS [ 23.504 s]
[2019-09-23T13:08:49.394Z] [INFO] SureFire API ....................................... SUCCESS [ 19.614 s]
[2019-09-23T13:08:49.394Z] [INFO] Surefire Extensions API ............................ SUCCESS [  3.342 s]
[2019-09-23T13:08:49.394Z] [INFO] SureFire Booter .................................... SUCCESS [ 17.892 s]
[2019-09-23T13:08:49.394Z] [INFO] Maven Surefire Test-Grouping Support ............... SUCCESS [ 11.260 s]
[2019-09-23T13:08:49.394Z] [INFO] SureFire Providers ................................. SUCCESS [  1.226 s]
[2019-09-23T13:08:49.394Z] [INFO] Shared JUnit3 Provider Code ........................ SUCCESS [  5.148 s]
[2019-09-23T13:08:49.394Z] [INFO] Shared Java 5 Provider Base ........................ SUCCESS [  7.079 s]
[2019-09-23T13:08:49.394Z] [INFO] Shared JUnit4 Provider Code ........................ SUCCESS [  7.334 s]
[2019-09-23T13:08:49.394Z] [INFO] Shared JUnit48 Provider Code ....................... SUCCESS [  8.340 s]
[2019-09-23T13:08:49.394Z] [INFO] SureFire JUnit Runner .............................. SUCCESS [  6.046 s]
[2019-09-23T13:08:49.394Z] [INFO] SureFire JUnit4 Runner ............................. SUCCESS [ 35.616 s]
[2019-09-23T13:08:49.394Z] [INFO] Maven Surefire Common .............................. SUCCESS [ 49.594 s]
[2019-09-23T13:08:49.394Z] [INFO] SureFire JUnitCore Runner .......................... SUCCESS [02:24 min]
[2019-09-23T13:08:49.394Z] [INFO] SureFire JUnit Platform Runner ..................... SUCCESS [ 12.970 s]
[2019-09-23T13:08:49.394Z] [INFO] SureFire TestNG Utils .............................. SUCCESS [  6.260 s]
[2019-09-23T13:08:49.394Z] [INFO] SureFire TestNG Runner ............................. SUCCESS [  7.163 s]
[2019-09-23T13:08:49.394Z] [INFO] ShadeFire JUnit3 Provider .......................... SUCCESS [  2.470 s]
[2019-09-23T13:08:49.394Z] [INFO] Surefire Report Parser ............................. SUCCESS [  9.374 s]
[2019-09-23T13:08:49.394Z] [INFO] Maven Surefire Plugin .............................. SUCCESS [ 20.547 s]
[2019-09-23T13:08:49.394Z] [INFO] Maven Failsafe Plugin .............................. SUCCESS [02:10 min]
[2019-09-23T13:08:49.394Z] [INFO] Maven Surefire Report Plugin ....................... SUCCESS [ 19.718 s]
[2019-09-23T13:08:49.394Z] [INFO] Maven Surefire Integration Tests ................... FAILURE [  01:30 h]
[2019-09-23T13:08:49.394Z] [INFO] ------------------------------------------------------------------------
[2019-09-23T13:08:49.394Z] [INFO] BUILD FAILURE
[2019-09-23T13:08:49.394Z] [INFO] ------------------------------------------------------------------------
[2019-09-23T13:08:49.394Z] [INFO] Total time:  01:40 h
[2019-09-23T13:08:49.394Z] [INFO] Finished at: 2019-09-23T06:08:47-07:00
[2019-09-23T13:08:49.394Z] [INFO] ------------------------------------------------------------------------
[2019-09-23T13:08:49.394Z] [ERROR] Failed to execute goal org.apache.maven.plugins:maven-failsafe-plugin:3.0.0-M3:verify (default) on project surefire-its: There are test failures.
[2019-09-23T13:08:49.394Z] [ERROR]
[2019-09-23T13:08:49.395Z] [ERROR] Please refer to C:\Users\jenkins\AppData\Local\Temp\2\jenkins-maven-box-maven-surefire-MasterProcessChannelDecoder-8\surefire-its\target\failsafe-reports for the individual test results.
[2019-09-23T13:08:49.395Z] [ERROR] Please refer to dump files (if any exist) [date].dump, [date]-jvmRun[N].dump and [date].dumpstream.
[2019-09-23T13:08:49.395Z] [ERROR] -> [Help 1]
[2019-09-23T13:08:49.395Z] org.apache.maven.lifecycle.LifecycleExecutionException: Failed to execute goal org.apache.maven.plugins:maven-failsafe-plugin:3.0.0-M3:verify (default) on project surefire-its: There are test failures.
[2019-09-23T13:08:49.395Z]
[2019-09-23T13:08:49.395Z] Please refer to C:\Users\jenkins\AppData\Local\Temp\2\jenkins-maven-box-maven-surefire-MasterProcessChannelDecoder-8\surefire-its\target\failsafe-reports for the individual test results.
[2019-09-23T13:08:49.395Z] Please refer to dump files (if any exist) [date].dump, [date]-jvmRun[N].dump and [date].dumpstream.
[2019-09-23T13:08:49.395Z]     at org.apache.maven.lifecycle.internal.MojoExecutor.execute (MojoExecutor.java:215)
[2019-09-23T13:08:49.395Z]     at org.apache.maven.lifecycle.internal.MojoExecutor.execute (MojoExecutor.java:156)
[2019-09-23T13:08:49.395Z]     at org.apache.maven.lifecycle.internal.MojoExecutor.execute (MojoExecutor.java:148)
[2019-09-23T13:08:49.395Z]     at org.apache.maven.lifecycle.internal.LifecycleModuleBuilder.buildProject (LifecycleModuleBuilder.java:117)
[2019-09-23T13:08:49.395Z]     at org.apache.maven.lifecycle.internal.LifecycleModuleBuilder.buildProject (LifecycleModuleBuilder.java:81)
[2019-09-23T13:08:49.395Z]     at org.apache.maven.lifecycle.internal.builder.singlethreaded.SingleThreadedBuilder.build (SingleThreadedBuilder.java:56)
[2019-09-23T13:08:49.395Z]     at org.apache.maven.lifecycle.internal.LifecycleStarter.execute (LifecycleStarter.java:128)
[2019-09-23T13:08:49.395Z]     at org.apache.maven.DefaultMaven.doExecute (DefaultMaven.java:305)
[2019-09-23T13:08:49.395Z]     at org.apache.maven.DefaultMaven.doExecute (DefaultMaven.java:192)
[2019-09-23T13:08:49.395Z]     at org.apache.maven.DefaultMaven.execute (DefaultMaven.java:105)
[2019-09-23T13:08:49.395Z]     at org.apache.maven.cli.MavenCli.execute (MavenCli.java:956)
[2019-09-23T13:08:49.395Z]     at org.apache.maven.cli.MavenCli.doMain (MavenCli.java:288)
[2019-09-23T13:08:49.395Z]     at org.apache.maven.cli.MavenCli.main (MavenCli.java:192)
[2019-09-23T13:08:49.395Z]     at sun.reflect.NativeMethodAccessorImpl.invoke0 (Native Method)
[2019-09-23T13:08:49.395Z]     at sun.reflect.NativeMethodAccessorImpl.invoke (NativeMethodAccessorImpl.java:62)
[2019-09-23T13:08:49.395Z]     at sun.reflect.DelegatingMethodAccessorImpl.invoke (DelegatingMethodAccessorImpl.java:43)
[2019-09-23T13:08:49.395Z]     at java.lang.reflect.Method.invoke (Method.java:498)
[2019-09-23T13:08:49.395Z]     at org.codehaus.plexus.classworlds.launcher.Launcher.launchEnhanced (Launcher.java:289)
[2019-09-23T13:08:49.395Z]     at org.codehaus.plexus.classworlds.launcher.Launcher.launch (Launcher.java:229)
[2019-09-23T13:08:49.395Z]     at org.codehaus.plexus.classworlds.launcher.Launcher.mainWithExitCode (Launcher.java:415)
[2019-09-23T13:08:49.395Z]     at org.codehaus.plexus.classworlds.launcher.Launcher.main (Launcher.java:356)
[2019-09-23T13:08:49.395Z] Caused by: org.apache.maven.plugin.MojoFailureException: There are test failures.
[2019-09-23T13:08:49.395Z]
[2019-09-23T13:08:49.395Z] Please refer to C:\Users\jenkins\AppData\Local\Temp\2\jenkins-maven-box-maven-surefire-MasterProcessChannelDecoder-8\surefire-its\target\failsafe-reports for the individual test results.
[2019-09-23T13:08:49.395Z] Please refer to dump files (if any exist) [date].dump, [date]-jvmRun[N].dump and [date].dumpstream.
[2019-09-23T13:08:49.395Z]     at org.apache.maven.plugin.surefire.SurefireHelper.throwException (SurefireHelper.java:271)
[2019-09-23T13:08:49.395Z]     at org.apache.maven.plugin.surefire.SurefireHelper.reportExecution (SurefireHelper.java:159)
[2019-09-23T13:08:49.395Z]     at org.apache.maven.plugin.failsafe.VerifyMojo.execute (VerifyMojo.java:192)
[2019-09-23T13:08:49.395Z]     at org.apache.maven.plugin.DefaultBuildPluginManager.executeMojo (DefaultBuildPluginManager.java:137)
[2019-09-23T13:08:49.395Z]     at org.apache.maven.lifecycle.internal.MojoExecutor.execute (MojoExecutor.java:210)
[2019-09-23T13:08:49.395Z]     at org.apache.maven.lifecycle.internal.MojoExecutor.execute (MojoExecutor.java:156)
[2019-09-23T13:08:49.395Z]     at org.apache.maven.lifecycle.internal.MojoExecutor.execute (MojoExecutor.java:148)
[2019-09-23T13:08:49.395Z]     at org.apache.maven.lifecycle.internal.LifecycleModuleBuilder.buildProject (LifecycleModuleBuilder.java:117)
[2019-09-23T13:08:49.395Z]     at org.apache.maven.lifecycle.internal.LifecycleModuleBuilder.buildProject (LifecycleModuleBuilder.java:81)
[2019-09-23T13:08:49.395Z]     at org.apache.maven.lifecycle.internal.builder.singlethreaded.SingleThreadedBuilder.build (SingleThreadedBuilder.java:56)
[2019-09-23T13:08:49.395Z]     at org.apache.maven.lifecycle.internal.LifecycleStarter.execute (LifecycleStarter.java:128)
[2019-09-23T13:08:49.395Z]     at org.apache.maven.DefaultMaven.doExecute (DefaultMaven.java:305)
[2019-09-23T13:08:49.395Z]     at org.apache.maven.DefaultMaven.doExecute (DefaultMaven.java:192)
[2019-09-23T13:08:49.395Z]     at org.apache.maven.DefaultMaven.execute (DefaultMaven.java:105)
[2019-09-23T13:08:49.395Z]     at org.apache.maven.cli.MavenCli.execute (MavenCli.java:956)
[2019-09-23T13:08:49.395Z]     at org.apache.maven.cli.MavenCli.doMain (MavenCli.java:288)
[2019-09-23T13:08:49.395Z]     at org.apache.maven.cli.MavenCli.main (MavenCli.java:192)
[2019-09-23T13:08:49.395Z]     at sun.reflect.NativeMethodAccessorImpl.invoke0 (Native Method)
[2019-09-23T13:08:49.395Z]     at sun.reflect.NativeMethodAccessorImpl.invoke (NativeMethodAccessorImpl.java:62)
[2019-09-23T13:08:49.395Z]     at sun.reflect.DelegatingMethodAccessorImpl.invoke (DelegatingMethodAccessorImpl.java:43)
[2019-09-23T13:08:49.395Z]     at java.lang.reflect.Method.invoke (Method.java:498)
[2019-09-23T13:08:49.395Z]     at org.codehaus.plexus.classworlds.launcher.Launcher.launchEnhanced (Launcher.java:289)
[2019-09-23T13:08:49.395Z]     at org.codehaus.plexus.classworlds.launcher.Launcher.launch (Launcher.java:229)
[2019-09-23T13:08:49.395Z]     at org.codehaus.plexus.classworlds.launcher.Launcher.mainWithExitCode (Launcher.java:415)
[2019-09-23T13:08:49.395Z]     at org.codehaus.plexus.classworlds.launcher.Launcher.main (Launcher.java:356)
[2019-09-23T13:08:49.395Z] [ERROR]
[2019-09-23T13:08:49.395Z] [ERROR] Re-run Maven using the -X switch to enable full debug logging.
[2019-09-23T13:08:49.395Z] [ERROR]
[2019-09-23T13:08:49.395Z] [ERROR] For more information about the errors and possible solutions, please read the following articles:
[2019-09-23T13:08:49.395Z] [ERROR] [Help 1] http://cwiki.apache.org/confluence/display/MAVEN/MojoFailureException
[2019-09-23T13:08:49.395Z] [ERROR]
[2019-09-23T13:08:49.395Z] [ERROR] After correcting the problems, you can resume the build with the command
[2019-09-23T13:08:49.395Z] [ERROR]   mvn <goals> -rf :surefire-its
[Pipeline] }
[Pipeline] // withEnv
[Pipeline] }
[Pipeline] // stage
[Pipeline] fileExists
[Pipeline] zip
[2019-09-23T13:08:49.535Z] Writing zip file of C:\Users\jenkins\AppData\Local\Temp\2\jenkins-maven-box-maven-surefire-MasterProcessChannelDecoder-8\maven-failsafe-plugin\target\it to C:\Users\jenkins\AppData\Local\Temp\2\jenkins-maven-box-maven-surefire-MasterProcessChannelDecoder-8\maven-failsafe-plugin--windows-jdk11-maven3.6.x.zip
[2019-09-23T13:08:49.664Z] Zipped 79 entries.
[2019-09-23T13:08:49.664Z] Archiving C:\Users\jenkins\AppData\Local\Temp\2\jenkins-maven-box-maven-surefire-MasterProcessChannelDecoder-8\maven-failsafe-plugin--windows-jdk11-maven3.6.x.zip
[2019-09-23T13:08:49.665Z] [Fast Archiver] No artifacts from Maven TLP » maven-surefire » MasterProcessChannelDecoder #1 to compare, so performing full copy of artifacts
[Pipeline] fileExists
[Pipeline] zip
[2019-09-23T13:08:49.735Z] Writing zip file of C:\Users\jenkins\AppData\Local\Temp\2\jenkins-maven-box-maven-surefire-MasterProcessChannelDecoder-8\surefire-its\target to C:\Users\jenkins\AppData\Local\Temp\2\jenkins-maven-box-maven-surefire-MasterProcessChannelDecoder-8\surefire-its--windows-jdk11-maven3.6.x.zip
[2019-09-23T13:09:01.668Z] Zipped 16370 entries.
[2019-09-23T13:09:01.669Z] Archiving C:\Users\jenkins\AppData\Local\Temp\3\jenkins-maven-box-maven-surefire-MasterProcessChannelDecoder-8\surefire-its--windows-jdk12-maven3.6.x.zip
[2019-09-23T13:09:01.670Z] [Fast Archiver] No artifacts from Maven TLP » maven-surefire » MasterProcessChannelDecoder #1 to compare, so performing full copy of artifacts
[Pipeline] archiveArtifacts
[2019-09-23T13:09:03.515Z] Archiving artifacts
[2019-09-23T13:09:03.526Z] [Fast Archiver] No artifacts from Maven TLP » maven-surefire » MasterProcessChannelDecoder #1 to compare, so performing full copy of artifacts
[2019-09-23T13:09:04.353Z] Zipped 16372 entries.
[2019-09-23T13:09:04.353Z] Archiving C:\Users\jenkins\AppData\Local\Temp\2\jenkins-maven-box-maven-surefire-MasterProcessChannelDecoder-8\surefire-its--windows-jdk11-maven3.6.x.zip
[2019-09-23T13:09:04.354Z] [Fast Archiver] No artifacts from Maven TLP » maven-surefire » MasterProcessChannelDecoder #1 to compare, so performing full copy of artifacts
[Pipeline] cleanWs
[2019-09-23T13:09:05.391Z] [WS-CLEANUP] Deleting project workspace...
[2019-09-23T13:09:05.391Z] [WS-CLEANUP] Deferred wipeout is used...
[2019-09-23T13:09:05.538Z] [WS-CLEANUP] done
[Pipeline] }
[Pipeline] // ws
[Pipeline] }
[Pipeline] // timestamps
[Pipeline] }
[Pipeline] // node
[Pipeline] }
[Pipeline] archiveArtifacts
[2019-09-23T13:09:06.266Z] Archiving artifacts
[2019-09-23T13:09:06.281Z] [Fast Archiver] No artifacts from Maven TLP » maven-surefire » MasterProcessChannelDecoder #1 to compare, so performing full copy of artifacts
[Pipeline] cleanWs
[2019-09-23T13:09:07.728Z] [WS-CLEANUP] Deleting project workspace...
[2019-09-23T13:09:07.728Z] [WS-CLEANUP] Deferred wipeout is used...
[2019-09-23T13:09:07.858Z] [WS-CLEANUP] done
[Pipeline] }
[Pipeline] // ws
[Pipeline] }
[Pipeline] // timestamps
[Pipeline] }
[Pipeline] // node
[Pipeline] }
[Pipeline] // parallel
[Pipeline] echo
Build result: FAILURE
[Pipeline] jiraIssueSelector
[Pipeline] echo
The authors of changes [rfscholte].
[Pipeline] echo
Sending email ...
[Pipeline] emailext
Reply | Threaded
Open this post in threaded view
|

Build failed in Jenkins: Maven TLP » maven-surefire » MasterProcessChannelDecoder #9

Apache Jenkins Server-2
See https://builds.apache.org/job/maven-box/job/maven-surefire/job/MasterProcessChannelDecoder/9/

Changes:

* Apply Maven 3.6.2
* H29 has checkout issues...
* Issues with H28 too
* Seems like Maven 3.6.2 is not available on all Linux nodes yet
* Java 13 released: drop 12 + include 14 (-ea)

1 tests failed.
FAILED:  org.apache.maven.surefire.its.JUnitPlatformEnginesIT.platform[1.5.0-SNAPSHOT]

Error Message:

Expected: (<[.*\[DEBUG\] test\(compact\) classpath:.*]> and <[.*  test-classes.*]> and <[.*  classes.*]> and <[.*junit-jupiter-engine-5\.5\.0-SNAPSHOT\.jar.*]> and <[.*apiguardian-api-1\.0\.0\.jar.*]> and <[.*junit-platform-engine-1\.5\.0-SNAPSHOT\.jar.*]> and <[.*junit-platform-commons-1\.5\.0-SNAPSHOT\.jar.*]> and <[.*opentest4j-1\.2\.0-SNAPSHOT\.jar.*]> and <[.*junit-jupiter-api-5\.5\.0-SNAPSHOT\.jar.*]>)
     but: <[.*apiguardian-api-1\.0\.0\.jar.*]> was <[[DEBUG] test(compact) classpath:  test-classes  classes  junit-jupiter-engine-5.5.0-SNAPSHOT.jar  apiguardian-api-1.1.0.jar  junit-platform-engine-1.5.0-SNAPSHOT.jar  opentest4j-1.2.0.jar  junit-platform-commons-1.5.0-SNAPSHOT.jar  junit-jupiter-api-5.5.0-SNAPSHOT.jar]>

Stack Trace:
java.lang.AssertionError:

Expected: (<[.*\[DEBUG\] test\(compact\) classpath:.*]> and <[.*  test-classes.*]> and <[.*  classes.*]> and <[.*junit-jupiter-engine-5\.5\.0-SNAPSHOT\.jar.*]> and <[.*apiguardian-api-1\.0\.0\.jar.*]> and <[.*junit-platform-engine-1\.5\.0-SNAPSHOT\.jar.*]> and <[.*junit-platform-commons-1\.5\.0-SNAPSHOT\.jar.*]> and <[.*opentest4j-1\.2\.0-SNAPSHOT\.jar.*]> and <[.*junit-jupiter-api-5\.5\.0-SNAPSHOT\.jar.*]>)
     but: <[.*apiguardian-api-1\.0\.0\.jar.*]> was <[[DEBUG] test(compact) classpath:  test-classes  classes  junit-jupiter-engine-5.5.0-SNAPSHOT.jar  apiguardian-api-1.1.0.jar  junit-platform-engine-1.5.0-SNAPSHOT.jar  opentest4j-1.2.0.jar  junit-platform-commons-1.5.0-SNAPSHOT.jar  junit-jupiter-api-5.5.0-SNAPSHOT.jar]>
        at org.apache.maven.surefire.its.JUnitPlatformEnginesIT.platform(JUnitPlatformEnginesIT.java:103)




Build log:
[...truncated 48889 lines...]
[2019-10-01T05:55:12.453Z]     at org.apache.maven.lifecycle.internal.builder.singlethreaded.SingleThreadedBuilder.build (SingleThreadedBuilder.java:56)
[2019-10-01T05:55:12.453Z]     at org.apache.maven.lifecycle.internal.LifecycleStarter.execute (LifecycleStarter.java:128)
[2019-10-01T05:55:12.453Z]     at org.apache.maven.DefaultMaven.doExecute (DefaultMaven.java:305)
[2019-10-01T05:55:12.453Z]     at org.apache.maven.DefaultMaven.doExecute (DefaultMaven.java:192)
[2019-10-01T05:55:12.453Z]     at org.apache.maven.DefaultMaven.execute (DefaultMaven.java:105)
[2019-10-01T05:55:12.453Z]     at org.apache.maven.cli.MavenCli.execute (MavenCli.java:956)
[2019-10-01T05:55:12.453Z]     at org.apache.maven.cli.MavenCli.doMain (MavenCli.java:288)
[2019-10-01T05:55:12.453Z]     at org.apache.maven.cli.MavenCli.main (MavenCli.java:192)
[2019-10-01T05:55:12.453Z]     at sun.reflect.NativeMethodAccessorImpl.invoke0 (Native Method)
[2019-10-01T05:55:12.453Z]     at sun.reflect.NativeMethodAccessorImpl.invoke (NativeMethodAccessorImpl.java:62)
[2019-10-01T05:55:12.453Z]     at sun.reflect.DelegatingMethodAccessorImpl.invoke (DelegatingMethodAccessorImpl.java:43)
[2019-10-01T05:55:12.453Z]     at java.lang.reflect.Method.invoke (Method.java:498)
[2019-10-01T05:55:12.453Z]     at org.codehaus.plexus.classworlds.launcher.Launcher.launchEnhanced (Launcher.java:282)
[2019-10-01T05:55:12.453Z]     at org.codehaus.plexus.classworlds.launcher.Launcher.launch (Launcher.java:225)
[2019-10-01T05:55:12.453Z]     at org.codehaus.plexus.classworlds.launcher.Launcher.mainWithExitCode (Launcher.java:406)
[2019-10-01T05:55:12.453Z]     at org.codehaus.plexus.classworlds.launcher.Launcher.main (Launcher.java:347)
[2019-10-01T05:55:12.453Z] [ERROR]
[2019-10-01T05:55:12.453Z] [ERROR] Re-run Maven using the -X switch to enable full debug logging.
[2019-10-01T05:55:12.453Z] [ERROR]
[2019-10-01T05:55:12.453Z] [ERROR] For more information about the errors and possible solutions, please read the following articles:
[2019-10-01T05:55:12.453Z] [ERROR] [Help 1] http://cwiki.apache.org/confluence/display/MAVEN/MojoFailureException
[2019-10-01T05:55:12.453Z] [ERROR]
[2019-10-01T05:55:12.453Z] [ERROR] After correcting the problems, you can resume the build with the command
[2019-10-01T05:55:12.453Z] [ERROR]   mvn <args> -rf :surefire-its
[Pipeline] }
[Pipeline] // withEnv
[Pipeline] }
[Pipeline] // stage
[Pipeline] fileExists
[Pipeline] zip
[2019-10-01T05:55:12.595Z] Writing zip file of C:\Users\jenkins\AppData\Local\Temp\3\jenkins-maven-box-maven-surefire-MasterProcessChannelDecoder-9@2\maven-failsafe-plugin\target\it to C:\Users\jenkins\AppData\Local\Temp\3\jenkins-maven-box-maven-surefire-MasterProcessChannelDecoder-9@2\maven-failsafe-plugin--windows-jdk8-maven3.6.x.zip
[2019-10-01T05:55:12.838Z] Zipped 78 entries.
[2019-10-01T05:55:12.838Z] Archiving C:\Users\jenkins\AppData\Local\Temp\3\jenkins-maven-box-maven-surefire-MasterProcessChannelDecoder-9@2\maven-failsafe-plugin--windows-jdk8-maven3.6.x.zip
[2019-10-01T05:55:12.839Z] [Fast Archiver] No artifacts from Maven TLP » maven-surefire » MasterProcessChannelDecoder #1 to compare, so performing full copy of artifacts
[Pipeline] fileExists
[Pipeline] zip
[2019-10-01T05:55:12.962Z] Writing zip file of C:\Users\jenkins\AppData\Local\Temp\3\jenkins-maven-box-maven-surefire-MasterProcessChannelDecoder-9@2\surefire-its\target to C:\Users\jenkins\AppData\Local\Temp\3\jenkins-maven-box-maven-surefire-MasterProcessChannelDecoder-9@2\surefire-its--windows-jdk8-maven3.6.x.zip
[2019-10-01T05:55:30.860Z] Zipped 16049 entries.
[2019-10-01T05:55:30.860Z] Archiving C:\Users\jenkins\AppData\Local\Temp\3\jenkins-maven-box-maven-surefire-MasterProcessChannelDecoder-9@2\surefire-its--windows-jdk8-maven3.6.x.zip
[2019-10-01T05:55:30.860Z] [Fast Archiver] No artifacts from Maven TLP » maven-surefire » MasterProcessChannelDecoder #1 to compare, so performing full copy of artifacts
[Pipeline] archiveArtifacts
[2019-10-01T05:55:32.587Z] Archiving artifacts
[2019-10-01T05:55:32.607Z] [Fast Archiver] No artifacts from Maven TLP » maven-surefire » MasterProcessChannelDecoder #1 to compare, so performing full copy of artifacts
[Pipeline] cleanWs
[2019-10-01T05:55:34.270Z] [WS-CLEANUP] Deleting project workspace...
[2019-10-01T05:55:34.270Z] [WS-CLEANUP] Deferred wipeout is used...
[2019-10-01T05:55:34.424Z] [WS-CLEANUP] done
[Pipeline] }
[Pipeline] // ws
[Pipeline] }
[Pipeline] // timestamps
[Pipeline] }
[Pipeline] // node
[Pipeline] }
[2019-10-01T05:56:17.870Z] [INFO] Tests run: 6, Failures: 0, Errors: 0, Skipped: 0, Time elapsed: 61.524 s - in org.apache.maven.surefire.its.jiras.Surefire809GroupExpressionsIT
[2019-10-01T05:56:17.870Z] [INFO] Running org.apache.maven.surefire.its.jiras.Surefire812Log4JClassLoaderIT
[2019-10-01T05:56:27.968Z] [INFO] Tests run: 1, Failures: 0, Errors: 0, Skipped: 0, Time elapsed: 13.917 s - in org.apache.maven.surefire.its.jiras.Surefire812Log4JClassLoaderIT
[2019-10-01T05:56:27.968Z] [INFO] Running org.apache.maven.surefire.its.jiras.Surefire817SystemExitIT
[2019-10-01T05:56:33.321Z] [INFO] Tests run: 1, Failures: 0, Errors: 0, Skipped: 0, Time elapsed: 7.145 s - in org.apache.maven.surefire.its.jiras.Surefire817SystemExitIT
[2019-10-01T05:56:33.321Z] [INFO] Running org.apache.maven.surefire.its.jiras.Surefire818NpeIgnoresTestsIT
[2019-10-01T05:56:41.546Z] [INFO] Tests run: 1, Failures: 0, Errors: 0, Skipped: 0, Time elapsed: 7.569 s - in org.apache.maven.surefire.its.jiras.Surefire818NpeIgnoresTestsIT
[2019-10-01T05:56:41.546Z] [INFO] Running org.apache.maven.surefire.its.jiras.Surefire828EmptyGroupExprIT
[2019-10-01T05:57:16.061Z] [INFO] Tests run: 4, Failures: 0, Errors: 0, Skipped: 0, Time elapsed: 32.903 s - in org.apache.maven.surefire.its.jiras.Surefire828EmptyGroupExprIT
[2019-10-01T05:57:16.061Z] [INFO] Running org.apache.maven.surefire.its.jiras.Surefire832ProviderSelectionIT
[2019-10-01T05:57:22.721Z] [INFO] Tests run: 1, Failures: 0, Errors: 0, Skipped: 0, Time elapsed: 7.621 s - in org.apache.maven.surefire.its.jiras.Surefire832ProviderSelectionIT
[2019-10-01T05:57:22.721Z] [INFO] Running org.apache.maven.surefire.its.jiras.Surefire839TestWithoutCategoriesIT
[2019-10-01T05:57:37.735Z] [INFO] Tests run: 2, Failures: 0, Errors: 0, Skipped: 0, Time elapsed: 14.843 s - in org.apache.maven.surefire.its.jiras.Surefire839TestWithoutCategoriesIT
[2019-10-01T05:57:37.735Z] [INFO] Running org.apache.maven.surefire.its.jiras.Surefire847AdditionalFailureIT
[2019-10-01T05:57:45.974Z] [INFO] Tests run: 1, Failures: 0, Errors: 0, Skipped: 0, Time elapsed: 9.39 s - in org.apache.maven.surefire.its.jiras.Surefire847AdditionalFailureIT
[2019-10-01T05:57:45.974Z] [INFO] Running org.apache.maven.surefire.its.jiras.Surefire855AllowFailsafeUseArtifactFileIT
[2019-10-01T05:59:22.643Z] [INFO] Tests run: 4, Failures: 0, Errors: 0, Skipped: 0, Time elapsed: 84.345 s - in org.apache.maven.surefire.its.jiras.Surefire855AllowFailsafeUseArtifactFileIT
[2019-10-01T05:59:22.643Z] [INFO] Running org.apache.maven.surefire.its.jiras.Surefire901MIssingResultfileWhenNoTestsIT
[2019-10-01T05:59:22.643Z] [INFO] Tests run: 1, Failures: 0, Errors: 0, Skipped: 0, Time elapsed: 6.234 s - in org.apache.maven.surefire.its.jiras.Surefire901MIssingResultfileWhenNoTestsIT
[2019-10-01T05:59:22.643Z] [INFO] Running org.apache.maven.surefire.its.jiras.Surefire907PerThreadWithoutThreadCountIT
[2019-10-01T05:59:22.643Z] [INFO] Tests run: 1, Failures: 0, Errors: 0, Skipped: 0, Time elapsed: 4.962 s - in org.apache.maven.surefire.its.jiras.Surefire907PerThreadWithoutThreadCountIT
[2019-10-01T05:59:22.643Z] [INFO] Running org.apache.maven.surefire.its.jiras.Surefire920TestFailureIgnoreWithTimeoutIT
[2019-10-01T05:59:38.398Z] [INFO] Tests run: 2, Failures: 0, Errors: 0, Skipped: 0, Time elapsed: 14.983 s - in org.apache.maven.surefire.its.jiras.Surefire920TestFailureIgnoreWithTimeoutIT
[2019-10-01T05:59:38.398Z] [INFO] Running org.apache.maven.surefire.its.jiras.Surefire926FailureWith2ProvidersIT
[2019-10-01T05:59:41.752Z] [INFO] Tests run: 1, Failures: 0, Errors: 0, Skipped: 0, Time elapsed: 4.966 s - in org.apache.maven.surefire.its.jiras.Surefire926FailureWith2ProvidersIT
[2019-10-01T05:59:41.752Z] [INFO] Running org.apache.maven.surefire.its.jiras.Surefire930TestNgSuiteXmlIT
[2019-10-01T05:59:52.169Z] [INFO] Tests run: 1, Failures: 0, Errors: 0, Skipped: 0, Time elapsed: 9.064 s - in org.apache.maven.surefire.its.jiras.Surefire930TestNgSuiteXmlIT
[2019-10-01T05:59:52.169Z] [INFO] Running org.apache.maven.surefire.its.jiras.Surefire943ReportContentIT
[2019-10-01T06:00:24.414Z] [INFO] Tests run: 2, Failures: 0, Errors: 0, Skipped: 0, Time elapsed: 33.671 s - in org.apache.maven.surefire.its.jiras.Surefire943ReportContentIT
[2019-10-01T06:00:24.414Z] [INFO] Running org.apache.maven.surefire.its.jiras.Surefire946KillMainProcessInReusableForkIT
[2019-10-01T06:00:52.249Z] [INFO] Tests run: 3, Failures: 0, Errors: 0, Skipped: 0, Time elapsed: 24.311 s - in org.apache.maven.surefire.its.jiras.Surefire946KillMainProcessInReusableForkIT
[2019-10-01T06:00:52.249Z] [INFO] Running org.apache.maven.surefire.its.jiras.Surefire972BizarreNoClassDefIT
[2019-10-01T06:01:00.473Z] [INFO] Tests run: 1, Failures: 0, Errors: 0, Skipped: 0, Time elapsed: 11.484 s - in org.apache.maven.surefire.its.jiras.Surefire972BizarreNoClassDefIT
[2019-10-01T06:01:00.473Z] [INFO] Running org.apache.maven.surefire.its.jiras.Surefire975DefaultVMEncodingIT
[2019-10-01T06:01:08.705Z] [INFO] Tests run: 1, Failures: 0, Errors: 0, Skipped: 0, Time elapsed: 7.018 s - in org.apache.maven.surefire.its.jiras.Surefire975DefaultVMEncodingIT
[2019-10-01T06:01:08.705Z] [INFO] Running org.apache.maven.surefire.its.jiras.Surefire979WrongClassLoaderIT
[2019-10-01T06:01:15.453Z] [INFO] Tests run: 1, Failures: 0, Errors: 0, Skipped: 0, Time elapsed: 7.579 s - in org.apache.maven.surefire.its.jiras.Surefire979WrongClassLoaderIT
[2019-10-01T06:01:15.453Z] [INFO] Running org.apache.maven.surefire.its.jiras.Surefire985ParameterizedRunnerAndCategoriesIT
[2019-10-01T06:01:20.867Z] [INFO] Tests run: 1, Failures: 0, Errors: 0, Skipped: 0, Time elapsed: 5.744 s - in org.apache.maven.surefire.its.jiras.Surefire985ParameterizedRunnerAndCategoriesIT
[2019-10-01T06:01:20.867Z] [INFO] Running org.apache.maven.surefire.its.jiras.Surefire995CategoryInheritanceIT
[2019-10-01T06:01:47.598Z] [INFO] Tests run: 5, Failures: 0, Errors: 0, Skipped: 0, Time elapsed: 23.871 s - in org.apache.maven.surefire.its.jiras.Surefire995CategoryInheritanceIT
[2019-10-01T06:01:47.598Z] [INFO]
[2019-10-01T06:01:47.598Z] [INFO] Results:
[2019-10-01T06:01:47.598Z] [INFO]
[2019-10-01T06:01:47.598Z] [ERROR] Failures:
[2019-10-01T06:01:47.598Z] [ERROR]   JUnitPlatformEnginesIT.platform:103
[2019-10-01T06:01:47.598Z] Expected: (<[.*\[DEBUG\] test\(compact\) classpath:.*]> and <[.*  test-classes.*]> and <[.*  classes.*]> and <[.*junit-jupiter-engine-5\.5\.0-SNAPSHOT\.jar.*]> and <[.*apiguardian-api-1\.0\.0\.jar.*]> and <[.*junit-platform-engine-1\.5\.0-SNAPSHOT\.jar.*]> and <[.*junit-platform-commons-1\.5\.0-SNAPSHOT\.jar.*]> and <[.*opentest4j-1\.2\.0-SNAPSHOT\.jar.*]> and <[.*junit-jupiter-api-5\.5\.0-SNAPSHOT\.jar.*]>)
[2019-10-01T06:01:47.598Z]      but: <[.*apiguardian-api-1\.0\.0\.jar.*]> was <[[DEBUG] test(compact) classpath:  test-classes  classes  junit-jupiter-engine-5.5.0-SNAPSHOT.jar  apiguardian-api-1.1.0.jar  junit-platform-engine-1.5.0-SNAPSHOT.jar  opentest4j-1.2.0.jar  junit-platform-commons-1.5.0-SNAPSHOT.jar  junit-jupiter-api-5.5.0-SNAPSHOT.jar]>
[2019-10-01T06:01:47.598Z] [INFO]
[2019-10-01T06:01:47.598Z] [ERROR] Tests run: 796, Failures: 1, Errors: 0, Skipped: 143
[2019-10-01T06:01:47.598Z] [INFO]
[2019-10-01T06:01:47.598Z] [INFO]
[2019-10-01T06:01:47.598Z] [INFO] --- maven-checkstyle-plugin:3.0.0:check (checkstyle-check) @ surefire-its ---
[2019-10-01T06:01:47.598Z] [INFO]
[2019-10-01T06:01:47.598Z] [INFO] --- maven-failsafe-plugin:3.0.0-M3:verify (default) @ surefire-its ---
[2019-10-01T06:01:47.598Z] [INFO] Failsafe report directory: C:\Users\jenkins\AppData\Local\Temp\3\jenkins-maven-box-maven-surefire-MasterProcessChannelDecoder-9\surefire-its\target\failsafe-reports
[2019-10-01T06:01:47.598Z] [INFO] ------------------------------------------------------------------------
[2019-10-01T06:01:47.598Z] [INFO] Reactor Summary for Apache Maven Surefire 3.0.0-SNAPSHOT:
[2019-10-01T06:01:47.598Z] [INFO]
[2019-10-01T06:01:47.598Z] [INFO] Apache Maven Surefire .............................. SUCCESS [01:20 min]
[2019-10-01T06:01:47.598Z] [INFO] SureFire Logger API ................................ SUCCESS [ 28.249 s]
[2019-10-01T06:01:47.598Z] [INFO] SureFire API ....................................... SUCCESS [ 24.632 s]
[2019-10-01T06:01:47.598Z] [INFO] Surefire Extensions API ............................ SUCCESS [  7.352 s]
[2019-10-01T06:01:47.598Z] [INFO] SureFire Booter .................................... SUCCESS [ 37.481 s]
[2019-10-01T06:01:47.598Z] [INFO] Maven Surefire Test-Grouping Support ............... SUCCESS [ 28.791 s]
[2019-10-01T06:01:47.598Z] [INFO] SureFire Providers ................................. SUCCESS [  1.898 s]
[2019-10-01T06:01:47.598Z] [INFO] Shared JUnit3 Provider Code ........................ SUCCESS [  8.101 s]
[2019-10-01T06:01:47.598Z] [INFO] Shared Java 5 Provider Base ........................ SUCCESS [ 10.225 s]
[2019-10-01T06:01:47.598Z] [INFO] Shared JUnit4 Provider Code ........................ SUCCESS [ 15.076 s]
[2019-10-01T06:01:47.598Z] [INFO] Shared JUnit48 Provider Code ....................... SUCCESS [ 10.063 s]
[2019-10-01T06:01:47.598Z] [INFO] SureFire JUnit Runner .............................. SUCCESS [  8.272 s]
[2019-10-01T06:01:47.598Z] [INFO] SureFire JUnit4 Runner ............................. SUCCESS [ 38.251 s]
[2019-10-01T06:01:47.598Z] [INFO] Maven Surefire Common .............................. SUCCESS [01:12 min]
[2019-10-01T06:01:47.598Z] [INFO] SureFire JUnitCore Runner .......................... SUCCESS [02:33 min]
[2019-10-01T06:01:47.598Z] [INFO] SureFire JUnit Platform Runner ..................... SUCCESS [ 12.921 s]
[2019-10-01T06:01:47.598Z] [INFO] SureFire TestNG Utils .............................. SUCCESS [  7.283 s]
[2019-10-01T06:01:47.598Z] [INFO] SureFire TestNG Runner ............................. SUCCESS [  8.008 s]
[2019-10-01T06:01:47.598Z] [INFO] ShadeFire JUnit3 Provider .......................... SUCCESS [  2.685 s]
[2019-10-01T06:01:47.598Z] [INFO] Surefire Report Parser ............................. SUCCESS [ 10.215 s]
[2019-10-01T06:01:47.598Z] [INFO] Maven Surefire Plugin .............................. SUCCESS [ 22.654 s]
[2019-10-01T06:01:47.598Z] [INFO] Maven Failsafe Plugin .............................. SUCCESS [02:37 min]
[2019-10-01T06:01:47.598Z] [INFO] Maven Surefire Report Plugin ....................... SUCCESS [ 28.432 s]
[2019-10-01T06:01:47.598Z] [INFO] Maven Surefire Integration Tests ................... FAILURE [  01:28 h]
[2019-10-01T06:01:47.598Z] [INFO] ------------------------------------------------------------------------
[2019-10-01T06:01:47.598Z] [INFO] BUILD FAILURE
[2019-10-01T06:01:47.598Z] [INFO] ------------------------------------------------------------------------
[2019-10-01T06:01:47.598Z] [INFO] Total time:  01:41 h
[2019-10-01T06:01:47.598Z] [INFO] Finished at: 2019-09-30T23:01:46-07:00
[2019-10-01T06:01:47.599Z] [INFO] ------------------------------------------------------------------------
[2019-10-01T06:01:47.599Z] [ERROR] Failed to execute goal org.apache.maven.plugins:maven-failsafe-plugin:3.0.0-M3:verify (default) on project surefire-its: There are test failures.
[2019-10-01T06:01:47.599Z] [ERROR]
[2019-10-01T06:01:47.599Z] [ERROR] Please refer to C:\Users\jenkins\AppData\Local\Temp\3\jenkins-maven-box-maven-surefire-MasterProcessChannelDecoder-9\surefire-its\target\failsafe-reports for the individual test results.
[2019-10-01T06:01:47.599Z] [ERROR] Please refer to dump files (if any exist) [date].dump, [date]-jvmRun[N].dump and [date].dumpstream.
[2019-10-01T06:01:47.599Z] [ERROR] -> [Help 1]
[2019-10-01T06:01:47.599Z] org.apache.maven.lifecycle.LifecycleExecutionException: Failed to execute goal org.apache.maven.plugins:maven-failsafe-plugin:3.0.0-M3:verify (default) on project surefire-its: There are test failures.
[2019-10-01T06:01:47.599Z]
[2019-10-01T06:01:47.599Z] Please refer to C:\Users\jenkins\AppData\Local\Temp\3\jenkins-maven-box-maven-surefire-MasterProcessChannelDecoder-9\surefire-its\target\failsafe-reports for the individual test results.
[2019-10-01T06:01:47.599Z] Please refer to dump files (if any exist) [date].dump, [date]-jvmRun[N].dump and [date].dumpstream.
[2019-10-01T06:01:47.599Z]     at org.apache.maven.lifecycle.internal.MojoExecutor.execute (MojoExecutor.java:215)
[2019-10-01T06:01:47.599Z]     at org.apache.maven.lifecycle.internal.MojoExecutor.execute (MojoExecutor.java:156)
[2019-10-01T06:01:47.599Z]     at org.apache.maven.lifecycle.internal.MojoExecutor.execute (MojoExecutor.java:148)
[2019-10-01T06:01:47.599Z]     at org.apache.maven.lifecycle.internal.LifecycleModuleBuilder.buildProject (LifecycleModuleBuilder.java:117)
[2019-10-01T06:01:47.599Z]     at org.apache.maven.lifecycle.internal.LifecycleModuleBuilder.buildProject (LifecycleModuleBuilder.java:81)
[2019-10-01T06:01:47.599Z]     at org.apache.maven.lifecycle.internal.builder.singlethreaded.SingleThreadedBuilder.build (SingleThreadedBuilder.java:56)
[2019-10-01T06:01:47.599Z]     at org.apache.maven.lifecycle.internal.LifecycleStarter.execute (LifecycleStarter.java:128)
[2019-10-01T06:01:47.599Z]     at org.apache.maven.DefaultMaven.doExecute (DefaultMaven.java:305)
[2019-10-01T06:01:47.599Z]     at org.apache.maven.DefaultMaven.doExecute (DefaultMaven.java:192)
[2019-10-01T06:01:47.599Z]     at org.apache.maven.DefaultMaven.execute (DefaultMaven.java:105)
[2019-10-01T06:01:47.599Z]     at org.apache.maven.cli.MavenCli.execute (MavenCli.java:956)
[2019-10-01T06:01:47.599Z]     at org.apache.maven.cli.MavenCli.doMain (MavenCli.java:288)
[2019-10-01T06:01:47.599Z]     at org.apache.maven.cli.MavenCli.main (MavenCli.java:192)
[2019-10-01T06:01:47.599Z]     at sun.reflect.NativeMethodAccessorImpl.invoke0 (Native Method)
[2019-10-01T06:01:47.599Z]     at sun.reflect.NativeMethodAccessorImpl.invoke (NativeMethodAccessorImpl.java:62)
[2019-10-01T06:01:47.599Z]     at sun.reflect.DelegatingMethodAccessorImpl.invoke (DelegatingMethodAccessorImpl.java:43)
[2019-10-01T06:01:47.599Z]     at java.lang.reflect.Method.invoke (Method.java:498)
[2019-10-01T06:01:47.599Z]     at org.codehaus.plexus.classworlds.launcher.Launcher.launchEnhanced (Launcher.java:282)
[2019-10-01T06:01:47.599Z]     at org.codehaus.plexus.classworlds.launcher.Launcher.launch (Launcher.java:225)
[2019-10-01T06:01:47.599Z]     at org.codehaus.plexus.classworlds.launcher.Launcher.mainWithExitCode (Launcher.java:406)
[2019-10-01T06:01:47.599Z]     at org.codehaus.plexus.classworlds.launcher.Launcher.main (Launcher.java:347)
[2019-10-01T06:01:47.599Z] Caused by: org.apache.maven.plugin.MojoFailureException: There are test failures.
[2019-10-01T06:01:47.599Z]
[2019-10-01T06:01:47.599Z] Please refer to C:\Users\jenkins\AppData\Local\Temp\3\jenkins-maven-box-maven-surefire-MasterProcessChannelDecoder-9\surefire-its\target\failsafe-reports for the individual test results.
[2019-10-01T06:01:47.599Z] Please refer to dump files (if any exist) [date].dump, [date]-jvmRun[N].dump and [date].dumpstream.
[2019-10-01T06:01:47.599Z]     at org.apache.maven.plugin.surefire.SurefireHelper.throwException (SurefireHelper.java:271)
[2019-10-01T06:01:47.599Z]     at org.apache.maven.plugin.surefire.SurefireHelper.reportExecution (SurefireHelper.java:159)
[2019-10-01T06:01:47.599Z]     at org.apache.maven.plugin.failsafe.VerifyMojo.execute (VerifyMojo.java:192)
[2019-10-01T06:01:47.599Z]     at org.apache.maven.plugin.DefaultBuildPluginManager.executeMojo (DefaultBuildPluginManager.java:137)
[2019-10-01T06:01:47.599Z]     at org.apache.maven.lifecycle.internal.MojoExecutor.execute (MojoExecutor.java:210)
[2019-10-01T06:01:47.599Z]     at org.apache.maven.lifecycle.internal.MojoExecutor.execute (MojoExecutor.java:156)
[2019-10-01T06:01:47.599Z]     at org.apache.maven.lifecycle.internal.MojoExecutor.execute (MojoExecutor.java:148)
[2019-10-01T06:01:47.599Z]     at org.apache.maven.lifecycle.internal.LifecycleModuleBuilder.buildProject (LifecycleModuleBuilder.java:117)
[2019-10-01T06:01:47.599Z]     at org.apache.maven.lifecycle.internal.LifecycleModuleBuilder.buildProject (LifecycleModuleBuilder.java:81)
[2019-10-01T06:01:47.599Z]     at org.apache.maven.lifecycle.internal.builder.singlethreaded.SingleThreadedBuilder.build (SingleThreadedBuilder.java:56)
[2019-10-01T06:01:47.599Z]     at org.apache.maven.lifecycle.internal.LifecycleStarter.execute (LifecycleStarter.java:128)
[2019-10-01T06:01:47.599Z]     at org.apache.maven.DefaultMaven.doExecute (DefaultMaven.java:305)
[2019-10-01T06:01:47.600Z]     at org.apache.maven.DefaultMaven.doExecute (DefaultMaven.java:192)
[2019-10-01T06:01:47.600Z]     at org.apache.maven.DefaultMaven.execute (DefaultMaven.java:105)
[2019-10-01T06:01:47.600Z]     at org.apache.maven.cli.MavenCli.execute (MavenCli.java:956)
[2019-10-01T06:01:47.600Z]     at org.apache.maven.cli.MavenCli.doMain (MavenCli.java:288)
[2019-10-01T06:01:47.600Z]     at org.apache.maven.cli.MavenCli.main (MavenCli.java:192)
[2019-10-01T06:01:47.600Z]     at sun.reflect.NativeMethodAccessorImpl.invoke0 (Native Method)
[2019-10-01T06:01:47.600Z]     at sun.reflect.NativeMethodAccessorImpl.invoke (NativeMethodAccessorImpl.java:62)
[2019-10-01T06:01:47.600Z]     at sun.reflect.DelegatingMethodAccessorImpl.invoke (DelegatingMethodAccessorImpl.java:43)
[2019-10-01T06:01:47.600Z]     at java.lang.reflect.Method.invoke (Method.java:498)
[2019-10-01T06:01:47.600Z]     at org.codehaus.plexus.classworlds.launcher.Launcher.launchEnhanced (Launcher.java:282)
[2019-10-01T06:01:47.600Z]     at org.codehaus.plexus.classworlds.launcher.Launcher.launch (Launcher.java:225)
[2019-10-01T06:01:47.600Z]     at org.codehaus.plexus.classworlds.launcher.Launcher.mainWithExitCode (Launcher.java:406)
[2019-10-01T06:01:47.600Z]     at org.codehaus.plexus.classworlds.launcher.Launcher.main (Launcher.java:347)
[2019-10-01T06:01:47.600Z] [ERROR]
[2019-10-01T06:01:47.600Z] [ERROR] Re-run Maven using the -X switch to enable full debug logging.
[2019-10-01T06:01:47.600Z] [ERROR]
[2019-10-01T06:01:47.600Z] [ERROR] For more information about the errors and possible solutions, please read the following articles:
[2019-10-01T06:01:47.600Z] [ERROR] [Help 1] http://cwiki.apache.org/confluence/display/MAVEN/MojoFailureException
[2019-10-01T06:01:47.600Z] [ERROR]
[2019-10-01T06:01:47.600Z] [ERROR] After correcting the problems, you can resume the build with the command
[2019-10-01T06:01:47.600Z] [ERROR]   mvn <args> -rf :surefire-its
[Pipeline] }
[Pipeline] // withEnv
[Pipeline] }
[Pipeline] // stage
[Pipeline] fileExists
[Pipeline] zip
[2019-10-01T06:01:47.769Z] Writing zip file of C:\Users\jenkins\AppData\Local\Temp\3\jenkins-maven-box-maven-surefire-MasterProcessChannelDecoder-9\maven-failsafe-plugin\target\it to C:\Users\jenkins\AppData\Local\Temp\3\jenkins-maven-box-maven-surefire-MasterProcessChannelDecoder-9\maven-failsafe-plugin--windows-jdk11-maven3.6.x.zip
[2019-10-01T06:01:47.886Z] Zipped 78 entries.
[2019-10-01T06:01:47.886Z] Archiving C:\Users\jenkins\AppData\Local\Temp\3\jenkins-maven-box-maven-surefire-MasterProcessChannelDecoder-9\maven-failsafe-plugin--windows-jdk11-maven3.6.x.zip
[2019-10-01T06:01:47.888Z] [Fast Archiver] No artifacts from Maven TLP » maven-surefire » MasterProcessChannelDecoder #1 to compare, so performing full copy of artifacts
[Pipeline] fileExists
[Pipeline] zip
[2019-10-01T06:01:47.949Z] Writing zip file of C:\Users\jenkins\AppData\Local\Temp\3\jenkins-maven-box-maven-surefire-MasterProcessChannelDecoder-9\surefire-its\target to C:\Users\jenkins\AppData\Local\Temp\3\jenkins-maven-box-maven-surefire-MasterProcessChannelDecoder-9\surefire-its--windows-jdk11-maven3.6.x.zip
[2019-10-01T06:02:03.110Z] Zipped 16375 entries.
[2019-10-01T06:02:03.110Z] Archiving C:\Users\jenkins\AppData\Local\Temp\3\jenkins-maven-box-maven-surefire-MasterProcessChannelDecoder-9\surefire-its--windows-jdk11-maven3.6.x.zip
[2019-10-01T06:02:03.111Z] [Fast Archiver] No artifacts from Maven TLP » maven-surefire » MasterProcessChannelDecoder #1 to compare, so performing full copy of artifacts
[Pipeline] archiveArtifacts
[2019-10-01T06:02:04.955Z] Archiving artifacts
[2019-10-01T06:02:04.969Z] [Fast Archiver] No artifacts from Maven TLP » maven-surefire » MasterProcessChannelDecoder #1 to compare, so performing full copy of artifacts
[Pipeline] cleanWs
[2019-10-01T06:02:06.933Z] [WS-CLEANUP] Deleting project workspace...
[2019-10-01T06:02:06.933Z] [WS-CLEANUP] Deferred wipeout is used...
[2019-10-01T06:02:07.052Z] [WS-CLEANUP] done
[Pipeline] }
[Pipeline] // ws
[Pipeline] }
[Pipeline] // timestamps
[Pipeline] }
[Pipeline] // node
[Pipeline] }
[Pipeline] // parallel
[Pipeline] echo
Build result: FAILURE
[Pipeline] jiraIssueSelector
[Pipeline] echo
The authors of changes [rfscholte].
[Pipeline] echo
Sending email ...
[Pipeline] emailext
Reply | Threaded
Open this post in threaded view
|

Build failed in Jenkins: Maven TLP » maven-surefire » MasterProcessChannelDecoder #10

Apache Jenkins Server-2
See https://builds.apache.org/job/maven-box/job/maven-surefire/job/MasterProcessChannelDecoder/10/

No changes.

1 tests failed.
FAILED:  org.apache.maven.surefire.its.JUnitPlatformEnginesIT.platform[1.5.0-SNAPSHOT]

Error Message:

Expected: (<[.*\[DEBUG\] test\(compact\) classpath:.*]> and <[.*  test-classes.*]> and <[.*  classes.*]> and <[.*junit-jupiter-engine-5\.5\.0-SNAPSHOT\.jar.*]> and <[.*apiguardian-api-1\.0\.0\.jar.*]> and <[.*junit-platform-engine-1\.5\.0-SNAPSHOT\.jar.*]> and <[.*junit-platform-commons-1\.5\.0-SNAPSHOT\.jar.*]> and <[.*opentest4j-1\.2\.0-SNAPSHOT\.jar.*]> and <[.*junit-jupiter-api-5\.5\.0-SNAPSHOT\.jar.*]>)
     but: <[.*apiguardian-api-1\.0\.0\.jar.*]> was <[[DEBUG] test(compact) classpath:  test-classes  classes  junit-jupiter-engine-5.5.0-SNAPSHOT.jar  apiguardian-api-1.1.0.jar  junit-platform-engine-1.5.0-SNAPSHOT.jar  opentest4j-1.2.0.jar  junit-platform-commons-1.5.0-SNAPSHOT.jar  junit-jupiter-api-5.5.0-SNAPSHOT.jar]>

Stack Trace:
java.lang.AssertionError:

Expected: (<[.*\[DEBUG\] test\(compact\) classpath:.*]> and <[.*  test-classes.*]> and <[.*  classes.*]> and <[.*junit-jupiter-engine-5\.5\.0-SNAPSHOT\.jar.*]> and <[.*apiguardian-api-1\.0\.0\.jar.*]> and <[.*junit-platform-engine-1\.5\.0-SNAPSHOT\.jar.*]> and <[.*junit-platform-commons-1\.5\.0-SNAPSHOT\.jar.*]> and <[.*opentest4j-1\.2\.0-SNAPSHOT\.jar.*]> and <[.*junit-jupiter-api-5\.5\.0-SNAPSHOT\.jar.*]>)
     but: <[.*apiguardian-api-1\.0\.0\.jar.*]> was <[[DEBUG] test(compact) classpath:  test-classes  classes  junit-jupiter-engine-5.5.0-SNAPSHOT.jar  apiguardian-api-1.1.0.jar  junit-platform-engine-1.5.0-SNAPSHOT.jar  opentest4j-1.2.0.jar  junit-platform-commons-1.5.0-SNAPSHOT.jar  junit-jupiter-api-5.5.0-SNAPSHOT.jar]>
        at org.apache.maven.surefire.its.JUnitPlatformEnginesIT.platform(JUnitPlatformEnginesIT.java:103)




Build log:
[...truncated 47399 lines...]
[2019-10-04T08:07:51.223Z] [INFO] Running org.apache.maven.surefire.its.jiras.Surefire1136CwdPropagationInForkedModeIT
[2019-10-04T08:07:54.484Z] [INFO] Tests run: 1, Failures: 0, Errors: 0, Skipped: 0, Time elapsed: 3.986 s - in org.apache.maven.surefire.its.jiras.Surefire1136CwdPropagationInForkedModeIT
[2019-10-04T08:07:54.484Z] [INFO] Running org.apache.maven.surefire.its.jiras.Surefire1144XmlRunTimeIT
[2019-10-04T08:08:19.083Z] [INFO] Tests run: 1, Failures: 0, Errors: 0, Skipped: 0, Time elapsed: 4.904 s - in org.apache.maven.surefire.its.jiras.Surefire1144XmlRunTimeIT
[2019-10-04T08:08:19.083Z] [INFO] Running org.apache.maven.surefire.its.jiras.Surefire1152RerunFailingTestsInSuiteIT
[2019-10-04T08:08:19.083Z] [INFO] Tests run: 2, Failures: 0, Errors: 0, Skipped: 0, Time elapsed: 9.059 s - in org.apache.maven.surefire.its.jiras.Surefire1152RerunFailingTestsInSuiteIT
[2019-10-04T08:08:19.083Z] [INFO] Running org.apache.maven.surefire.its.jiras.Surefire1153IncludesAndSpecifiedTestIT
[2019-10-04T08:08:19.083Z] [INFO] Tests run: 2, Failures: 0, Errors: 0, Skipped: 0, Time elapsed: 6.924 s - in org.apache.maven.surefire.its.jiras.Surefire1153IncludesAndSpecifiedTestIT
[2019-10-04T08:08:19.083Z] [INFO] Running org.apache.maven.surefire.its.jiras.Surefire1158RemoveInfoLinesIT
[2019-10-04T08:08:43.044Z] [INFO] Tests run: 6, Failures: 0, Errors: 0, Skipped: 0, Time elapsed: 26.618 s - in org.apache.maven.surefire.its.jiras.Surefire1158RemoveInfoLinesIT
[2019-10-04T08:08:43.044Z] [INFO] Running org.apache.maven.surefire.its.jiras.Surefire1177TestngParallelSuitesIT
[2019-10-04T08:08:54.447Z] [INFO] Tests run: 2, Failures: 0, Errors: 0, Skipped: 0, Time elapsed: 12.082 s - in org.apache.maven.surefire.its.jiras.Surefire1177TestngParallelSuitesIT
[2019-10-04T08:08:54.447Z] [INFO] Running org.apache.maven.surefire.its.jiras.Surefire1179IT
[2019-10-04T08:09:03.442Z] [INFO] Tests run: 1, Failures: 0, Errors: 0, Skipped: 0, Time elapsed: 8.3 s - in org.apache.maven.surefire.its.jiras.Surefire1179IT
[2019-10-04T08:09:03.442Z] [INFO] Running org.apache.maven.surefire.its.jiras.Surefire1185DoNotSpawnTestsIT
[2019-10-04T08:09:06.519Z] [INFO] Tests run: 1, Failures: 0, Errors: 0, Skipped: 0, Time elapsed: 3.331 s - in org.apache.maven.surefire.its.jiras.Surefire1185DoNotSpawnTestsIT
[2019-10-04T08:09:06.519Z] [INFO] Running org.apache.maven.surefire.its.jiras.Surefire1202RerunAndSkipIT
[2019-10-04T08:09:41.356Z] [INFO] Tests run: 2, Failures: 0, Errors: 0, Skipped: 0, Time elapsed: 33.804 s - in org.apache.maven.surefire.its.jiras.Surefire1202RerunAndSkipIT
[2019-10-04T08:09:41.356Z] [INFO] Running org.apache.maven.surefire.its.jiras.Surefire1209RerunAndForkCountIT
[2019-10-04T08:10:29.982Z] [INFO] Tests run: 4, Failures: 0, Errors: 0, Skipped: 0, Time elapsed: 47.983 s - in org.apache.maven.surefire.its.jiras.Surefire1209RerunAndForkCountIT
[2019-10-04T08:10:29.982Z] [INFO] Running org.apache.maven.surefire.its.jiras.Surefire1211JUnitTestNgIT
[2019-10-04T08:10:37.285Z] [INFO] Tests run: 2, Failures: 0, Errors: 0, Skipped: 0, Time elapsed: 9.593 s - in org.apache.maven.surefire.its.jiras.Surefire1211JUnitTestNgIT
[2019-10-04T08:10:37.285Z] [INFO] Running org.apache.maven.surefire.its.jiras.Surefire1264IT
[2019-10-04T08:10:49.062Z] [INFO] Tests run: 2, Failures: 0, Errors: 0, Skipped: 0, Time elapsed: 11.363 s - in org.apache.maven.surefire.its.jiras.Surefire1264IT
[2019-10-04T08:10:49.062Z] [INFO] Running org.apache.maven.surefire.its.jiras.Surefire1265Java9IT
[2019-10-04T08:10:49.062Z] [WARNING] Tests run: 1, Failures: 0, Errors: 0, Skipped: 1, Time elapsed: 0 s - in org.apache.maven.surefire.its.jiras.Surefire1265Java9IT
[2019-10-04T08:10:49.062Z] [INFO] Running org.apache.maven.surefire.its.jiras.Surefire1278GroupNameEndingIT
[2019-10-04T08:10:53.329Z] [INFO] Tests run: 1, Failures: 0, Errors: 0, Skipped: 0, Time elapsed: 4.299 s - in org.apache.maven.surefire.its.jiras.Surefire1278GroupNameEndingIT
[2019-10-04T08:10:53.329Z] [INFO] Running org.apache.maven.surefire.its.jiras.Surefire1295AttributeJvmCrashesToTestsIT
[2019-10-04T08:12:03.218Z] [INFO] Tests run: 9, Failures: 0, Errors: 0, Skipped: 0, Time elapsed: 66.222 s - in org.apache.maven.surefire.its.jiras.Surefire1295AttributeJvmCrashesToTestsIT
[2019-10-04T08:12:03.218Z] [INFO] Running org.apache.maven.surefire.its.jiras.Surefire1364SystemPropertiesIT
[2019-10-04T08:12:47.044Z] [INFO] Tests run: 10, Failures: 0, Errors: 0, Skipped: 0, Time elapsed: 47.046 s - in org.apache.maven.surefire.its.jiras.Surefire1364SystemPropertiesIT
[2019-10-04T08:12:47.044Z] [INFO] Running org.apache.maven.surefire.its.jiras.Surefire1367AssumptionLogsIT
[2019-10-04T08:13:02.559Z] [INFO] Tests run: 4, Failures: 0, Errors: 0, Skipped: 0, Time elapsed: 16.36 s - in org.apache.maven.surefire.its.jiras.Surefire1367AssumptionLogsIT
[2019-10-04T08:13:02.560Z] [INFO] Running org.apache.maven.surefire.its.jiras.Surefire1383ScanSessionDependenciesIT
[2019-10-04T08:13:10.218Z] [INFO] Tests run: 1, Failures: 0, Errors: 0, Skipped: 0, Time elapsed: 7.666 s - in org.apache.maven.surefire.its.jiras.Surefire1383ScanSessionDependenciesIT
[2019-10-04T08:13:10.218Z] [INFO] Running org.apache.maven.surefire.its.jiras.Surefire1396CustomProviderClassPathIT
[2019-10-04T08:13:21.712Z] [INFO] Tests run: 1, Failures: 0, Errors: 0, Skipped: 0, Time elapsed: 11.113 s - in org.apache.maven.surefire.its.jiras.Surefire1396CustomProviderClassPathIT
[2019-10-04T08:13:21.712Z] [INFO] Running org.apache.maven.surefire.its.jiras.Surefire141PluggableProvidersIT
[2019-10-04T08:13:45.199Z] [INFO] Tests run: 4, Failures: 0, Errors: 0, Skipped: 0, Time elapsed: 23.957 s - in org.apache.maven.surefire.its.jiras.Surefire141PluggableProvidersIT
[2019-10-04T08:13:45.199Z] [INFO] Running org.apache.maven.surefire.its.jiras.Surefire146ForkPerTestNoSetupIT
[2019-10-04T08:13:49.638Z] [INFO] Tests run: 1, Failures: 0, Errors: 0, Skipped: 0, Time elapsed: 4.165 s - in org.apache.maven.surefire.its.jiras.Surefire146ForkPerTestNoSetupIT
[2019-10-04T08:13:49.638Z] [INFO] Running org.apache.maven.surefire.its.jiras.Surefire1490ReportTitleDescriptionIT
[2019-10-04T08:14:30.134Z] [INFO] Tests run: 2, Failures: 0, Errors: 0, Skipped: 0, Time elapsed: 20.428 s - in org.apache.maven.surefire.its.jiras.Surefire1490ReportTitleDescriptionIT
[2019-10-04T08:14:30.134Z] [INFO] Running org.apache.maven.surefire.its.jiras.Surefire1534ReuseForksFalseWithJavaModuleIT
[2019-10-04T08:14:30.134Z] [WARNING] Tests run: 3, Failures: 0, Errors: 0, Skipped: 3, Time elapsed: 0.001 s - in org.apache.maven.surefire.its.jiras.Surefire1534ReuseForksFalseWithJavaModuleIT
[2019-10-04T08:14:30.134Z] [INFO] Running org.apache.maven.surefire.its.jiras.Surefire1535TestNGParallelSuitesIT
[2019-10-04T08:14:35.489Z] [INFO] Tests run: 4, Failures: 0, Errors: 0, Skipped: 0, Time elapsed: 23.462 s - in org.apache.maven.surefire.its.jiras.Surefire1535TestNGParallelSuitesIT
[2019-10-04T08:14:35.489Z] [INFO] Running org.apache.maven.surefire.its.jiras.Surefire1585IT
[2019-10-04T08:14:35.489Z] [WARNING] Tests run: 2, Failures: 0, Errors: 0, Skipped: 2, Time elapsed: 0 s - in org.apache.maven.surefire.its.jiras.Surefire1585IT
[2019-10-04T08:14:35.489Z] [INFO] Running org.apache.maven.surefire.its.jiras.Surefire162CharsetProviderIT
[2019-10-04T08:14:37.830Z] [INFO] Tests run: 1, Failures: 0, Errors: 0, Skipped: 0, Time elapsed: 3.921 s - in org.apache.maven.surefire.its.jiras.Surefire162CharsetProviderIT
[2019-10-04T08:14:37.830Z] [INFO] Running org.apache.maven.surefire.its.jiras.Surefire224WellFormedXmlFailuresIT
[2019-10-04T08:14:41.480Z] [INFO] Tests run: 1, Failures: 0, Errors: 0, Skipped: 0, Time elapsed: 3.962 s - in org.apache.maven.surefire.its.jiras.Surefire224WellFormedXmlFailuresIT
[2019-10-04T08:14:41.480Z] [INFO] Running org.apache.maven.surefire.its.jiras.Surefire257NotRerunningTestsIT
[2019-10-04T08:14:47.516Z] [INFO] Tests run: 1, Failures: 0, Errors: 0, Skipped: 0, Time elapsed: 5.558 s - in org.apache.maven.surefire.its.jiras.Surefire257NotRerunningTestsIT
[2019-10-04T08:14:47.516Z] [INFO] Running org.apache.maven.surefire.its.jiras.Surefire260TestWithIdenticalNamesIT
[2019-10-04T08:14:47.516Z] [WARNING] Tests run: 1, Failures: 0, Errors: 0, Skipped: 1, Time elapsed: 0 s - in org.apache.maven.surefire.its.jiras.Surefire260TestWithIdenticalNamesIT
[2019-10-04T08:14:47.516Z] [INFO] Running org.apache.maven.surefire.its.jiras.Surefire34SecurityManagerIT
[2019-10-04T08:14:55.813Z] [INFO] Tests run: 2, Failures: 0, Errors: 0, Skipped: 0, Time elapsed: 8.202 s - in org.apache.maven.surefire.its.jiras.Surefire34SecurityManagerIT
[2019-10-04T08:14:55.813Z] [INFO] Running org.apache.maven.surefire.its.jiras.Surefire376TestNgAfterSuiteFailureIT
[2019-10-04T08:14:59.170Z] [INFO] Tests run: 1, Failures: 0, Errors: 0, Skipped: 0, Time elapsed: 4.239 s - in org.apache.maven.surefire.its.jiras.Surefire376TestNgAfterSuiteFailureIT
[2019-10-04T08:14:59.170Z] [INFO] Running org.apache.maven.surefire.its.jiras.Surefire377TestNgAndJUnitTogetherIT
[2019-10-04T08:15:09.448Z] [INFO] Tests run: 2, Failures: 0, Errors: 0, Skipped: 0, Time elapsed: 8.009 s - in org.apache.maven.surefire.its.jiras.Surefire377TestNgAndJUnitTogetherIT
[2019-10-04T08:15:09.448Z] [INFO] Running org.apache.maven.surefire.its.jiras.Surefire408ManualProviderSelectionIT
[2019-10-04T08:15:11.947Z] [INFO] Tests run: 1, Failures: 0, Errors: 0, Skipped: 0, Time elapsed: 4.147 s - in org.apache.maven.surefire.its.jiras.Surefire408ManualProviderSelectionIT
[2019-10-04T08:15:11.947Z] [INFO] Running org.apache.maven.surefire.its.jiras.Surefire42NotExtendingTestCaseIT
[2019-10-04T08:15:16.720Z] [INFO] Tests run: 1, Failures: 0, Errors: 0, Skipped: 0, Time elapsed: 4.091 s - in org.apache.maven.surefire.its.jiras.Surefire42NotExtendingTestCaseIT
[2019-10-04T08:15:16.720Z] [INFO] Running org.apache.maven.surefire.its.jiras.Surefire44InnerClassTestIT
[2019-10-04T08:15:21.444Z] [INFO] Tests run: 1, Failures: 0, Errors: 0, Skipped: 0, Time elapsed: 4.062 s - in org.apache.maven.surefire.its.jiras.Surefire44InnerClassTestIT
[2019-10-04T08:15:21.444Z] [INFO] Running org.apache.maven.surefire.its.jiras.Surefire500PuzzlingErrorIT
[2019-10-04T08:15:23.835Z] [INFO] Tests run: 1, Failures: 0, Errors: 0, Skipped: 0, Time elapsed: 4.22 s - in org.apache.maven.surefire.its.jiras.Surefire500PuzzlingErrorIT
[2019-10-04T08:15:23.835Z] [INFO] Running org.apache.maven.surefire.its.jiras.Surefire510TestClassPathForkModesIT
[2019-10-04T08:15:33.328Z] [INFO] Tests run: 2, Failures: 0, Errors: 0, Skipped: 0, Time elapsed: 8.211 s - in org.apache.maven.surefire.its.jiras.Surefire510TestClassPathForkModesIT
[2019-10-04T08:15:33.328Z] [INFO] Running org.apache.maven.surefire.its.jiras.Surefire569RunTestFromDependencyJarsIT
[2019-10-04T08:15:36.596Z] [INFO] Tests run: 1, Failures: 0, Errors: 0, Skipped: 0, Time elapsed: 3.858 s - in org.apache.maven.surefire.its.jiras.Surefire569RunTestFromDependencyJarsIT
[2019-10-04T08:15:36.596Z] [INFO] Running org.apache.maven.surefire.its.jiras.Surefire570MultipleReportDirectoriesIT
[2019-10-04T08:16:00.463Z] [INFO] Tests run: 2, Failures: 0, Errors: 0, Skipped: 0, Time elapsed: 21.633 s - in org.apache.maven.surefire.its.jiras.Surefire570MultipleReportDirectoriesIT
[2019-10-04T08:16:00.463Z] [INFO] Running org.apache.maven.surefire.its.jiras.Surefire613TestCountInParallelIT
[2019-10-04T08:16:02.928Z] [INFO] Tests run: 1, Failures: 0, Errors: 0, Skipped: 0, Time elapsed: 4.939 s - in org.apache.maven.surefire.its.jiras.Surefire613TestCountInParallelIT
[2019-10-04T08:16:02.928Z] [INFO] Running org.apache.maven.surefire.its.jiras.Surefire621TestCountingJunit3InParallelIT
[2019-10-04T08:16:30.298Z] [INFO] Tests run: 5, Failures: 0, Errors: 0, Skipped: 0, Time elapsed: 24.244 s - in org.apache.maven.surefire.its.jiras.Surefire621TestCountingJunit3InParallelIT
[2019-10-04T08:16:30.298Z] [INFO] Running org.apache.maven.surefire.its.jiras.Surefire628ConsoleOutputBeforeAndAfterClassIT
[2019-10-04T08:16:31.298Z] [INFO] Tests run: 1, Failures: 0, Errors: 0, Skipped: 0, Time elapsed: 4.634 s - in org.apache.maven.surefire.its.jiras.Surefire628ConsoleOutputBeforeAndAfterClassIT
[2019-10-04T08:16:31.298Z] [INFO] Running org.apache.maven.surefire.its.jiras.Surefire634UnsettableSystemPropertiesWarningIT
[2019-10-04T08:16:35.715Z] [INFO] Tests run: 1, Failures: 0, Errors: 0, Skipped: 0, Time elapsed: 4.279 s - in org.apache.maven.surefire.its.jiras.Surefire634UnsettableSystemPropertiesWarningIT
[2019-10-04T08:16:35.715Z] [INFO] Running org.apache.maven.surefire.its.jiras.Surefire649EmptyStringSystemPropertiesIT
[2019-10-04T08:16:42.642Z] [INFO] Tests run: 2, Failures: 0, Errors: 0, Skipped: 0, Time elapsed: 6.704 s - in org.apache.maven.surefire.its.jiras.Surefire649EmptyStringSystemPropertiesIT
[2019-10-04T08:16:42.642Z] [INFO] Running org.apache.maven.surefire.its.jiras.Surefire673MockitoIT
[2019-10-04T08:16:47.912Z] [INFO] Tests run: 1, Failures: 0, Errors: 0, Skipped: 0, Time elapsed: 5.103 s - in org.apache.maven.surefire.its.jiras.Surefire673MockitoIT
[2019-10-04T08:16:47.912Z] [INFO] Running org.apache.maven.surefire.its.jiras.Surefire674BuildFailingWhenErrorsIT
[2019-10-04T08:16:51.497Z] [INFO] Tests run: 1, Failures: 0, Errors: 0, Skipped: 0, Time elapsed: 4.066 s - in org.apache.maven.surefire.its.jiras.Surefire674BuildFailingWhenErrorsIT
[2019-10-04T08:16:51.497Z] [INFO] Running org.apache.maven.surefire.its.jiras.Surefire674BuildFailingWhenFailsafeErrorsIT
[2019-10-04T08:16:58.027Z] [INFO] Tests run: 1, Failures: 0, Errors: 0, Skipped: 0, Time elapsed: 6.026 s - in org.apache.maven.surefire.its.jiras.Surefire674BuildFailingWhenFailsafeErrorsIT
[2019-10-04T08:16:58.027Z] [INFO] Running org.apache.maven.surefire.its.jiras.Surefire685CommaSeparatedIncludesIT
[2019-10-04T08:17:02.290Z] [INFO] Tests run: 1, Failures: 0, Errors: 0, Skipped: 0, Time elapsed: 4.046 s - in org.apache.maven.surefire.its.jiras.Surefire685CommaSeparatedIncludesIT
[2019-10-04T08:17:02.290Z] [INFO] Running org.apache.maven.surefire.its.jiras.Surefire697NiceSummaryIT
[2019-10-04T08:17:24.227Z] [INFO] Tests run: 1, Failures: 0, Errors: 0, Skipped: 0, Time elapsed: 4.184 s - in org.apache.maven.surefire.its.jiras.Surefire697NiceSummaryIT
[2019-10-04T08:17:24.227Z] [INFO] Running org.apache.maven.surefire.its.jiras.Surefire705ParallelForkTimeoutIT
[2019-10-04T08:17:24.227Z] [INFO] Tests run: 1, Failures: 0, Errors: 0, Skipped: 0, Time elapsed: 6.489 s - in org.apache.maven.surefire.its.jiras.Surefire705ParallelForkTimeoutIT
[2019-10-04T08:17:24.227Z] [INFO] Running org.apache.maven.surefire.its.jiras.Surefire733AllOverrridesCapturedIT
[2019-10-04T08:17:24.227Z] [INFO] Tests run: 1, Failures: 0, Errors: 0, Skipped: 0, Time elapsed: 4.094 s - in org.apache.maven.surefire.its.jiras.Surefire733AllOverrridesCapturedIT
[2019-10-04T08:17:24.227Z] [INFO] Running org.apache.maven.surefire.its.jiras.Surefire735ForkFailWithRedirectConsoleOutputIT
[2019-10-04T08:17:24.227Z] [INFO] Tests run: 2, Failures: 0, Errors: 0, Skipped: 0, Time elapsed: 6.77 s - in org.apache.maven.surefire.its.jiras.Surefire735ForkFailWithRedirectConsoleOutputIT
[2019-10-04T08:17:24.227Z] [INFO] Running org.apache.maven.surefire.its.jiras.Surefire740TruncatedCommaIT
[2019-10-04T08:17:28.877Z] [INFO] Tests run: 1, Failures: 0, Errors: 0, Skipped: 0, Time elapsed: 5.101 s - in org.apache.maven.surefire.its.jiras.Surefire740TruncatedCommaIT
[2019-10-04T08:17:28.877Z] [INFO] Running org.apache.maven.surefire.its.jiras.Surefire747MethodParallelWithSuiteCountIT
[2019-10-04T08:17:50.372Z] [INFO] Tests run: 2, Failures: 0, Errors: 0, Skipped: 0, Time elapsed: 19.51 s - in org.apache.maven.surefire.its.jiras.Surefire747MethodParallelWithSuiteCountIT
[2019-10-04T08:17:50.372Z] [INFO] Running org.apache.maven.surefire.its.jiras.Surefire772BothReportsIT
[2019-10-04T08:17:56.890Z] [INFO] Tests run: 3, Failures: 0, Errors: 0, Skipped: 0, Time elapsed: 8.104 s - in org.apache.maven.surefire.its.jiras.Surefire772BothReportsIT
[2019-10-04T08:17:56.890Z] [INFO] Running org.apache.maven.surefire.its.jiras.Surefire772NoFailsafeReportsIT
[2019-10-04T08:18:08.411Z] [INFO] Tests run: 4, Failures: 0, Errors: 0, Skipped: 0, Time elapsed: 10.856 s - in org.apache.maven.surefire.its.jiras.Surefire772NoFailsafeReportsIT
[2019-10-04T08:18:08.411Z] [INFO] Running org.apache.maven.surefire.its.jiras.Surefire772NoSurefireReportsIT
[2019-10-04T08:18:19.597Z] [INFO] Tests run: 4, Failures: 0, Errors: 0, Skipped: 0, Time elapsed: 11.231 s - in org.apache.maven.surefire.its.jiras.Surefire772NoSurefireReportsIT
[2019-10-04T08:18:19.597Z] [INFO] Running org.apache.maven.surefire.its.jiras.Surefire772SpecifiedReportsIT
[2019-10-04T08:18:27.458Z] [INFO] Tests run: 3, Failures: 0, Errors: 0, Skipped: 0, Time elapsed: 8.495 s - in org.apache.maven.surefire.its.jiras.Surefire772SpecifiedReportsIT
[2019-10-04T08:18:27.458Z] [INFO] Running org.apache.maven.surefire.its.jiras.Surefire801ForkModeNoneClassLoaderIT
[2019-10-04T08:18:30.682Z] [INFO] Tests run: 1, Failures: 0, Errors: 0, Skipped: 0, Time elapsed: 3.322 s - in org.apache.maven.surefire.its.jiras.Surefire801ForkModeNoneClassLoaderIT
[2019-10-04T08:18:30.682Z] [INFO] Running org.apache.maven.surefire.its.jiras.Surefire803MultiFailsafeExecsIT
[2019-10-04T08:18:44.374Z] [INFO] Tests run: 2, Failures: 0, Errors: 0, Skipped: 0, Time elapsed: 14.226 s - in org.apache.maven.surefire.its.jiras.Surefire803MultiFailsafeExecsIT
[2019-10-04T08:18:44.374Z] [INFO] Running org.apache.maven.surefire.its.jiras.Surefire806SpecifiedTestControlsIT
[2019-10-04T08:18:48.248Z] [WARNING] Tests run: 3, Failures: 0, Errors: 0, Skipped: 2, Time elapsed: 3.84 s - in org.apache.maven.surefire.its.jiras.Surefire806SpecifiedTestControlsIT
[2019-10-04T08:18:48.248Z] [INFO] Running org.apache.maven.surefire.its.jiras.Surefire809GroupExpressionsIT
[2019-10-04T08:19:13.823Z] [INFO] Tests run: 6, Failures: 0, Errors: 0, Skipped: 0, Time elapsed: 25.599 s - in org.apache.maven.surefire.its.jiras.Surefire809GroupExpressionsIT
[2019-10-04T08:19:13.823Z] [INFO] Running org.apache.maven.surefire.its.jiras.Surefire812Log4JClassLoaderIT
[2019-10-04T08:19:20.453Z] [INFO] Tests run: 1, Failures: 0, Errors: 0, Skipped: 0, Time elapsed: 4.981 s - in org.apache.maven.surefire.its.jiras.Surefire812Log4JClassLoaderIT
[2019-10-04T08:19:20.453Z] [INFO] Running org.apache.maven.surefire.its.jiras.Surefire817SystemExitIT
[2019-10-04T08:19:23.730Z] [INFO] Tests run: 1, Failures: 0, Errors: 0, Skipped: 0, Time elapsed: 4.579 s - in org.apache.maven.surefire.its.jiras.Surefire817SystemExitIT
[2019-10-04T08:19:23.730Z] [INFO] Running org.apache.maven.surefire.its.jiras.Surefire818NpeIgnoresTestsIT
[2019-10-04T08:19:28.226Z] [INFO] Tests run: 1, Failures: 0, Errors: 0, Skipped: 0, Time elapsed: 4.716 s - in org.apache.maven.surefire.its.jiras.Surefire818NpeIgnoresTestsIT
[2019-10-04T08:19:28.226Z] [INFO] Running org.apache.maven.surefire.its.jiras.Surefire828EmptyGroupExprIT
[2019-10-04T08:19:47.708Z] [INFO] Tests run: 4, Failures: 0, Errors: 0, Skipped: 0, Time elapsed: 17.799 s - in org.apache.maven.surefire.its.jiras.Surefire828EmptyGroupExprIT
[2019-10-04T08:19:47.708Z] [INFO] Running org.apache.maven.surefire.its.jiras.Surefire832ProviderSelectionIT
[2019-10-04T08:19:50.705Z] [INFO] Tests run: 1, Failures: 0, Errors: 0, Skipped: 0, Time elapsed: 4.723 s - in org.apache.maven.surefire.its.jiras.Surefire832ProviderSelectionIT
[2019-10-04T08:19:50.705Z] [INFO] Running org.apache.maven.surefire.its.jiras.Surefire839TestWithoutCategoriesIT
[2019-10-04T08:20:21.586Z] [INFO] Tests run: 2, Failures: 0, Errors: 0, Skipped: 0, Time elapsed: 9.188 s - in org.apache.maven.surefire.its.jiras.Surefire839TestWithoutCategoriesIT
[2019-10-04T08:20:21.586Z] [INFO] Running org.apache.maven.surefire.its.jiras.Surefire847AdditionalFailureIT
[2019-10-04T08:20:21.587Z] [INFO] Tests run: 1, Failures: 0, Errors: 0, Skipped: 0, Time elapsed: 5.234 s - in org.apache.maven.surefire.its.jiras.Surefire847AdditionalFailureIT
[2019-10-04T08:20:21.587Z] [INFO] Running org.apache.maven.surefire.its.jiras.Surefire855AllowFailsafeUseArtifactFileIT
[2019-10-04T08:20:40.088Z] [INFO] Tests run: 4, Failures: 0, Errors: 0, Skipped: 0, Time elapsed: 34.339 s - in org.apache.maven.surefire.its.jiras.Surefire855AllowFailsafeUseArtifactFileIT
[2019-10-04T08:20:40.088Z] [INFO] Running org.apache.maven.surefire.its.jiras.Surefire901MIssingResultfileWhenNoTestsIT
[2019-10-04T08:20:42.502Z] [INFO] Tests run: 1, Failures: 0, Errors: 0, Skipped: 0, Time elapsed: 3.331 s - in org.apache.maven.surefire.its.jiras.Surefire901MIssingResultfileWhenNoTestsIT
[2019-10-04T08:20:42.502Z] [INFO] Running org.apache.maven.surefire.its.jiras.Surefire907PerThreadWithoutThreadCountIT
[2019-10-04T08:20:45.694Z] [INFO] Tests run: 1, Failures: 0, Errors: 0, Skipped: 0, Time elapsed: 2.977 s - in org.apache.maven.surefire.its.jiras.Surefire907PerThreadWithoutThreadCountIT
[2019-10-04T08:20:45.694Z] [INFO] Running org.apache.maven.surefire.its.jiras.Surefire920TestFailureIgnoreWithTimeoutIT
[2019-10-04T08:20:56.318Z] [INFO] Tests run: 2, Failures: 0, Errors: 0, Skipped: 0, Time elapsed: 10.396 s - in org.apache.maven.surefire.its.jiras.Surefire920TestFailureIgnoreWithTimeoutIT
[2019-10-04T08:20:56.318Z] [INFO] Running org.apache.maven.surefire.its.jiras.Surefire926FailureWith2ProvidersIT
[2019-10-04T08:21:02.906Z] [INFO] Tests run: 1, Failures: 0, Errors: 0, Skipped: 0, Time elapsed: 6.555 s - in org.apache.maven.surefire.its.jiras.Surefire926FailureWith2ProvidersIT
[2019-10-04T08:21:02.906Z] [INFO] Running org.apache.maven.surefire.its.jiras.Surefire930TestNgSuiteXmlIT
[2019-10-04T08:21:08.292Z] [INFO] Tests run: 1, Failures: 0, Errors: 0, Skipped: 0, Time elapsed: 4.787 s - in org.apache.maven.surefire.its.jiras.Surefire930TestNgSuiteXmlIT
[2019-10-04T08:21:08.292Z] [INFO] Running org.apache.maven.surefire.its.jiras.Surefire943ReportContentIT
[2019-10-04T08:21:29.892Z] [INFO] Tests run: 2, Failures: 0, Errors: 0, Skipped: 0, Time elapsed: 22.615 s - in org.apache.maven.surefire.its.jiras.Surefire943ReportContentIT
[2019-10-04T08:21:29.892Z] [INFO] Running org.apache.maven.surefire.its.jiras.Surefire946KillMainProcessInReusableForkIT
[2019-10-04T08:21:52.858Z] [INFO] Tests run: 3, Failures: 0, Errors: 0, Skipped: 0, Time elapsed: 21.574 s - in org.apache.maven.surefire.its.jiras.Surefire946KillMainProcessInReusableForkIT
[2019-10-04T08:21:52.858Z] [INFO] Running org.apache.maven.surefire.its.jiras.Surefire972BizarreNoClassDefIT
[2019-10-04T08:21:59.360Z] [INFO] Tests run: 1, Failures: 0, Errors: 0, Skipped: 0, Time elapsed: 6.755 s - in org.apache.maven.surefire.its.jiras.Surefire972BizarreNoClassDefIT
[2019-10-04T08:21:59.360Z] [INFO] Running org.apache.maven.surefire.its.jiras.Surefire975DefaultVMEncodingIT
[2019-10-04T08:22:05.093Z] [INFO] Tests run: 1, Failures: 0, Errors: 0, Skipped: 0, Time elapsed: 5.932 s - in org.apache.maven.surefire.its.jiras.Surefire975DefaultVMEncodingIT
[2019-10-04T08:22:05.093Z] [INFO] Running org.apache.maven.surefire.its.jiras.Surefire979WrongClassLoaderIT
[2019-10-04T08:22:09.305Z] [INFO] Tests run: 1, Failures: 0, Errors: 0, Skipped: 0, Time elapsed: 4.168 s - in org.apache.maven.surefire.its.jiras.Surefire979WrongClassLoaderIT
[2019-10-04T08:22:09.305Z] [INFO] Running org.apache.maven.surefire.its.jiras.Surefire985ParameterizedRunnerAndCategoriesIT
[2019-10-04T08:22:12.580Z] [INFO] Tests run: 1, Failures: 0, Errors: 0, Skipped: 0, Time elapsed: 3.896 s - in org.apache.maven.surefire.its.jiras.Surefire985ParameterizedRunnerAndCategoriesIT
[2019-10-04T08:22:12.580Z] [INFO] Running org.apache.maven.surefire.its.jiras.Surefire995CategoryInheritanceIT
[2019-10-04T08:22:31.359Z] [INFO] Tests run: 5, Failures: 0, Errors: 0, Skipped: 0, Time elapsed: 18.514 s - in org.apache.maven.surefire.its.jiras.Surefire995CategoryInheritanceIT
[2019-10-04T08:22:31.359Z] [INFO]
[2019-10-04T08:22:31.359Z] [INFO] Results:
[2019-10-04T08:22:31.359Z] [INFO]
[2019-10-04T08:22:31.359Z] [WARNING] Tests run: 796, Failures: 0, Errors: 0, Skipped: 167
[2019-10-04T08:22:31.359Z] [INFO]
[2019-10-04T08:22:31.359Z] [INFO]
[2019-10-04T08:22:31.359Z] [INFO] --- maven-checkstyle-plugin:3.0.0:check (checkstyle-check) @ surefire-its ---
[2019-10-04T08:22:32.138Z] [INFO]
[2019-10-04T08:22:32.138Z] [INFO] --- maven-failsafe-plugin:3.0.0-M3:verify (default) @ surefire-its ---
[2019-10-04T08:22:32.138Z] [INFO] Failsafe report directory: /home/jenkins/jenkins-slave/workspace/fire_MasterProcessChannelDecoder@2/surefire-its/target/failsafe-reports
[2019-10-04T08:22:32.138Z] [INFO]
[2019-10-04T08:22:32.138Z] [INFO] --- maven-install-plugin:2.5.2:install (default-install) @ surefire-its ---
[2019-10-04T08:22:32.138Z] [INFO] Skipping artifact installation
[2019-10-04T08:22:32.138Z] [INFO] ------------------------------------------------------------------------
[2019-10-04T08:22:32.138Z] [INFO] Reactor Summary for Apache Maven Surefire 3.0.0-SNAPSHOT:
[2019-10-04T08:22:32.138Z] [INFO]
[2019-10-04T08:22:32.138Z] [INFO] Apache Maven Surefire .............................. SUCCESS [ 17.198 s]
[2019-10-04T08:22:32.138Z] [INFO] SureFire Logger API ................................ SUCCESS [  8.568 s]
[2019-10-04T08:22:32.138Z] [INFO] SureFire API ....................................... SUCCESS [  9.314 s]
[2019-10-04T08:22:32.138Z] [INFO] Surefire Extensions API ............................ SUCCESS [  2.045 s]
[2019-10-04T08:22:32.138Z] [INFO] SureFire Booter .................................... SUCCESS [  9.268 s]
[2019-10-04T08:22:32.138Z] [INFO] Maven Surefire Test-Grouping Support ............... SUCCESS [  5.061 s]
[2019-10-04T08:22:32.138Z] [INFO] SureFire Providers ................................. SUCCESS [  0.906 s]
[2019-10-04T08:22:32.138Z] [INFO] Shared JUnit3 Provider Code ........................ SUCCESS [  3.143 s]
[2019-10-04T08:22:32.138Z] [INFO] Shared Java 5 Provider Base ........................ SUCCESS [  3.830 s]
[2019-10-04T08:22:32.138Z] [INFO] Shared JUnit4 Provider Code ........................ SUCCESS [  4.110 s]
[2019-10-04T08:22:32.138Z] [INFO] Shared JUnit48 Provider Code ....................... SUCCESS [  4.686 s]
[2019-10-04T08:22:32.138Z] [INFO] SureFire JUnit Runner .............................. SUCCESS [  3.446 s]
[2019-10-04T08:22:32.138Z] [INFO] SureFire JUnit4 Runner ............................. SUCCESS [ 13.257 s]
[2019-10-04T08:22:32.138Z] [INFO] Maven Surefire Common .............................. SUCCESS [ 31.143 s]
[2019-10-04T08:22:32.138Z] [INFO] SureFire JUnitCore Runner .......................... SUCCESS [02:11 min]
[2019-10-04T08:22:32.138Z] [INFO] SureFire JUnit Platform Runner ..................... SUCCESS [  8.466 s]
[2019-10-04T08:22:32.138Z] [INFO] SureFire TestNG Utils .............................. SUCCESS [  3.593 s]
[2019-10-04T08:22:32.138Z] [INFO] SureFire TestNG Runner ............................. SUCCESS [  4.063 s]
[2019-10-04T08:22:32.138Z] [INFO] ShadeFire JUnit3 Provider .......................... SUCCESS [  1.491 s]
[2019-10-04T08:22:32.138Z] [INFO] Surefire Report Parser ............................. SUCCESS [  4.802 s]
[2019-10-04T08:22:32.138Z] [INFO] Maven Surefire Plugin .............................. SUCCESS [  8.424 s]
[2019-10-04T08:22:32.138Z] [INFO] Maven Failsafe Plugin .............................. SUCCESS [01:00 min]
[2019-10-04T08:22:32.138Z] [INFO] Maven Surefire Report Plugin ....................... SUCCESS [ 12.359 s]
[2019-10-04T08:22:32.138Z] [INFO] Maven Surefire Integration Tests ................... SUCCESS [57:24 min]
[2019-10-04T08:22:32.138Z] [INFO] ------------------------------------------------------------------------
[2019-10-04T08:22:32.138Z] [INFO] BUILD SUCCESS
[2019-10-04T08:22:32.138Z] [INFO] ------------------------------------------------------------------------
[2019-10-04T08:22:32.138Z] [INFO] Total time:  01:03 h
[2019-10-04T08:22:32.138Z] [INFO] Finished at: 2019-10-04T08:22:18Z
[2019-10-04T08:22:32.138Z] [INFO] ------------------------------------------------------------------------
[Pipeline] }
[Pipeline] // withEnv
[Pipeline] }
[Pipeline] // stage
[Pipeline] fileExists
[Pipeline] zip
[2019-10-04T08:22:33.691Z] Writing zip file of /home/jenkins/jenkins-slave/workspace/fire_MasterProcessChannelDecoder@2/maven-failsafe-plugin/target/it to /home/jenkins/jenkins-slave/workspace/fire_MasterProcessChannelDecoder@2/maven-failsafe-plugin--linux-jdk7-maven3.6.x.zip
[2019-10-04T08:22:33.870Z] Zipped 78 entries.
[2019-10-04T08:22:33.870Z] Archiving /home/jenkins/jenkins-slave/workspace/fire_MasterProcessChannelDecoder@2/maven-failsafe-plugin--linux-jdk7-maven3.6.x.zip
[2019-10-04T08:22:33.871Z] [Fast Archiver] No artifacts from Maven TLP » maven-surefire » MasterProcessChannelDecoder #1 to compare, so performing full copy of artifacts
[Pipeline] fileExists
[Pipeline] zip
[2019-10-04T08:22:35.204Z] Writing zip file of /home/jenkins/jenkins-slave/workspace/fire_MasterProcessChannelDecoder@2/surefire-its/target to /home/jenkins/jenkins-slave/workspace/fire_MasterProcessChannelDecoder@2/surefire-its--linux-jdk7-maven3.6.x.zip
[2019-10-04T08:22:41.820Z] Zipped 16931 entries.
[2019-10-04T08:22:41.820Z] Archiving /home/jenkins/jenkins-slave/workspace/fire_MasterProcessChannelDecoder@2/surefire-its--linux-jdk7-maven3.6.x.zip
[2019-10-04T08:22:41.820Z] [Fast Archiver] No artifacts from Maven TLP » maven-surefire » MasterProcessChannelDecoder #1 to compare, so performing full copy of artifacts
[Pipeline] archiveArtifacts
[2019-10-04T08:22:45.649Z] Archiving artifacts
[2019-10-04T08:22:45.988Z] [Fast Archiver] No artifacts from Maven TLP » maven-surefire » MasterProcessChannelDecoder #1 to compare, so performing full copy of artifacts
[Pipeline] cleanWs
[2019-10-04T08:22:50.069Z] [WS-CLEANUP] Deleting project workspace...
[2019-10-04T08:22:50.069Z] [WS-CLEANUP] Deferred wipeout is used...
[2019-10-04T08:22:50.405Z] [WS-CLEANUP] done
[Pipeline] }
[Pipeline] // ws
[Pipeline] }
[Pipeline] // timestamps
[Pipeline] }
[Pipeline] // node
[Pipeline] }
[Pipeline] // parallel
[Pipeline] echo
Build result: FAILURE
[Pipeline] jiraIssueSelector
[Pipeline] echo
The authors of changes [].
[Pipeline] echo
Sending email ...
[Pipeline] emailext
Reply | Threaded
Open this post in threaded view
|

Build failed in Jenkins: Maven TLP » maven-surefire » MasterProcessChannelDecoder #11

Apache Jenkins Server-2
See https://builds.apache.org/job/maven-box/job/maven-surefire/job/MasterProcessChannelDecoder/11/

Changes:

* [INFRA-19273] Maven 3.6.0 dropped, update to 3.6.2

1 tests failed.
FAILED:  org.apache.maven.surefire.its.JUnitPlatformEnginesIT.platform[1.5.0-SNAPSHOT]

Error Message:

Expected: (<[.*\[DEBUG\] test\(compact\) classpath:.*]> and <[.*  test-classes.*]> and <[.*  classes.*]> and <[.*junit-jupiter-engine-5\.5\.0-SNAPSHOT\.jar.*]> and <[.*apiguardian-api-1\.0\.0\.jar.*]> and <[.*junit-platform-engine-1\.5\.0-SNAPSHOT\.jar.*]> and <[.*junit-platform-commons-1\.5\.0-SNAPSHOT\.jar.*]> and <[.*opentest4j-1\.2\.0-SNAPSHOT\.jar.*]> and <[.*junit-jupiter-api-5\.5\.0-SNAPSHOT\.jar.*]>)
     but: <[.*apiguardian-api-1\.0\.0\.jar.*]> was <[[DEBUG] test(compact) classpath:  test-classes  classes  junit-jupiter-engine-5.5.0-SNAPSHOT.jar  apiguardian-api-1.1.0.jar  junit-platform-engine-1.5.0-SNAPSHOT.jar  opentest4j-1.2.0.jar  junit-platform-commons-1.5.0-SNAPSHOT.jar  junit-jupiter-api-5.5.0-SNAPSHOT.jar]>

Stack Trace:
java.lang.AssertionError:

Expected: (<[.*\[DEBUG\] test\(compact\) classpath:.*]> and <[.*  test-classes.*]> and <[.*  classes.*]> and <[.*junit-jupiter-engine-5\.5\.0-SNAPSHOT\.jar.*]> and <[.*apiguardian-api-1\.0\.0\.jar.*]> and <[.*junit-platform-engine-1\.5\.0-SNAPSHOT\.jar.*]> and <[.*junit-platform-commons-1\.5\.0-SNAPSHOT\.jar.*]> and <[.*opentest4j-1\.2\.0-SNAPSHOT\.jar.*]> and <[.*junit-jupiter-api-5\.5\.0-SNAPSHOT\.jar.*]>)
     but: <[.*apiguardian-api-1\.0\.0\.jar.*]> was <[[DEBUG] test(compact) classpath:  test-classes  classes  junit-jupiter-engine-5.5.0-SNAPSHOT.jar  apiguardian-api-1.1.0.jar  junit-platform-engine-1.5.0-SNAPSHOT.jar  opentest4j-1.2.0.jar  junit-platform-commons-1.5.0-SNAPSHOT.jar  junit-jupiter-api-5.5.0-SNAPSHOT.jar]>
        at org.apache.maven.surefire.its.JUnitPlatformEnginesIT.platform(JUnitPlatformEnginesIT.java:103)




Build log:
[...truncated 46612 lines...]
[2019-10-26T15:46:50.764Z] [INFO] Running org.apache.maven.surefire.its.jiras.Surefire1136CwdPropagationInForkedModeIT
[2019-10-26T15:46:54.125Z] [INFO] Tests run: 1, Failures: 0, Errors: 0, Skipped: 0, Time elapsed: 4.907 s - in org.apache.maven.surefire.its.jiras.Surefire1136CwdPropagationInForkedModeIT
[2019-10-26T15:46:54.125Z] [INFO] Running org.apache.maven.surefire.its.jiras.Surefire1144XmlRunTimeIT
[2019-10-26T15:46:59.481Z] [INFO] Tests run: 1, Failures: 0, Errors: 0, Skipped: 0, Time elapsed: 4.847 s - in org.apache.maven.surefire.its.jiras.Surefire1144XmlRunTimeIT
[2019-10-26T15:46:59.481Z] [INFO] Running org.apache.maven.surefire.its.jiras.Surefire1152RerunFailingTestsInSuiteIT
[2019-10-26T15:47:11.817Z] [INFO] Tests run: 2, Failures: 0, Errors: 0, Skipped: 0, Time elapsed: 11.837 s - in org.apache.maven.surefire.its.jiras.Surefire1152RerunFailingTestsInSuiteIT
[2019-10-26T15:47:11.817Z] [INFO] Running org.apache.maven.surefire.its.jiras.Surefire1153IncludesAndSpecifiedTestIT
[2019-10-26T15:47:18.490Z] [INFO] Tests run: 2, Failures: 0, Errors: 0, Skipped: 0, Time elapsed: 7.663 s - in org.apache.maven.surefire.its.jiras.Surefire1153IncludesAndSpecifiedTestIT
[2019-10-26T15:47:18.490Z] [INFO] Running org.apache.maven.surefire.its.jiras.Surefire1158RemoveInfoLinesIT
[2019-10-26T15:47:57.394Z] [INFO] Tests run: 6, Failures: 0, Errors: 0, Skipped: 0, Time elapsed: 32.737 s - in org.apache.maven.surefire.its.jiras.Surefire1158RemoveInfoLinesIT
[2019-10-26T15:47:57.394Z] [INFO] Running org.apache.maven.surefire.its.jiras.Surefire1177TestngParallelSuitesIT
[2019-10-26T15:48:05.631Z] [INFO] Tests run: 2, Failures: 0, Errors: 0, Skipped: 0, Time elapsed: 14.476 s - in org.apache.maven.surefire.its.jiras.Surefire1177TestngParallelSuitesIT
[2019-10-26T15:48:05.631Z] [INFO] Running org.apache.maven.surefire.its.jiras.Surefire1179IT
[2019-10-26T15:48:15.748Z] [INFO] Tests run: 1, Failures: 0, Errors: 0, Skipped: 0, Time elapsed: 9.158 s - in org.apache.maven.surefire.its.jiras.Surefire1179IT
[2019-10-26T15:48:15.748Z] [INFO] Running org.apache.maven.surefire.its.jiras.Surefire1185DoNotSpawnTestsIT
[2019-10-26T15:48:19.107Z] [INFO] Tests run: 1, Failures: 0, Errors: 0, Skipped: 0, Time elapsed: 3.701 s - in org.apache.maven.surefire.its.jiras.Surefire1185DoNotSpawnTestsIT
[2019-10-26T15:48:19.107Z] [INFO] Running org.apache.maven.surefire.its.jiras.Surefire1202RerunAndSkipIT
[2019-10-26T15:48:58.017Z] [INFO] Tests run: 2, Failures: 0, Errors: 0, Skipped: 0, Time elapsed: 35.744 s - in org.apache.maven.surefire.its.jiras.Surefire1202RerunAndSkipIT
[2019-10-26T15:48:58.017Z] [INFO] Running org.apache.maven.surefire.its.jiras.Surefire1209RerunAndForkCountIT
[2019-10-26T15:49:54.460Z] [INFO] Tests run: 4, Failures: 0, Errors: 0, Skipped: 0, Time elapsed: 53.186 s - in org.apache.maven.surefire.its.jiras.Surefire1209RerunAndForkCountIT
[2019-10-26T15:49:54.461Z] [INFO] Running org.apache.maven.surefire.its.jiras.Surefire1211JUnitTestNgIT
[2019-10-26T15:50:02.696Z] [INFO] Tests run: 2, Failures: 0, Errors: 0, Skipped: 0, Time elapsed: 14.34 s - in org.apache.maven.surefire.its.jiras.Surefire1211JUnitTestNgIT
[2019-10-26T15:50:02.696Z] [INFO] Running org.apache.maven.surefire.its.jiras.Surefire1264IT
[2019-10-26T15:50:17.731Z] [INFO] Tests run: 2, Failures: 0, Errors: 0, Skipped: 0, Time elapsed: 14.048 s - in org.apache.maven.surefire.its.jiras.Surefire1264IT
[2019-10-26T15:50:17.731Z] [INFO] Running org.apache.maven.surefire.its.jiras.Surefire1265Java9IT
[2019-10-26T15:50:17.731Z] [WARNING] Tests run: 1, Failures: 0, Errors: 0, Skipped: 1, Time elapsed: 0.001 s - in org.apache.maven.surefire.its.jiras.Surefire1265Java9IT
[2019-10-26T15:50:17.731Z] [INFO] Running org.apache.maven.surefire.its.jiras.Surefire1278GroupNameEndingIT
[2019-10-26T15:50:23.105Z] [INFO] Tests run: 1, Failures: 0, Errors: 0, Skipped: 0, Time elapsed: 6.069 s - in org.apache.maven.surefire.its.jiras.Surefire1278GroupNameEndingIT
[2019-10-26T15:50:23.105Z] [INFO] Running org.apache.maven.surefire.its.jiras.Surefire1295AttributeJvmCrashesToTestsIT
[2019-10-26T15:50:23.105Z] [WARNING] Tests run: 9, Failures: 0, Errors: 0, Skipped: 9, Time elapsed: 0.001 s - in org.apache.maven.surefire.its.jiras.Surefire1295AttributeJvmCrashesToTestsIT
[2019-10-26T15:50:23.105Z] [INFO] Running org.apache.maven.surefire.its.jiras.Surefire1364SystemPropertiesIT
[2019-10-26T15:51:31.008Z] [INFO] Tests run: 10, Failures: 0, Errors: 0, Skipped: 0, Time elapsed: 58.055 s - in org.apache.maven.surefire.its.jiras.Surefire1364SystemPropertiesIT
[2019-10-26T15:51:31.008Z] [INFO] Running org.apache.maven.surefire.its.jiras.Surefire1367AssumptionLogsIT
[2019-10-26T15:51:41.109Z] [INFO] Tests run: 4, Failures: 0, Errors: 0, Skipped: 0, Time elapsed: 19.652 s - in org.apache.maven.surefire.its.jiras.Surefire1367AssumptionLogsIT
[2019-10-26T15:51:41.109Z] [INFO] Running org.apache.maven.surefire.its.jiras.Surefire1383ScanSessionDependenciesIT
[2019-10-26T15:51:51.202Z] [INFO] Tests run: 1, Failures: 0, Errors: 0, Skipped: 0, Time elapsed: 9.649 s - in org.apache.maven.surefire.its.jiras.Surefire1383ScanSessionDependenciesIT
[2019-10-26T15:51:51.202Z] [INFO] Running org.apache.maven.surefire.its.jiras.Surefire1396CustomProviderClassPathIT
[2019-10-26T15:52:06.226Z] [INFO] Tests run: 1, Failures: 0, Errors: 0, Skipped: 0, Time elapsed: 15.694 s - in org.apache.maven.surefire.its.jiras.Surefire1396CustomProviderClassPathIT
[2019-10-26T15:52:06.226Z] [INFO] Running org.apache.maven.surefire.its.jiras.Surefire141PluggableProvidersIT
[2019-10-26T15:52:38.500Z] [INFO] Tests run: 4, Failures: 0, Errors: 0, Skipped: 0, Time elapsed: 30.057 s - in org.apache.maven.surefire.its.jiras.Surefire141PluggableProvidersIT
[2019-10-26T15:52:38.500Z] [INFO] Running org.apache.maven.surefire.its.jiras.Surefire146ForkPerTestNoSetupIT
[2019-10-26T15:52:41.129Z] [INFO] Tests run: 1, Failures: 0, Errors: 0, Skipped: 0, Time elapsed: 5.334 s - in org.apache.maven.surefire.its.jiras.Surefire146ForkPerTestNoSetupIT
[2019-10-26T15:52:41.129Z] [INFO] Running org.apache.maven.surefire.its.jiras.Surefire1490ReportTitleDescriptionIT
[2019-10-26T15:53:28.487Z] [INFO] Tests run: 2, Failures: 0, Errors: 0, Skipped: 0, Time elapsed: 39.986 s - in org.apache.maven.surefire.its.jiras.Surefire1490ReportTitleDescriptionIT
[2019-10-26T15:53:28.487Z] [INFO] Running org.apache.maven.surefire.its.jiras.Surefire1534ReuseForksFalseWithJavaModuleIT
[2019-10-26T15:53:28.487Z] [WARNING] Tests run: 3, Failures: 0, Errors: 0, Skipped: 3, Time elapsed: 0.001 s - in org.apache.maven.surefire.its.jiras.Surefire1534ReuseForksFalseWithJavaModuleIT
[2019-10-26T15:53:28.487Z] [INFO] Running org.apache.maven.surefire.its.jiras.Surefire1535TestNGParallelSuitesIT
[2019-10-26T15:53:55.223Z] [INFO] Tests run: 4, Failures: 0, Errors: 0, Skipped: 0, Time elapsed: 32.361 s - in org.apache.maven.surefire.its.jiras.Surefire1535TestNGParallelSuitesIT
[2019-10-26T15:53:55.223Z] [INFO] Running org.apache.maven.surefire.its.jiras.Surefire1585IT
[2019-10-26T15:53:55.223Z] [WARNING] Tests run: 2, Failures: 0, Errors: 0, Skipped: 2, Time elapsed: 0.001 s - in org.apache.maven.surefire.its.jiras.Surefire1585IT
[2019-10-26T15:53:55.223Z] [INFO] Running org.apache.maven.surefire.its.jiras.Surefire162CharsetProviderIT
[2019-10-26T15:54:00.589Z] [INFO] Tests run: 1, Failures: 0, Errors: 0, Skipped: 0, Time elapsed: 6.411 s - in org.apache.maven.surefire.its.jiras.Surefire162CharsetProviderIT
[2019-10-26T15:54:00.589Z] [INFO] Running org.apache.maven.surefire.its.jiras.Surefire224WellFormedXmlFailuresIT
[2019-10-26T15:54:05.950Z] [INFO] Tests run: 1, Failures: 0, Errors: 0, Skipped: 0, Time elapsed: 5.43 s - in org.apache.maven.surefire.its.jiras.Surefire224WellFormedXmlFailuresIT
[2019-10-26T15:54:05.950Z] [INFO] Running org.apache.maven.surefire.its.jiras.Surefire257NotRerunningTestsIT
[2019-10-26T15:54:14.188Z] [INFO] Tests run: 1, Failures: 0, Errors: 0, Skipped: 0, Time elapsed: 7.514 s - in org.apache.maven.surefire.its.jiras.Surefire257NotRerunningTestsIT
[2019-10-26T15:54:14.188Z] [INFO] Running org.apache.maven.surefire.its.jiras.Surefire260TestWithIdenticalNamesIT
[2019-10-26T15:54:14.188Z] [WARNING] Tests run: 1, Failures: 0, Errors: 0, Skipped: 1, Time elapsed: 0.001 s - in org.apache.maven.surefire.its.jiras.Surefire260TestWithIdenticalNamesIT
[2019-10-26T15:54:14.188Z] [INFO] Running org.apache.maven.surefire.its.jiras.Surefire34SecurityManagerIT
[2019-10-26T15:54:24.290Z] [INFO] Tests run: 2, Failures: 0, Errors: 0, Skipped: 0, Time elapsed: 10.276 s - in org.apache.maven.surefire.its.jiras.Surefire34SecurityManagerIT
[2019-10-26T15:54:24.290Z] [INFO] Running org.apache.maven.surefire.its.jiras.Surefire376TestNgAfterSuiteFailureIT
[2019-10-26T15:54:29.664Z] [INFO] Tests run: 1, Failures: 0, Errors: 0, Skipped: 0, Time elapsed: 5.478 s - in org.apache.maven.surefire.its.jiras.Surefire376TestNgAfterSuiteFailureIT
[2019-10-26T15:54:29.664Z] [INFO] Running org.apache.maven.surefire.its.jiras.Surefire377TestNgAndJUnitTogetherIT
[2019-10-26T15:54:39.760Z] [INFO] Tests run: 2, Failures: 0, Errors: 0, Skipped: 0, Time elapsed: 9.467 s - in org.apache.maven.surefire.its.jiras.Surefire377TestNgAndJUnitTogetherIT
[2019-10-26T15:54:39.760Z] [INFO] Running org.apache.maven.surefire.its.jiras.Surefire408ManualProviderSelectionIT
[2019-10-26T15:54:44.036Z] [INFO] Tests run: 1, Failures: 0, Errors: 0, Skipped: 0, Time elapsed: 5.248 s - in org.apache.maven.surefire.its.jiras.Surefire408ManualProviderSelectionIT
[2019-10-26T15:54:44.036Z] [INFO] Running org.apache.maven.surefire.its.jiras.Surefire42NotExtendingTestCaseIT
[2019-10-26T15:54:49.404Z] [INFO] Tests run: 1, Failures: 0, Errors: 0, Skipped: 0, Time elapsed: 4.848 s - in org.apache.maven.surefire.its.jiras.Surefire42NotExtendingTestCaseIT
[2019-10-26T15:54:49.404Z] [INFO] Running org.apache.maven.surefire.its.jiras.Surefire44InnerClassTestIT
[2019-10-26T15:54:53.684Z] [INFO] Tests run: 1, Failures: 0, Errors: 0, Skipped: 0, Time elapsed: 4.781 s - in org.apache.maven.surefire.its.jiras.Surefire44InnerClassTestIT
[2019-10-26T15:54:53.684Z] [INFO] Running org.apache.maven.surefire.its.jiras.Surefire500PuzzlingErrorIT
[2019-10-26T15:54:59.050Z] [INFO] Tests run: 1, Failures: 0, Errors: 0, Skipped: 0, Time elapsed: 5.304 s - in org.apache.maven.surefire.its.jiras.Surefire500PuzzlingErrorIT
[2019-10-26T15:54:59.050Z] [INFO] Running org.apache.maven.surefire.its.jiras.Surefire510TestClassPathForkModesIT
[2019-10-26T15:55:09.139Z] [INFO] Tests run: 2, Failures: 0, Errors: 0, Skipped: 0, Time elapsed: 9.112 s - in org.apache.maven.surefire.its.jiras.Surefire510TestClassPathForkModesIT
[2019-10-26T15:55:09.139Z] [INFO] Running org.apache.maven.surefire.its.jiras.Surefire569RunTestFromDependencyJarsIT
[2019-10-26T15:55:12.499Z] [INFO] Tests run: 1, Failures: 0, Errors: 0, Skipped: 0, Time elapsed: 4.616 s - in org.apache.maven.surefire.its.jiras.Surefire569RunTestFromDependencyJarsIT
[2019-10-26T15:55:12.499Z] [INFO] Running org.apache.maven.surefire.its.jiras.Surefire570MultipleReportDirectoriesIT
[2019-10-26T15:55:44.760Z] [INFO] Tests run: 2, Failures: 0, Errors: 0, Skipped: 0, Time elapsed: 27.553 s - in org.apache.maven.surefire.its.jiras.Surefire570MultipleReportDirectoriesIT
[2019-10-26T15:55:44.760Z] [INFO] Running org.apache.maven.surefire.its.jiras.Surefire613TestCountInParallelIT
[2019-10-26T15:55:45.743Z] [INFO] Tests run: 1, Failures: 0, Errors: 0, Skipped: 0, Time elapsed: 5.722 s - in org.apache.maven.surefire.its.jiras.Surefire613TestCountInParallelIT
[2019-10-26T15:55:45.743Z] [INFO] Running org.apache.maven.surefire.its.jiras.Surefire621TestCountingJunit3InParallelIT
[2019-10-26T15:56:18.020Z] [INFO] Tests run: 5, Failures: 0, Errors: 0, Skipped: 0, Time elapsed: 29.415 s - in org.apache.maven.surefire.its.jiras.Surefire621TestCountingJunit3InParallelIT
[2019-10-26T15:56:18.020Z] [INFO] Running org.apache.maven.surefire.its.jiras.Surefire628ConsoleOutputBeforeAndAfterClassIT
[2019-10-26T15:56:20.623Z] [INFO] Tests run: 1, Failures: 0, Errors: 0, Skipped: 0, Time elapsed: 5.471 s - in org.apache.maven.surefire.its.jiras.Surefire628ConsoleOutputBeforeAndAfterClassIT
[2019-10-26T15:56:20.623Z] [INFO] Running org.apache.maven.surefire.its.jiras.Surefire634UnsettableSystemPropertiesWarningIT
[2019-10-26T15:56:25.999Z] [INFO] Tests run: 1, Failures: 0, Errors: 0, Skipped: 0, Time elapsed: 4.949 s - in org.apache.maven.surefire.its.jiras.Surefire634UnsettableSystemPropertiesWarningIT
[2019-10-26T15:56:25.999Z] [INFO] Running org.apache.maven.surefire.its.jiras.Surefire649EmptyStringSystemPropertiesIT
[2019-10-26T15:56:34.222Z] [INFO] Tests run: 2, Failures: 0, Errors: 0, Skipped: 0, Time elapsed: 7.397 s - in org.apache.maven.surefire.its.jiras.Surefire649EmptyStringSystemPropertiesIT
[2019-10-26T15:56:34.222Z] [INFO] Running org.apache.maven.surefire.its.jiras.Surefire673MockitoIT
[2019-10-26T15:56:39.588Z] [INFO] Tests run: 1, Failures: 0, Errors: 0, Skipped: 0, Time elapsed: 6.419 s - in org.apache.maven.surefire.its.jiras.Surefire673MockitoIT
[2019-10-26T15:56:39.588Z] [INFO] Running org.apache.maven.surefire.its.jiras.Surefire674BuildFailingWhenErrorsIT
[2019-10-26T15:56:44.945Z] [INFO] Tests run: 1, Failures: 0, Errors: 0, Skipped: 0, Time elapsed: 4.961 s - in org.apache.maven.surefire.its.jiras.Surefire674BuildFailingWhenErrorsIT
[2019-10-26T15:56:44.945Z] [INFO] Running org.apache.maven.surefire.its.jiras.Surefire674BuildFailingWhenFailsafeErrorsIT
[2019-10-26T15:56:55.046Z] [INFO] Tests run: 1, Failures: 0, Errors: 0, Skipped: 0, Time elapsed: 9.406 s - in org.apache.maven.surefire.its.jiras.Surefire674BuildFailingWhenFailsafeErrorsIT
[2019-10-26T15:56:55.046Z] [INFO] Running org.apache.maven.surefire.its.jiras.Surefire685CommaSeparatedIncludesIT
[2019-10-26T15:57:00.410Z] [INFO] Tests run: 1, Failures: 0, Errors: 0, Skipped: 0, Time elapsed: 5.498 s - in org.apache.maven.surefire.its.jiras.Surefire685CommaSeparatedIncludesIT
[2019-10-26T15:57:00.410Z] [INFO] Running org.apache.maven.surefire.its.jiras.Surefire697NiceSummaryIT
[2019-10-26T15:57:04.690Z] [INFO] Tests run: 1, Failures: 0, Errors: 0, Skipped: 0, Time elapsed: 5.088 s - in org.apache.maven.surefire.its.jiras.Surefire697NiceSummaryIT
[2019-10-26T15:57:04.690Z] [INFO] Running org.apache.maven.surefire.its.jiras.Surefire705ParallelForkTimeoutIT
[2019-10-26T15:57:13.003Z] [INFO] Tests run: 1, Failures: 0, Errors: 0, Skipped: 0, Time elapsed: 7.444 s - in org.apache.maven.surefire.its.jiras.Surefire705ParallelForkTimeoutIT
[2019-10-26T15:57:13.003Z] [INFO] Running org.apache.maven.surefire.its.jiras.Surefire733AllOverrridesCapturedIT
[2019-10-26T15:57:17.280Z] [INFO] Tests run: 1, Failures: 0, Errors: 0, Skipped: 0, Time elapsed: 5.151 s - in org.apache.maven.surefire.its.jiras.Surefire733AllOverrridesCapturedIT
[2019-10-26T15:57:17.280Z] [INFO] Running org.apache.maven.surefire.its.jiras.Surefire735ForkFailWithRedirectConsoleOutputIT
[2019-10-26T15:57:27.379Z] [INFO] Tests run: 2, Failures: 0, Errors: 0, Skipped: 0, Time elapsed: 8.503 s - in org.apache.maven.surefire.its.jiras.Surefire735ForkFailWithRedirectConsoleOutputIT
[2019-10-26T15:57:27.379Z] [INFO] Running org.apache.maven.surefire.its.jiras.Surefire740TruncatedCommaIT
[2019-10-26T15:57:31.653Z] [INFO] Tests run: 1, Failures: 0, Errors: 0, Skipped: 0, Time elapsed: 4.839 s - in org.apache.maven.surefire.its.jiras.Surefire740TruncatedCommaIT
[2019-10-26T15:57:31.653Z] [INFO] Running org.apache.maven.surefire.its.jiras.Surefire747MethodParallelWithSuiteCountIT
[2019-10-26T15:57:53.742Z] [INFO] Tests run: 2, Failures: 0, Errors: 0, Skipped: 0, Time elapsed: 20.979 s - in org.apache.maven.surefire.its.jiras.Surefire747MethodParallelWithSuiteCountIT
[2019-10-26T15:57:53.742Z] [INFO] Running org.apache.maven.surefire.its.jiras.Surefire772BothReportsIT
[2019-10-26T15:58:01.972Z] [INFO] Tests run: 3, Failures: 0, Errors: 0, Skipped: 0, Time elapsed: 8.774 s - in org.apache.maven.surefire.its.jiras.Surefire772BothReportsIT
[2019-10-26T15:58:01.972Z] [INFO] Running org.apache.maven.surefire.its.jiras.Surefire772NoFailsafeReportsIT
[2019-10-26T15:58:14.309Z] [INFO] Tests run: 4, Failures: 0, Errors: 0, Skipped: 0, Time elapsed: 12.483 s - in org.apache.maven.surefire.its.jiras.Surefire772NoFailsafeReportsIT
[2019-10-26T15:58:14.309Z] [INFO] Running org.apache.maven.surefire.its.jiras.Surefire772NoSurefireReportsIT
[2019-10-26T15:58:26.640Z] [INFO] Tests run: 4, Failures: 0, Errors: 0, Skipped: 0, Time elapsed: 11.741 s - in org.apache.maven.surefire.its.jiras.Surefire772NoSurefireReportsIT
[2019-10-26T15:58:26.640Z] [INFO] Running org.apache.maven.surefire.its.jiras.Surefire772SpecifiedReportsIT
[2019-10-26T15:58:34.874Z] [INFO] Tests run: 3, Failures: 0, Errors: 0, Skipped: 0, Time elapsed: 8.673 s - in org.apache.maven.surefire.its.jiras.Surefire772SpecifiedReportsIT
[2019-10-26T15:58:34.874Z] [INFO] Running org.apache.maven.surefire.its.jiras.Surefire801ForkModeNoneClassLoaderIT
[2019-10-26T15:58:38.268Z] [INFO] Tests run: 1, Failures: 0, Errors: 0, Skipped: 0, Time elapsed: 3.414 s - in org.apache.maven.surefire.its.jiras.Surefire801ForkModeNoneClassLoaderIT
[2019-10-26T15:58:38.268Z] [INFO] Running org.apache.maven.surefire.its.jiras.Surefire803MultiFailsafeExecsIT
[2019-10-26T15:59:00.367Z] [INFO] Tests run: 2, Failures: 0, Errors: 0, Skipped: 0, Time elapsed: 20.732 s - in org.apache.maven.surefire.its.jiras.Surefire803MultiFailsafeExecsIT
[2019-10-26T15:59:00.367Z] [INFO] Running org.apache.maven.surefire.its.jiras.Surefire806SpecifiedTestControlsIT
[2019-10-26T15:59:03.742Z] [WARNING] Tests run: 3, Failures: 0, Errors: 0, Skipped: 2, Time elapsed: 4.782 s - in org.apache.maven.surefire.its.jiras.Surefire806SpecifiedTestControlsIT
[2019-10-26T15:59:03.742Z] [INFO] Running org.apache.maven.surefire.its.jiras.Surefire809GroupExpressionsIT
[2019-10-26T15:59:36.026Z] [INFO] Tests run: 6, Failures: 0, Errors: 0, Skipped: 0, Time elapsed: 31.285 s - in org.apache.maven.surefire.its.jiras.Surefire809GroupExpressionsIT
[2019-10-26T15:59:36.026Z] [INFO] Running org.apache.maven.surefire.its.jiras.Surefire812Log4JClassLoaderIT
[2019-10-26T15:59:41.523Z] [INFO] Tests run: 1, Failures: 0, Errors: 0, Skipped: 0, Time elapsed: 6.141 s - in org.apache.maven.surefire.its.jiras.Surefire812Log4JClassLoaderIT
[2019-10-26T15:59:41.523Z] [INFO] Running org.apache.maven.surefire.its.jiras.Surefire817SystemExitIT
[2019-10-26T15:59:47.087Z] [INFO] Tests run: 1, Failures: 0, Errors: 0, Skipped: 0, Time elapsed: 5.486 s - in org.apache.maven.surefire.its.jiras.Surefire817SystemExitIT
[2019-10-26T15:59:47.087Z] [INFO] Running org.apache.maven.surefire.its.jiras.Surefire818NpeIgnoresTestsIT
[2019-10-26T15:59:53.863Z] [INFO] Tests run: 1, Failures: 0, Errors: 0, Skipped: 0, Time elapsed: 6.552 s - in org.apache.maven.surefire.its.jiras.Surefire818NpeIgnoresTestsIT
[2019-10-26T15:59:53.863Z] [INFO] Running org.apache.maven.surefire.its.jiras.Surefire828EmptyGroupExprIT
[2019-10-26T16:00:15.961Z] [INFO] Tests run: 4, Failures: 0, Errors: 0, Skipped: 0, Time elapsed: 22.729 s - in org.apache.maven.surefire.its.jiras.Surefire828EmptyGroupExprIT
[2019-10-26T16:00:15.961Z] [INFO] Running org.apache.maven.surefire.its.jiras.Surefire832ProviderSelectionIT
[2019-10-26T16:00:22.626Z] [INFO] Tests run: 1, Failures: 0, Errors: 0, Skipped: 0, Time elapsed: 5.939 s - in org.apache.maven.surefire.its.jiras.Surefire832ProviderSelectionIT
[2019-10-26T16:00:22.626Z] [INFO] Running org.apache.maven.surefire.its.jiras.Surefire839TestWithoutCategoriesIT
[2019-10-26T16:00:32.735Z] [INFO] Tests run: 2, Failures: 0, Errors: 0, Skipped: 0, Time elapsed: 11.22 s - in org.apache.maven.surefire.its.jiras.Surefire839TestWithoutCategoriesIT
[2019-10-26T16:00:32.735Z] [INFO] Running org.apache.maven.surefire.its.jiras.Surefire847AdditionalFailureIT
[2019-10-26T16:00:40.963Z] [INFO] Tests run: 1, Failures: 0, Errors: 0, Skipped: 0, Time elapsed: 6.671 s - in org.apache.maven.surefire.its.jiras.Surefire847AdditionalFailureIT
[2019-10-26T16:00:40.963Z] [INFO] Running org.apache.maven.surefire.its.jiras.Surefire855AllowFailsafeUseArtifactFileIT
[2019-10-26T16:01:48.863Z] [INFO] Tests run: 4, Failures: 0, Errors: 0, Skipped: 0, Time elapsed: 60.746 s - in org.apache.maven.surefire.its.jiras.Surefire855AllowFailsafeUseArtifactFileIT
[2019-10-26T16:01:48.863Z] [INFO] Running org.apache.maven.surefire.its.jiras.Surefire901MIssingResultfileWhenNoTestsIT
[2019-10-26T16:01:48.863Z] [INFO] Tests run: 1, Failures: 0, Errors: 0, Skipped: 0, Time elapsed: 4.362 s - in org.apache.maven.surefire.its.jiras.Surefire901MIssingResultfileWhenNoTestsIT
[2019-10-26T16:01:48.863Z] [INFO] Running org.apache.maven.surefire.its.jiras.Surefire907PerThreadWithoutThreadCountIT
[2019-10-26T16:01:48.863Z] [INFO] Tests run: 1, Failures: 0, Errors: 0, Skipped: 0, Time elapsed: 3.738 s - in org.apache.maven.surefire.its.jiras.Surefire907PerThreadWithoutThreadCountIT
[2019-10-26T16:01:48.863Z] [INFO] Running org.apache.maven.surefire.its.jiras.Surefire920TestFailureIgnoreWithTimeoutIT
[2019-10-26T16:02:03.891Z] [INFO] Tests run: 2, Failures: 0, Errors: 0, Skipped: 0, Time elapsed: 13.277 s - in org.apache.maven.surefire.its.jiras.Surefire920TestFailureIgnoreWithTimeoutIT
[2019-10-26T16:02:03.891Z] [INFO] Running org.apache.maven.surefire.its.jiras.Surefire926FailureWith2ProvidersIT
[2019-10-26T16:02:11.375Z] [INFO] Tests run: 1, Failures: 0, Errors: 0, Skipped: 0, Time elapsed: 8.43 s - in org.apache.maven.surefire.its.jiras.Surefire926FailureWith2ProvidersIT
[2019-10-26T16:02:11.375Z] [INFO] Running org.apache.maven.surefire.its.jiras.Surefire930TestNgSuiteXmlIT
[2019-10-26T16:02:18.044Z] [INFO] Tests run: 1, Failures: 0, Errors: 0, Skipped: 0, Time elapsed: 6.933 s - in org.apache.maven.surefire.its.jiras.Surefire930TestNgSuiteXmlIT
[2019-10-26T16:02:18.044Z] [INFO] Running org.apache.maven.surefire.its.jiras.Surefire943ReportContentIT
[2019-10-26T16:02:50.316Z] [INFO] Tests run: 2, Failures: 0, Errors: 0, Skipped: 0, Time elapsed: 29.368 s - in org.apache.maven.surefire.its.jiras.Surefire943ReportContentIT
[2019-10-26T16:02:50.316Z] [INFO] Running org.apache.maven.surefire.its.jiras.Surefire946KillMainProcessInReusableForkIT
[2019-10-26T16:03:12.414Z] [INFO] Tests run: 3, Failures: 0, Errors: 0, Skipped: 0, Time elapsed: 22.91 s - in org.apache.maven.surefire.its.jiras.Surefire946KillMainProcessInReusableForkIT
[2019-10-26T16:03:12.414Z] [INFO] Running org.apache.maven.surefire.its.jiras.Surefire972BizarreNoClassDefIT
[2019-10-26T16:03:22.538Z] [INFO] Tests run: 1, Failures: 0, Errors: 0, Skipped: 0, Time elapsed: 11.387 s - in org.apache.maven.surefire.its.jiras.Surefire972BizarreNoClassDefIT
[2019-10-26T16:03:22.538Z] [INFO] Running org.apache.maven.surefire.its.jiras.Surefire975DefaultVMEncodingIT
[2019-10-26T16:03:27.986Z] [INFO] Tests run: 1, Failures: 0, Errors: 0, Skipped: 0, Time elapsed: 6.347 s - in org.apache.maven.surefire.its.jiras.Surefire975DefaultVMEncodingIT
[2019-10-26T16:03:27.986Z] [INFO] Running org.apache.maven.surefire.its.jiras.Surefire979WrongClassLoaderIT
[2019-10-26T16:03:33.359Z] [INFO] Tests run: 1, Failures: 0, Errors: 0, Skipped: 0, Time elapsed: 5.632 s - in org.apache.maven.surefire.its.jiras.Surefire979WrongClassLoaderIT
[2019-10-26T16:03:33.359Z] [INFO] Running org.apache.maven.surefire.its.jiras.Surefire985ParameterizedRunnerAndCategoriesIT
[2019-10-26T16:03:37.631Z] [INFO] Tests run: 1, Failures: 0, Errors: 0, Skipped: 0, Time elapsed: 4.557 s - in org.apache.maven.surefire.its.jiras.Surefire985ParameterizedRunnerAndCategoriesIT
[2019-10-26T16:03:37.631Z] [INFO] Running org.apache.maven.surefire.its.jiras.Surefire995CategoryInheritanceIT
[2019-10-26T16:03:59.740Z] [INFO] Tests run: 5, Failures: 0, Errors: 0, Skipped: 0, Time elapsed: 21.664 s - in org.apache.maven.surefire.its.jiras.Surefire995CategoryInheritanceIT
[2019-10-26T16:03:59.740Z] [INFO]
[2019-10-26T16:03:59.740Z] [INFO] Results:
[2019-10-26T16:03:59.740Z] [INFO]
[2019-10-26T16:03:59.740Z] [WARNING] Tests run: 796, Failures: 0, Errors: 0, Skipped: 176
[2019-10-26T16:03:59.740Z] [INFO]
[2019-10-26T16:03:59.740Z] [INFO]
[2019-10-26T16:03:59.740Z] [INFO] --- maven-checkstyle-plugin:3.0.0:check (checkstyle-check) @ surefire-its ---
[2019-10-26T16:04:01.156Z] [INFO]
[2019-10-26T16:04:01.156Z] [INFO] --- maven-failsafe-plugin:3.0.0-M3:verify (default) @ surefire-its ---
[2019-10-26T16:04:01.156Z] [INFO] Failsafe report directory: C:\Users\jenkins\AppData\Local\Temp\2\jenkins-maven-box-maven-surefire-MasterProcessChannelDecoder-11\surefire-its\target\failsafe-reports
[2019-10-26T16:04:01.156Z] [INFO]
[2019-10-26T16:04:01.156Z] [INFO] --- maven-install-plugin:2.5.2:install (default-install) @ surefire-its ---
[2019-10-26T16:04:01.156Z] [INFO] Skipping artifact installation
[2019-10-26T16:04:01.156Z] [INFO] ------------------------------------------------------------------------
[2019-10-26T16:04:01.157Z] [INFO] Reactor Summary for Apache Maven Surefire 3.0.0-SNAPSHOT:
[2019-10-26T16:04:01.157Z] [INFO]
[2019-10-26T16:04:01.157Z] [INFO] Apache Maven Surefire .............................. SUCCESS [01:01 min]
[2019-10-26T16:04:01.157Z] [INFO] SureFire Logger API ................................ SUCCESS [ 23.066 s]
[2019-10-26T16:04:01.157Z] [INFO] SureFire API ....................................... SUCCESS [ 17.805 s]
[2019-10-26T16:04:01.157Z] [INFO] Surefire Extensions API ............................ SUCCESS [  3.191 s]
[2019-10-26T16:04:01.157Z] [INFO] SureFire Booter .................................... SUCCESS [ 15.035 s]
[2019-10-26T16:04:01.157Z] [INFO] Maven Surefire Test-Grouping Support ............... SUCCESS [ 11.158 s]
[2019-10-26T16:04:01.157Z] [INFO] SureFire Providers ................................. SUCCESS [  1.362 s]
[2019-10-26T16:04:01.157Z] [INFO] Shared JUnit3 Provider Code ........................ SUCCESS [  4.947 s]
[2019-10-26T16:04:01.157Z] [INFO] Shared Java 5 Provider Base ........................ SUCCESS [  6.695 s]
[2019-10-26T16:04:01.157Z] [INFO] Shared JUnit4 Provider Code ........................ SUCCESS [  6.914 s]
[2019-10-26T16:04:01.157Z] [INFO] Shared JUnit48 Provider Code ....................... SUCCESS [  6.960 s]
[2019-10-26T16:04:01.157Z] [INFO] SureFire JUnit Runner .............................. SUCCESS [  5.251 s]
[2019-10-26T16:04:01.157Z] [INFO] SureFire JUnit4 Runner ............................. SUCCESS [ 14.786 s]
[2019-10-26T16:04:01.157Z] [INFO] Maven Surefire Common .............................. SUCCESS [ 42.962 s]
[2019-10-26T16:04:01.157Z] [INFO] SureFire JUnitCore Runner .......................... SUCCESS [02:19 min]
[2019-10-26T16:04:01.157Z] [INFO] SureFire JUnit Platform Runner ..................... SUCCESS [ 11.830 s]
[2019-10-26T16:04:01.157Z] [INFO] SureFire TestNG Utils .............................. SUCCESS [  6.890 s]
[2019-10-26T16:04:01.157Z] [INFO] SureFire TestNG Runner ............................. SUCCESS [  6.882 s]
[2019-10-26T16:04:01.157Z] [INFO] ShadeFire JUnit3 Provider .......................... SUCCESS [  2.561 s]
[2019-10-26T16:04:01.157Z] [INFO] Surefire Report Parser ............................. SUCCESS [  8.195 s]
[2019-10-26T16:04:01.157Z] [INFO] Maven Surefire Plugin .............................. SUCCESS [ 16.944 s]
[2019-10-26T16:04:01.157Z] [INFO] Maven Failsafe Plugin .............................. SUCCESS [01:51 min]
[2019-10-26T16:04:01.157Z] [INFO] Maven Surefire Report Plugin ....................... SUCCESS [ 19.184 s]
[2019-10-26T16:04:01.157Z] [INFO] Maven Surefire Integration Tests ................... SUCCESS [  01:06 h]
[2019-10-26T16:04:01.157Z] [INFO] ------------------------------------------------------------------------
[2019-10-26T16:04:01.157Z] [INFO] BUILD SUCCESS
[2019-10-26T16:04:01.157Z] [INFO] ------------------------------------------------------------------------
[2019-10-26T16:04:01.157Z] [INFO] Total time:  01:15 h
[2019-10-26T16:04:01.157Z] [INFO] Finished at: 2019-10-26T09:04:00-07:00
[2019-10-26T16:04:01.157Z] [INFO] ------------------------------------------------------------------------
[Pipeline] }
[Pipeline] // withEnv
[Pipeline] }
[Pipeline] // stage
[Pipeline] fileExists
[Pipeline] zip
[2019-10-26T16:04:01.300Z] Writing zip file of C:\Users\jenkins\AppData\Local\Temp\2\jenkins-maven-box-maven-surefire-MasterProcessChannelDecoder-11\maven-failsafe-plugin\target\it to C:\Users\jenkins\AppData\Local\Temp\2\jenkins-maven-box-maven-surefire-MasterProcessChannelDecoder-11\maven-failsafe-plugin--windows-jdk7-maven3.6.x.zip
[2019-10-26T16:04:02.024Z] Zipped 78 entries.
[2019-10-26T16:04:02.024Z] Archiving C:\Users\jenkins\AppData\Local\Temp\2\jenkins-maven-box-maven-surefire-MasterProcessChannelDecoder-11\maven-failsafe-plugin--windows-jdk7-maven3.6.x.zip
[2019-10-26T16:04:02.026Z] [Fast Archiver] No artifacts from Maven TLP » maven-surefire » MasterProcessChannelDecoder #1 to compare, so performing full copy of artifacts
[Pipeline] fileExists
[Pipeline] zip
[2019-10-26T16:04:02.108Z] Writing zip file of C:\Users\jenkins\AppData\Local\Temp\2\jenkins-maven-box-maven-surefire-MasterProcessChannelDecoder-11\surefire-its\target to C:\Users\jenkins\AppData\Local\Temp\2\jenkins-maven-box-maven-surefire-MasterProcessChannelDecoder-11\surefire-its--windows-jdk7-maven3.6.x.zip
[2019-10-26T16:04:57.255Z] Zipped 15885 entries.
[2019-10-26T16:04:57.255Z] Archiving C:\Users\jenkins\AppData\Local\Temp\2\jenkins-maven-box-maven-surefire-MasterProcessChannelDecoder-11\surefire-its--windows-jdk7-maven3.6.x.zip
[2019-10-26T16:04:57.256Z] [Fast Archiver] No artifacts from Maven TLP » maven-surefire » MasterProcessChannelDecoder #1 to compare, so performing full copy of artifacts
[Pipeline] archiveArtifacts
[2019-10-26T16:04:58.656Z] Archiving artifacts
[2019-10-26T16:04:58.667Z] [Fast Archiver] No artifacts from Maven TLP » maven-surefire » MasterProcessChannelDecoder #1 to compare, so performing full copy of artifacts
[Pipeline] cleanWs
[2019-10-26T16:05:00.234Z] [WS-CLEANUP] Deleting project workspace...
[2019-10-26T16:05:00.234Z] [WS-CLEANUP] Deferred wipeout is used...
[2019-10-26T16:05:00.340Z] [WS-CLEANUP] done
[Pipeline] }
[Pipeline] // ws
[Pipeline] }
[Pipeline] // timestamps
[Pipeline] }
[Pipeline] // node
[Pipeline] }
[Pipeline] // parallel
[Pipeline] echo
Build result: FAILURE
[Pipeline] jiraIssueSelector
[Pipeline] echo
The authors of changes [rfscholte].
[Pipeline] echo
Sending email ...
[Pipeline] emailext
Reply | Threaded
Open this post in threaded view
|

Build failed in Jenkins: Maven TLP » maven-surefire » MasterProcessChannelDecoder #12

Apache Jenkins Server-2
See https://builds.apache.org/job/maven-box/job/maven-surefire/job/MasterProcessChannelDecoder/12/

Changes:

* H31 gives OOME (let's see if others are stable again...)
* echo NODE_NAME

1 tests failed.
FAILED:  org.apache.maven.surefire.its.JUnitPlatformEnginesIT.platform[1.5.0-SNAPSHOT]

Error Message:

Expected: (<[.*\[DEBUG\] test\(compact\) classpath:.*]> and <[.*  test-classes.*]> and <[.*  classes.*]> and <[.*junit-jupiter-engine-5\.5\.0-SNAPSHOT\.jar.*]> and <[.*apiguardian-api-1\.0\.0\.jar.*]> and <[.*junit-platform-engine-1\.5\.0-SNAPSHOT\.jar.*]> and <[.*junit-platform-commons-1\.5\.0-SNAPSHOT\.jar.*]> and <[.*opentest4j-1\.2\.0-SNAPSHOT\.jar.*]> and <[.*junit-jupiter-api-5\.5\.0-SNAPSHOT\.jar.*]>)
     but: <[.*apiguardian-api-1\.0\.0\.jar.*]> was <[[DEBUG] test(compact) classpath:  test-classes  classes  junit-jupiter-engine-5.5.0-SNAPSHOT.jar  apiguardian-api-1.1.0.jar  junit-platform-engine-1.5.0-SNAPSHOT.jar  opentest4j-1.2.0.jar  junit-platform-commons-1.5.0-SNAPSHOT.jar  junit-jupiter-api-5.5.0-SNAPSHOT.jar]>

Stack Trace:
java.lang.AssertionError:

Expected: (<[.*\[DEBUG\] test\(compact\) classpath:.*]> and <[.*  test-classes.*]> and <[.*  classes.*]> and <[.*junit-jupiter-engine-5\.5\.0-SNAPSHOT\.jar.*]> and <[.*apiguardian-api-1\.0\.0\.jar.*]> and <[.*junit-platform-engine-1\.5\.0-SNAPSHOT\.jar.*]> and <[.*junit-platform-commons-1\.5\.0-SNAPSHOT\.jar.*]> and <[.*opentest4j-1\.2\.0-SNAPSHOT\.jar.*]> and <[.*junit-jupiter-api-5\.5\.0-SNAPSHOT\.jar.*]>)
     but: <[.*apiguardian-api-1\.0\.0\.jar.*]> was <[[DEBUG] test(compact) classpath:  test-classes  classes  junit-jupiter-engine-5.5.0-SNAPSHOT.jar  apiguardian-api-1.1.0.jar  junit-platform-engine-1.5.0-SNAPSHOT.jar  opentest4j-1.2.0.jar  junit-platform-commons-1.5.0-SNAPSHOT.jar  junit-jupiter-api-5.5.0-SNAPSHOT.jar]>
        at org.apache.maven.surefire.its.JUnitPlatformEnginesIT.platform(JUnitPlatformEnginesIT.java:103)




Build log:
[...truncated 47406 lines...]
[2019-11-27T14:24:53.697Z]     at org.apache.maven.lifecycle.internal.LifecycleModuleBuilder.buildProject (LifecycleModuleBuilder.java:81)
[2019-11-27T14:24:53.697Z]     at org.apache.maven.lifecycle.internal.builder.singlethreaded.SingleThreadedBuilder.build (SingleThreadedBuilder.java:56)
[2019-11-27T14:24:53.697Z]     at org.apache.maven.lifecycle.internal.LifecycleStarter.execute (LifecycleStarter.java:128)
[2019-11-27T14:24:53.697Z]     at org.apache.maven.DefaultMaven.doExecute (DefaultMaven.java:305)
[2019-11-27T14:24:53.697Z]     at org.apache.maven.DefaultMaven.doExecute (DefaultMaven.java:192)
[2019-11-27T14:24:53.697Z]     at org.apache.maven.DefaultMaven.execute (DefaultMaven.java:105)
[2019-11-27T14:24:53.697Z]     at org.apache.maven.cli.MavenCli.execute (MavenCli.java:956)
[2019-11-27T14:24:53.697Z]     at org.apache.maven.cli.MavenCli.doMain (MavenCli.java:288)
[2019-11-27T14:24:53.697Z]     at org.apache.maven.cli.MavenCli.main (MavenCli.java:192)
[2019-11-27T14:24:53.698Z]     at sun.reflect.NativeMethodAccessorImpl.invoke0 (Native Method)
[2019-11-27T14:24:53.698Z]     at sun.reflect.NativeMethodAccessorImpl.invoke (NativeMethodAccessorImpl.java:62)
[2019-11-27T14:24:53.698Z]     at sun.reflect.DelegatingMethodAccessorImpl.invoke (DelegatingMethodAccessorImpl.java:43)
[2019-11-27T14:24:53.698Z]     at java.lang.reflect.Method.invoke (Method.java:498)
[2019-11-27T14:24:53.698Z]     at org.codehaus.plexus.classworlds.launcher.Launcher.launchEnhanced (Launcher.java:282)
[2019-11-27T14:24:53.698Z]     at org.codehaus.plexus.classworlds.launcher.Launcher.launch (Launcher.java:225)
[2019-11-27T14:24:53.698Z]     at org.codehaus.plexus.classworlds.launcher.Launcher.mainWithExitCode (Launcher.java:406)
[2019-11-27T14:24:53.698Z]     at org.codehaus.plexus.classworlds.launcher.Launcher.main (Launcher.java:347)
[2019-11-27T14:24:53.698Z] Caused by: org.apache.maven.plugin.MojoFailureException: There are test failures.
[2019-11-27T14:24:53.698Z]
[2019-11-27T14:24:53.698Z] Please refer to C:\Users\jenkins\AppData\Local\Temp\3\jenkins-maven-box-maven-surefire-MasterProcessChannelDecoder-12@2\surefire-its\target\failsafe-reports for the individual test results.
[2019-11-27T14:24:53.698Z] Please refer to dump files (if any exist) [date].dump, [date]-jvmRun[N].dump and [date].dumpstream.
[2019-11-27T14:24:53.698Z]     at org.apache.maven.plugin.surefire.SurefireHelper.throwException (SurefireHelper.java:271)
[2019-11-27T14:24:53.698Z]     at org.apache.maven.plugin.surefire.SurefireHelper.reportExecution (SurefireHelper.java:159)
[2019-11-27T14:24:53.698Z]     at org.apache.maven.plugin.failsafe.VerifyMojo.execute (VerifyMojo.java:192)
[2019-11-27T14:24:53.698Z]     at org.apache.maven.plugin.DefaultBuildPluginManager.executeMojo (DefaultBuildPluginManager.java:137)
[2019-11-27T14:24:53.698Z]     at org.apache.maven.lifecycle.internal.MojoExecutor.execute (MojoExecutor.java:210)
[2019-11-27T14:24:53.698Z]     at org.apache.maven.lifecycle.internal.MojoExecutor.execute (MojoExecutor.java:156)
[2019-11-27T14:24:53.698Z]     at org.apache.maven.lifecycle.internal.MojoExecutor.execute (MojoExecutor.java:148)
[2019-11-27T14:24:53.698Z]     at org.apache.maven.lifecycle.internal.LifecycleModuleBuilder.buildProject (LifecycleModuleBuilder.java:117)
[2019-11-27T14:24:53.698Z]     at org.apache.maven.lifecycle.internal.LifecycleModuleBuilder.buildProject (LifecycleModuleBuilder.java:81)
[2019-11-27T14:24:53.698Z]     at org.apache.maven.lifecycle.internal.builder.singlethreaded.SingleThreadedBuilder.build (SingleThreadedBuilder.java:56)
[2019-11-27T14:24:53.698Z]     at org.apache.maven.lifecycle.internal.LifecycleStarter.execute (LifecycleStarter.java:128)
[2019-11-27T14:24:53.698Z]     at org.apache.maven.DefaultMaven.doExecute (DefaultMaven.java:305)
[2019-11-27T14:24:53.698Z]     at org.apache.maven.DefaultMaven.doExecute (DefaultMaven.java:192)
[2019-11-27T14:24:53.698Z]     at org.apache.maven.DefaultMaven.execute (DefaultMaven.java:105)
[2019-11-27T14:24:53.698Z]     at org.apache.maven.cli.MavenCli.execute (MavenCli.java:956)
[2019-11-27T14:24:53.698Z]     at org.apache.maven.cli.MavenCli.doMain (MavenCli.java:288)
[2019-11-27T14:24:53.698Z]     at org.apache.maven.cli.MavenCli.main (MavenCli.java:192)
[2019-11-27T14:24:53.698Z]     at sun.reflect.NativeMethodAccessorImpl.invoke0 (Native Method)
[2019-11-27T14:24:53.698Z]     at sun.reflect.NativeMethodAccessorImpl.invoke (NativeMethodAccessorImpl.java:62)
[2019-11-27T14:24:53.698Z]     at sun.reflect.DelegatingMethodAccessorImpl.invoke (DelegatingMethodAccessorImpl.java:43)
[2019-11-27T14:24:53.698Z]     at java.lang.reflect.Method.invoke (Method.java:498)
[2019-11-27T14:24:53.698Z]     at org.codehaus.plexus.classworlds.launcher.Launcher.launchEnhanced (Launcher.java:282)
[2019-11-27T14:24:53.698Z]     at org.codehaus.plexus.classworlds.launcher.Launcher.launch (Launcher.java:225)
[2019-11-27T14:24:53.698Z]     at org.codehaus.plexus.classworlds.launcher.Launcher.mainWithExitCode (Launcher.java:406)
[2019-11-27T14:24:53.698Z]     at org.codehaus.plexus.classworlds.launcher.Launcher.main (Launcher.java:347)
[2019-11-27T14:24:53.698Z] [ERROR]
[2019-11-27T14:24:53.698Z] [ERROR] Re-run Maven using the -X switch to enable full debug logging.
[2019-11-27T14:24:53.698Z] [ERROR]
[2019-11-27T14:24:53.698Z] [ERROR] For more information about the errors and possible solutions, please read the following articles:
[2019-11-27T14:24:53.698Z] [ERROR] [Help 1] http://cwiki.apache.org/confluence/display/MAVEN/MojoFailureException
[2019-11-27T14:24:53.698Z] [ERROR]
[2019-11-27T14:24:53.698Z] [ERROR] After correcting the problems, you can resume the build with the command
[2019-11-27T14:24:53.698Z] [ERROR]   mvn <args> -rf :surefire-its
[Pipeline] }
[Pipeline] // withEnv
[Pipeline] }
[Pipeline] // stage
[Pipeline] fileExists
[Pipeline] zip
[2019-11-27T14:24:53.849Z] Writing zip file of C:\Users\jenkins\AppData\Local\Temp\3\jenkins-maven-box-maven-surefire-MasterProcessChannelDecoder-12@2\maven-failsafe-plugin\target\it to C:\Users\jenkins\AppData\Local\Temp\3\jenkins-maven-box-maven-surefire-MasterProcessChannelDecoder-12@2\maven-failsafe-plugin--windows-jdk8-maven3.6.x.zip
[2019-11-27T14:24:54.134Z] Zipped 78 entries.
[2019-11-27T14:24:54.134Z] Archiving C:\Users\jenkins\AppData\Local\Temp\3\jenkins-maven-box-maven-surefire-MasterProcessChannelDecoder-12@2\maven-failsafe-plugin--windows-jdk8-maven3.6.x.zip
[2019-11-27T14:24:54.135Z] [Fast Archiver] No artifacts from Maven TLP » maven-surefire » MasterProcessChannelDecoder #1 to compare, so performing full copy of artifacts
[Pipeline] fileExists
[Pipeline] zip
[2019-11-27T14:24:54.212Z] Writing zip file of C:\Users\jenkins\AppData\Local\Temp\3\jenkins-maven-box-maven-surefire-MasterProcessChannelDecoder-12@2\surefire-its\target to C:\Users\jenkins\AppData\Local\Temp\3\jenkins-maven-box-maven-surefire-MasterProcessChannelDecoder-12@2\surefire-its--windows-jdk8-maven3.6.x.zip
[2019-11-27T14:25:05.216Z] [INFO] Tests run: 3, Failures: 0, Errors: 0, Skipped: 0, Time elapsed: 26.028 s - in org.apache.maven.surefire.its.jiras.Surefire946KillMainProcessInReusableForkIT
[2019-11-27T14:25:05.216Z] [INFO] Running org.apache.maven.surefire.its.jiras.Surefire972BizarreNoClassDefIT
[2019-11-27T14:25:13.681Z] Zipped 16052 entries.
[2019-11-27T14:25:13.681Z] Archiving C:\Users\jenkins\AppData\Local\Temp\3\jenkins-maven-box-maven-surefire-MasterProcessChannelDecoder-12@2\surefire-its--windows-jdk8-maven3.6.x.zip
[2019-11-27T14:25:13.682Z] [Fast Archiver] No artifacts from Maven TLP » maven-surefire » MasterProcessChannelDecoder #1 to compare, so performing full copy of artifacts
[Pipeline] archiveArtifacts
[2019-11-27T14:25:15.338Z] Archiving artifacts
[2019-11-27T14:25:15.350Z] [Fast Archiver] No artifacts from Maven TLP » maven-surefire » MasterProcessChannelDecoder #1 to compare, so performing full copy of artifacts
[2019-11-27T14:25:15.503Z] [INFO] Tests run: 1, Failures: 0, Errors: 0, Skipped: 0, Time elapsed: 10.4 s - in org.apache.maven.surefire.its.jiras.Surefire972BizarreNoClassDefIT
[2019-11-27T14:25:15.503Z] [INFO] Running org.apache.maven.surefire.its.jiras.Surefire975DefaultVMEncodingIT
[Pipeline] cleanWs
[2019-11-27T14:25:16.991Z] [WS-CLEANUP] Deleting project workspace...
[2019-11-27T14:25:16.991Z] [WS-CLEANUP] Deferred wipeout is used...
[2019-11-27T14:25:17.106Z] [WS-CLEANUP] done
[Pipeline] }
[Pipeline] // ws
[Pipeline] }
[Pipeline] // timestamps
[Pipeline] }
[Pipeline] // node
[Pipeline] }
[2019-11-27T14:25:23.815Z] [INFO] Tests run: 1, Failures: 0, Errors: 0, Skipped: 0, Time elapsed: 9.651 s - in org.apache.maven.surefire.its.jiras.Surefire975DefaultVMEncodingIT
[2019-11-27T14:25:23.815Z] [INFO] Running org.apache.maven.surefire.its.jiras.Surefire979WrongClassLoaderIT
[2019-11-27T14:25:33.954Z] [INFO] Tests run: 1, Failures: 0, Errors: 0, Skipped: 0, Time elapsed: 8.675 s - in org.apache.maven.surefire.its.jiras.Surefire979WrongClassLoaderIT
[2019-11-27T14:25:33.954Z] [INFO] Running org.apache.maven.surefire.its.jiras.Surefire985ParameterizedRunnerAndCategoriesIT
[2019-11-27T14:25:39.339Z] [INFO] Tests run: 1, Failures: 0, Errors: 0, Skipped: 0, Time elapsed: 6.286 s - in org.apache.maven.surefire.its.jiras.Surefire985ParameterizedRunnerAndCategoriesIT
[2019-11-27T14:25:39.339Z] [INFO] Running org.apache.maven.surefire.its.jiras.Surefire995CategoryInheritanceIT
[2019-11-27T14:26:06.100Z] [INFO] Tests run: 5, Failures: 0, Errors: 0, Skipped: 0, Time elapsed: 25.986 s - in org.apache.maven.surefire.its.jiras.Surefire995CategoryInheritanceIT
[2019-11-27T14:26:06.100Z] [INFO]
[2019-11-27T14:26:06.100Z] [INFO] Results:
[2019-11-27T14:26:06.100Z] [INFO]
[2019-11-27T14:26:06.100Z] [ERROR] Failures:
[2019-11-27T14:26:06.100Z] [ERROR]   JUnitPlatformEnginesIT.platform:103
[2019-11-27T14:26:06.100Z] Expected: (<[.*\[DEBUG\] test\(compact\) classpath:.*]> and <[.*  test-classes.*]> and <[.*  classes.*]> and <[.*junit-jupiter-engine-5\.5\.0-SNAPSHOT\.jar.*]> and <[.*apiguardian-api-1\.0\.0\.jar.*]> and <[.*junit-platform-engine-1\.5\.0-SNAPSHOT\.jar.*]> and <[.*junit-platform-commons-1\.5\.0-SNAPSHOT\.jar.*]> and <[.*opentest4j-1\.2\.0-SNAPSHOT\.jar.*]> and <[.*junit-jupiter-api-5\.5\.0-SNAPSHOT\.jar.*]>)
[2019-11-27T14:26:06.100Z]      but: <[.*apiguardian-api-1\.0\.0\.jar.*]> was <[[DEBUG] test(compact) classpath:  test-classes  classes  junit-jupiter-engine-5.5.0-SNAPSHOT.jar  apiguardian-api-1.1.0.jar  junit-platform-engine-1.5.0-SNAPSHOT.jar  opentest4j-1.2.0.jar  junit-platform-commons-1.5.0-SNAPSHOT.jar  junit-jupiter-api-5.5.0-SNAPSHOT.jar]>
[2019-11-27T14:26:06.100Z] [INFO]
[2019-11-27T14:26:06.100Z] [ERROR] Tests run: 796, Failures: 1, Errors: 0, Skipped: 143
[2019-11-27T14:26:06.100Z] [INFO]
[2019-11-27T14:26:06.100Z] [INFO]
[2019-11-27T14:26:06.100Z] [INFO] --- maven-checkstyle-plugin:3.0.0:check (checkstyle-check) @ surefire-its ---
[2019-11-27T14:26:06.371Z] [INFO]
[2019-11-27T14:26:06.371Z] [INFO] --- maven-failsafe-plugin:3.0.0-M3:verify (default) @ surefire-its ---
[2019-11-27T14:26:06.371Z] [INFO] Failsafe report directory: C:\Users\jenkins\AppData\Local\Temp\3\jenkins-maven-box-maven-surefire-MasterProcessChannelDecoder-12\surefire-its\target\failsafe-reports
[2019-11-27T14:26:06.371Z] [INFO] ------------------------------------------------------------------------
[2019-11-27T14:26:06.371Z] [INFO] Reactor Summary for Apache Maven Surefire 3.0.0-SNAPSHOT:
[2019-11-27T14:26:06.371Z] [INFO]
[2019-11-27T14:26:06.371Z] [INFO] Apache Maven Surefire .............................. SUCCESS [01:10 min]
[2019-11-27T14:26:06.371Z] [INFO] SureFire Logger API ................................ SUCCESS [ 28.867 s]
[2019-11-27T14:26:06.371Z] [INFO] SureFire API ....................................... SUCCESS [ 24.497 s]
[2019-11-27T14:26:06.371Z] [INFO] Surefire Extensions API ............................ SUCCESS [  3.860 s]
[2019-11-27T14:26:06.371Z] [INFO] SureFire Booter .................................... SUCCESS [ 22.169 s]
[2019-11-27T14:26:06.371Z] [INFO] Maven Surefire Test-Grouping Support ............... SUCCESS [ 17.282 s]
[2019-11-27T14:26:06.371Z] [INFO] SureFire Providers ................................. SUCCESS [  1.559 s]
[2019-11-27T14:26:06.371Z] [INFO] Shared JUnit3 Provider Code ........................ SUCCESS [  6.329 s]
[2019-11-27T14:26:06.371Z] [INFO] Shared Java 5 Provider Base ........................ SUCCESS [ 10.826 s]
[2019-11-27T14:26:06.371Z] [INFO] Shared JUnit4 Provider Code ........................ SUCCESS [  9.713 s]
[2019-11-27T14:26:06.371Z] [INFO] Shared JUnit48 Provider Code ....................... SUCCESS [  9.697 s]
[2019-11-27T14:26:06.371Z] [INFO] SureFire JUnit Runner .............................. SUCCESS [  6.133 s]
[2019-11-27T14:26:06.371Z] [INFO] SureFire JUnit4 Runner ............................. SUCCESS [ 36.281 s]
[2019-11-27T14:26:06.371Z] [INFO] Maven Surefire Common .............................. SUCCESS [01:04 min]
[2019-11-27T14:26:06.372Z] [INFO] SureFire JUnitCore Runner .......................... SUCCESS [02:34 min]
[2019-11-27T14:26:06.372Z] [INFO] SureFire JUnit Platform Runner ..................... SUCCESS [ 20.615 s]
[2019-11-27T14:26:06.372Z] [INFO] SureFire TestNG Utils .............................. SUCCESS [  8.070 s]
[2019-11-27T14:26:06.372Z] [INFO] SureFire TestNG Runner ............................. SUCCESS [  8.369 s]
[2019-11-27T14:26:06.372Z] [INFO] ShadeFire JUnit3 Provider .......................... SUCCESS [  3.518 s]
[2019-11-27T14:26:06.372Z] [INFO] Surefire Report Parser ............................. SUCCESS [ 10.731 s]
[2019-11-27T14:26:06.372Z] [INFO] Maven Surefire Plugin .............................. SUCCESS [ 25.466 s]
[2019-11-27T14:26:06.372Z] [INFO] Maven Failsafe Plugin .............................. SUCCESS [02:28 min]
[2019-11-27T14:26:06.372Z] [INFO] Maven Surefire Report Plugin ....................... SUCCESS [ 21.661 s]
[2019-11-27T14:26:06.372Z] [INFO] Maven Surefire Integration Tests ................... FAILURE [  01:30 h]
[2019-11-27T14:26:06.372Z] [INFO] ------------------------------------------------------------------------
[2019-11-27T14:26:06.372Z] [INFO] BUILD FAILURE
[2019-11-27T14:26:06.372Z] [INFO] ------------------------------------------------------------------------
[2019-11-27T14:26:06.372Z] [INFO] Total time:  01:42 h
[2019-11-27T14:26:06.372Z] [INFO] Finished at: 2019-11-27T06:26:06-08:00
[2019-11-27T14:26:06.372Z] [INFO] ------------------------------------------------------------------------
[2019-11-27T14:26:06.372Z] [ERROR] Failed to execute goal org.apache.maven.plugins:maven-failsafe-plugin:3.0.0-M3:verify (default) on project surefire-its: There are test failures.
[2019-11-27T14:26:06.372Z] [ERROR]
[2019-11-27T14:26:06.372Z] [ERROR] Please refer to C:\Users\jenkins\AppData\Local\Temp\3\jenkins-maven-box-maven-surefire-MasterProcessChannelDecoder-12\surefire-its\target\failsafe-reports for the individual test results.
[2019-11-27T14:26:06.372Z] [ERROR] Please refer to dump files (if any exist) [date].dump, [date]-jvmRun[N].dump and [date].dumpstream.
[2019-11-27T14:26:06.372Z] [ERROR] -> [Help 1]
[2019-11-27T14:26:06.372Z] org.apache.maven.lifecycle.LifecycleExecutionException: Failed to execute goal org.apache.maven.plugins:maven-failsafe-plugin:3.0.0-M3:verify (default) on project surefire-its: There are test failures.
[2019-11-27T14:26:06.372Z]
[2019-11-27T14:26:06.372Z] Please refer to C:\Users\jenkins\AppData\Local\Temp\3\jenkins-maven-box-maven-surefire-MasterProcessChannelDecoder-12\surefire-its\target\failsafe-reports for the individual test results.
[2019-11-27T14:26:06.372Z] Please refer to dump files (if any exist) [date].dump, [date]-jvmRun[N].dump and [date].dumpstream.
[2019-11-27T14:26:06.372Z]     at org.apache.maven.lifecycle.internal.MojoExecutor.execute (MojoExecutor.java:215)
[2019-11-27T14:26:06.372Z]     at org.apache.maven.lifecycle.internal.MojoExecutor.execute (MojoExecutor.java:156)
[2019-11-27T14:26:06.372Z]     at org.apache.maven.lifecycle.internal.MojoExecutor.execute (MojoExecutor.java:148)
[2019-11-27T14:26:06.372Z]     at org.apache.maven.lifecycle.internal.LifecycleModuleBuilder.buildProject (LifecycleModuleBuilder.java:117)
[2019-11-27T14:26:06.372Z]     at org.apache.maven.lifecycle.internal.LifecycleModuleBuilder.buildProject (LifecycleModuleBuilder.java:81)
[2019-11-27T14:26:06.372Z]     at org.apache.maven.lifecycle.internal.builder.singlethreaded.SingleThreadedBuilder.build (SingleThreadedBuilder.java:56)
[2019-11-27T14:26:06.372Z]     at org.apache.maven.lifecycle.internal.LifecycleStarter.execute (LifecycleStarter.java:128)
[2019-11-27T14:26:06.372Z]     at org.apache.maven.DefaultMaven.doExecute (DefaultMaven.java:305)
[2019-11-27T14:26:06.372Z]     at org.apache.maven.DefaultMaven.doExecute (DefaultMaven.java:192)
[2019-11-27T14:26:06.372Z]     at org.apache.maven.DefaultMaven.execute (DefaultMaven.java:105)
[2019-11-27T14:26:06.372Z]     at org.apache.maven.cli.MavenCli.execute (MavenCli.java:956)
[2019-11-27T14:26:06.372Z]     at org.apache.maven.cli.MavenCli.doMain (MavenCli.java:288)
[2019-11-27T14:26:06.372Z]     at org.apache.maven.cli.MavenCli.main (MavenCli.java:192)
[2019-11-27T14:26:06.372Z]     at sun.reflect.NativeMethodAccessorImpl.invoke0 (Native Method)
[2019-11-27T14:26:06.372Z]     at sun.reflect.NativeMethodAccessorImpl.invoke (NativeMethodAccessorImpl.java:62)
[2019-11-27T14:26:06.372Z]     at sun.reflect.DelegatingMethodAccessorImpl.invoke (DelegatingMethodAccessorImpl.java:43)
[2019-11-27T14:26:06.372Z]     at java.lang.reflect.Method.invoke (Method.java:498)
[2019-11-27T14:26:06.372Z]     at org.codehaus.plexus.classworlds.launcher.Launcher.launchEnhanced (Launcher.java:282)
[2019-11-27T14:26:06.372Z]     at org.codehaus.plexus.classworlds.launcher.Launcher.launch (Launcher.java:225)
[2019-11-27T14:26:06.372Z]     at org.codehaus.plexus.classworlds.launcher.Launcher.mainWithExitCode (Launcher.java:406)
[2019-11-27T14:26:06.372Z]     at org.codehaus.plexus.classworlds.launcher.Launcher.main (Launcher.java:347)
[2019-11-27T14:26:06.372Z] Caused by: org.apache.maven.plugin.MojoFailureException: There are test failures.
[2019-11-27T14:26:06.372Z]
[2019-11-27T14:26:06.372Z] Please refer to C:\Users\jenkins\AppData\Local\Temp\3\jenkins-maven-box-maven-surefire-MasterProcessChannelDecoder-12\surefire-its\target\failsafe-reports for the individual test results.
[2019-11-27T14:26:06.372Z] Please refer to dump files (if any exist) [date].dump, [date]-jvmRun[N].dump and [date].dumpstream.
[2019-11-27T14:26:06.372Z]     at org.apache.maven.plugin.surefire.SurefireHelper.throwException (SurefireHelper.java:271)
[2019-11-27T14:26:06.372Z]     at org.apache.maven.plugin.surefire.SurefireHelper.reportExecution (SurefireHelper.java:159)
[2019-11-27T14:26:06.372Z]     at org.apache.maven.plugin.failsafe.VerifyMojo.execute (VerifyMojo.java:192)
[2019-11-27T14:26:06.372Z]     at org.apache.maven.plugin.DefaultBuildPluginManager.executeMojo (DefaultBuildPluginManager.java:137)
[2019-11-27T14:26:06.372Z]     at org.apache.maven.lifecycle.internal.MojoExecutor.execute (MojoExecutor.java:210)
[2019-11-27T14:26:06.372Z]     at org.apache.maven.lifecycle.internal.MojoExecutor.execute (MojoExecutor.java:156)
[2019-11-27T14:26:06.372Z]     at org.apache.maven.lifecycle.internal.MojoExecutor.execute (MojoExecutor.java:148)
[2019-11-27T14:26:06.373Z]     at org.apache.maven.lifecycle.internal.LifecycleModuleBuilder.buildProject (LifecycleModuleBuilder.java:117)
[2019-11-27T14:26:06.373Z]     at org.apache.maven.lifecycle.internal.LifecycleModuleBuilder.buildProject (LifecycleModuleBuilder.java:81)
[2019-11-27T14:26:06.373Z]     at org.apache.maven.lifecycle.internal.builder.singlethreaded.SingleThreadedBuilder.build (SingleThreadedBuilder.java:56)
[2019-11-27T14:26:06.373Z]     at org.apache.maven.lifecycle.internal.LifecycleStarter.execute (LifecycleStarter.java:128)
[2019-11-27T14:26:06.373Z]     at org.apache.maven.DefaultMaven.doExecute (DefaultMaven.java:305)
[2019-11-27T14:26:06.373Z]     at org.apache.maven.DefaultMaven.doExecute (DefaultMaven.java:192)
[2019-11-27T14:26:06.373Z]     at org.apache.maven.DefaultMaven.execute (DefaultMaven.java:105)
[2019-11-27T14:26:06.373Z]     at org.apache.maven.cli.MavenCli.execute (MavenCli.java:956)
[2019-11-27T14:26:06.373Z]     at org.apache.maven.cli.MavenCli.doMain (MavenCli.java:288)
[2019-11-27T14:26:06.373Z]     at org.apache.maven.cli.MavenCli.main (MavenCli.java:192)
[2019-11-27T14:26:06.373Z]     at sun.reflect.NativeMethodAccessorImpl.invoke0 (Native Method)
[2019-11-27T14:26:06.373Z]     at sun.reflect.NativeMethodAccessorImpl.invoke (NativeMethodAccessorImpl.java:62)
[2019-11-27T14:26:06.373Z]     at sun.reflect.DelegatingMethodAccessorImpl.invoke (DelegatingMethodAccessorImpl.java:43)
[2019-11-27T14:26:06.373Z]     at java.lang.reflect.Method.invoke (Method.java:498)
[2019-11-27T14:26:06.373Z]     at org.codehaus.plexus.classworlds.launcher.Launcher.launchEnhanced (Launcher.java:282)
[2019-11-27T14:26:06.373Z]     at org.codehaus.plexus.classworlds.launcher.Launcher.launch (Launcher.java:225)
[2019-11-27T14:26:06.373Z]     at org.codehaus.plexus.classworlds.launcher.Launcher.mainWithExitCode (Launcher.java:406)
[2019-11-27T14:26:06.373Z]     at org.codehaus.plexus.classworlds.launcher.Launcher.main (Launcher.java:347)
[2019-11-27T14:26:06.373Z] [ERROR]
[2019-11-27T14:26:06.373Z] [ERROR] Re-run Maven using the -X switch to enable full debug logging.
[2019-11-27T14:26:06.373Z] [ERROR]
[2019-11-27T14:26:06.373Z] [ERROR] For more information about the errors and possible solutions, please read the following articles:
[2019-11-27T14:26:06.373Z] [ERROR] [Help 1] http://cwiki.apache.org/confluence/display/MAVEN/MojoFailureException
[2019-11-27T14:26:06.373Z] [ERROR]
[2019-11-27T14:26:06.373Z] [ERROR] After correcting the problems, you can resume the build with the command
[2019-11-27T14:26:06.373Z] [ERROR]   mvn <args> -rf :surefire-its
[Pipeline] }
[Pipeline] // withEnv
[Pipeline] }
[Pipeline] // stage
[Pipeline] fileExists
[Pipeline] zip
[2019-11-27T14:26:06.517Z] Writing zip file of C:\Users\jenkins\AppData\Local\Temp\3\jenkins-maven-box-maven-surefire-MasterProcessChannelDecoder-12\maven-failsafe-plugin\target\it to C:\Users\jenkins\AppData\Local\Temp\3\jenkins-maven-box-maven-surefire-MasterProcessChannelDecoder-12\maven-failsafe-plugin--windows-jdk11-maven3.6.x.zip
[2019-11-27T14:26:06.629Z] Zipped 78 entries.
[2019-11-27T14:26:06.629Z] Archiving C:\Users\jenkins\AppData\Local\Temp\3\jenkins-maven-box-maven-surefire-MasterProcessChannelDecoder-12\maven-failsafe-plugin--windows-jdk11-maven3.6.x.zip
[2019-11-27T14:26:06.631Z] [Fast Archiver] No artifacts from Maven TLP » maven-surefire » MasterProcessChannelDecoder #1 to compare, so performing full copy of artifacts
[Pipeline] fileExists
[Pipeline] zip
[2019-11-27T14:26:06.735Z] Writing zip file of C:\Users\jenkins\AppData\Local\Temp\3\jenkins-maven-box-maven-surefire-MasterProcessChannelDecoder-12\surefire-its\target to C:\Users\jenkins\AppData\Local\Temp\3\jenkins-maven-box-maven-surefire-MasterProcessChannelDecoder-12\surefire-its--windows-jdk11-maven3.6.x.zip
[2019-11-27T14:26:20.828Z] Zipped 16372 entries.
[2019-11-27T14:26:20.828Z] Archiving C:\Users\jenkins\AppData\Local\Temp\3\jenkins-maven-box-maven-surefire-MasterProcessChannelDecoder-12\surefire-its--windows-jdk11-maven3.6.x.zip
[2019-11-27T14:26:20.829Z] [Fast Archiver] No artifacts from Maven TLP » maven-surefire » MasterProcessChannelDecoder #1 to compare, so performing full copy of artifacts
[Pipeline] archiveArtifacts
[2019-11-27T14:26:22.676Z] Archiving artifacts
[2019-11-27T14:26:22.688Z] [Fast Archiver] No artifacts from Maven TLP » maven-surefire » MasterProcessChannelDecoder #1 to compare, so performing full copy of artifacts
[Pipeline] cleanWs
[2019-11-27T14:26:24.476Z] [WS-CLEANUP] Deleting project workspace...
[2019-11-27T14:26:24.476Z] [WS-CLEANUP] Deferred wipeout is used...
[2019-11-27T14:26:24.603Z] [WS-CLEANUP] done
[Pipeline] }
[Pipeline] // ws
[Pipeline] }
[Pipeline] // timestamps
[Pipeline] }
[Pipeline] // node
[Pipeline] }
[Pipeline] // parallel
[Pipeline] echo
Build result: FAILURE
[Pipeline] jiraIssueSelector
[Pipeline] echo
The authors of changes [rfscholte, hboutemy].
[Pipeline] echo
Sending email ...
[Pipeline] emailext