Build failed in Jenkins: Maven TLP » maven-studies » maven-extension-demo #5

Previous Topic Next Topic
 
classic Classic list List threaded Threaded
2 messages Options
Reply | Threaded
Open this post in threaded view
|

Build failed in Jenkins: Maven TLP » maven-studies » maven-extension-demo #5

Apache Jenkins Server-2
See https://builds.apache.org/job/maven-box/job/maven-studies/job/maven-extension-demo/5/

Changes:

* improve display of ExecutionEvent and RepositoryEvent

No tests ran.

Build log:
[...truncated 30577 lines...]
[Pipeline] cleanWs
[WS-CLEANUP] Deleting project workspace...
[WS-CLEANUP] Deferred wipeout is used...
[Pipeline] }
[WS-CLEANUP] done
[Pipeline] // dir
[Pipeline] }
[Pipeline] cleanWs
[WS-CLEANUP] Deleting project workspace...
[WS-CLEANUP] Deferred wipeout is used...
[WS-CLEANUP] done
[Pipeline] }
[withMaven] junitPublisher - Archive test results for Maven artifact org.apache.maven.demo:maven-extension-demo:jar:0.0.1-SNAPSHOT generated by maven-surefire-plugin:test (default-test): windows-jdk14-m3.6.x_build\target\surefire-reports\*.xml
Recording test results
None of the test reports contained any result
[withMaven] openTasksPublisher - Scan Tasks for Maven artifact org.apache.maven.demo:maven-extension-demo:jar:0.0.1-SNAPSHOT in source directory windows-jdk14-m3.6.x_build\src\main\java
[TASKS] Scanning folder 'f:\jenkins\jenkins-slave\workspace\ven-studies_maven-extension-demo@2@2' for files matching the pattern 'windows-jdk14-m3.6.x_build\src\main\java\**\*' - excludes: null
[TASKS] Found 4 files to scan for tasks
[TASKS] Found 0 open tasks.
Skipping warnings blame since pipelines do not have an SCM link.%n
[Pipeline] // stage
[TASKS] Computing warning deltas based on reference build #4
[Pipeline] }
[withMaven] invokerPublisher - Archive invoker results for Maven artifact MavenArtifact{org.apache.maven.demo:maven-extension-demo:jar:0.0.1-SNAPSHOT(version: 0.0.1-SNAPSHOT, snapshot:false) } generated by PluginInvocation{org.apache.maven.plugins:maven-invoker-plugin:3.2.1@integration-test  integration-test}: windows-jdk14-m3.6.x_build\target\invoker-reports\*.xml
[Pipeline] // ws
[Pipeline] }
[Pipeline] // node
[Pipeline] }
Failed in branch windows-jdk11-m3.6.x_build

f:\jenkins\jenkins-slave\workspace\ven-studies_maven-extension-demo@2\windows-jdk15-m3.6.x_build>wmic logicaldisk get size,freespace,caption
Caption FreeSpace Size

C: 1941432676352 1999872454656

F: 1953585893376 2000396742656

[withMaven] Publishers: Generated Artifacts Publisher: 12 ms, Junit Publisher: 9 ms, Open Task Scanner Publisher: 30 ms, Invoker Publisher: 1256 ms
[Pipeline] // withMaven
[Pipeline] cleanWs
[WS-CLEANUP] Deleting project workspace...
[WS-CLEANUP] Deferred wipeout is used...
[WS-CLEANUP] done
[Pipeline] cleanWs
[WS-CLEANUP] Deleting project workspace...
[WS-CLEANUP] Deferred wipeout is used...
[WS-CLEANUP] done
[Pipeline] }
[Pipeline] // stage
[Pipeline] }
[Pipeline] // ws
[Pipeline] }
[Pipeline] // node
[Pipeline] }
Failed in branch windows-jdk14-m3.6.x_build

[Pipeline] bat

f:\jenkins\jenkins-slave\workspace\ven-studies_maven-extension-demo@2\windows-jdk15-m3.6.x_build>mvn -P+run-its -Dmaven.test.failure.ignore=true -Dfindbugs.failOnError=false -e clean verify
----- withMaven Wrapper script -----
Picked up JAVA_TOOL_OPTIONS: -Dmaven.ext.class.path="f:\jenkins\jenkins-slave\workspace\ven-studies_maven-extension-demo@2@tmp\withMaven4cfde770\pipeline-maven-spy.jar" -Dorg.jenkinsci.plugins.pipeline.maven.reportsFolder="f:\jenkins\jenkins-slave\workspace\ven-studies_maven-extension-demo@2@tmp\withMaven4cfde770"
Apache Maven 3.6.2 (40f52333136460af0dc0d7232c0dc0bcf0d9e117; 2019-08-27T08:06:16-07:00)
Maven home: F:\jenkins\tools\maven\apache-maven-3.6.2\bin\..
Java version: 15-ea, vendor: Oracle Corporation, runtime: f:\jenkins\tools\java\latest15
Default locale: en_US, platform encoding: Cp1252
OS name: "windows server 2016", version: "10.0", arch: "amd64", family: "windows"
[INFO] [jenkins-event-spy] Generate F:\jenkins\jenkins-slave\workspace\ven-studies_maven-extension-demo@2@tmp\withMaven4cfde770\maven-spy-20200614-103342-6021929310429704102195.log.tmp ...
[INFO] Error stacktraces are turned on.
[INFO] Scanning for projects...
[INFO]
[INFO] -------------< org.apache.maven.demo:maven-extension-demo >-------------
[INFO] Building maven-extension-demo 0.0.1-SNAPSHOT
[INFO] --------------------------------[ jar ]---------------------------------
[INFO]
[INFO] --- maven-clean-plugin:3.1.0:clean (default-clean) @ maven-extension-demo ---
[INFO]
[INFO] --- maven-enforcer-plugin:1.4.1:enforce (enforce-maven-version) @ maven-extension-demo ---
[INFO]
[INFO] --- maven-enforcer-plugin:1.4.1:enforce (enforce-bytecode-version) @ maven-extension-demo ---
[INFO] Adding ignore: module-info
[INFO]
[INFO] --- apache-rat-plugin:0.13:check (rat-check) @ maven-extension-demo ---
[INFO] Enabled default license matchers.
[INFO] Will parse SCM ignores for exclusions...
[INFO] Parsing exclusions from f:\jenkins\jenkins-slave\workspace\ven-studies_maven-extension-demo@2\windows-jdk15-m3.6.x_build\.gitignore
[INFO] Finished adding exclusions from SCM ignore files.
[INFO] 72 implicit excludes (use -debug for more details).
[INFO] 5 explicit excludes (use -debug for more details).
[INFO] 20 resources included (use -debug for more details)
[INFO] Rat check: Summary over all files. Unapproved: 0, unknown: 0, generated: 0, approved: 20 licenses.
[INFO]
[INFO] --- maven-remote-resources-plugin:1.7.0:process (process-resource-bundles) @ maven-extension-demo ---
[INFO] Preparing remote bundle org.apache:apache-jar-resource-bundle:1.4
[INFO] Copying 3 resources from 1 bundle.
[INFO]
[INFO] --- maven-resources-plugin:3.1.0:resources (default-resources) @ maven-extension-demo ---
[INFO] Using 'UTF-8' encoding to copy filtered resources.
[INFO] skip non existing resourceDirectory f:\jenkins\jenkins-slave\workspace\ven-studies_maven-extension-demo@2\windows-jdk15-m3.6.x_build\src\main\resources
[INFO] Copying 3 resources
[INFO]
[INFO] --- maven-compiler-plugin:3.8.1:compile (default-compile) @ maven-extension-demo ---
[INFO] Changes detected - recompiling the module!
[INFO] Compiling 4 source files to f:\jenkins\jenkins-slave\workspace\ven-studies_maven-extension-demo@2\windows-jdk15-m3.6.x_build\target\classes
[INFO]
[INFO] --- sisu-maven-plugin:0.3.3:main-index (generate-index) @ maven-extension-demo ---
[INFO]
[INFO] --- plexus-component-metadata:2.0.0:generate-metadata (default) @ maven-extension-demo ---
[INFO] Discovered 2 component descriptors(s)
[INFO]
[INFO] --- maven-resources-plugin:3.1.0:testResources (default-testResources) @ maven-extension-demo ---
[INFO] Using 'UTF-8' encoding to copy filtered resources.
[INFO] skip non existing resourceDirectory f:\jenkins\jenkins-slave\workspace\ven-studies_maven-extension-demo@2\windows-jdk15-m3.6.x_build\src\test\resources
[INFO] Copying 3 resources
[INFO]
[INFO] --- maven-compiler-plugin:3.8.1:testCompile (default-testCompile) @ maven-extension-demo ---
[INFO] No sources to compile
[INFO]
[INFO] --- maven-surefire-plugin:2.22.0:test (default-test) @ maven-extension-demo ---
[INFO]
[INFO] --- maven-jar-plugin:3.2.0:jar (default-jar) @ maven-extension-demo ---
[INFO] Building jar: f:\jenkins\jenkins-slave\workspace\ven-studies_maven-extension-demo@2\windows-jdk15-m3.6.x_build\target\maven-extension-demo-0.0.1-SNAPSHOT.jar
[INFO]
[INFO] --- maven-site-plugin:3.7.1:attach-descriptor (attach-descriptor) @ maven-extension-demo ---
[INFO] Skipping because packaging 'jar' is not pom.
[INFO]
[INFO] --- maven-invoker-plugin:3.2.1:install (integration-test) @ maven-extension-demo ---
[INFO] Installing f:\jenkins\jenkins-slave\workspace\ven-studies_maven-extension-demo@2\windows-jdk15-m3.6.x_build\pom.xml to f:\jenkins\jenkins-slave\workspace\ven-studies_maven-extension-demo@2\windows-jdk15-m3.6.x_build\target\local-repo\org\apache\maven\demo\maven-extension-demo\0.0.1-SNAPSHOT\maven-extension-demo-0.0.1-SNAPSHOT.pom
[INFO] Installing f:\jenkins\jenkins-slave\workspace\ven-studies_maven-extension-demo@2\windows-jdk15-m3.6.x_build\target\maven-extension-demo-0.0.1-SNAPSHOT.jar to f:\jenkins\jenkins-slave\workspace\ven-studies_maven-extension-demo@2\windows-jdk15-m3.6.x_build\target\local-repo\org\apache\maven\demo\maven-extension-demo\0.0.1-SNAPSHOT\maven-extension-demo-0.0.1-SNAPSHOT.jar
[INFO]
[INFO] --- maven-invoker-plugin:3.2.1:integration-test (integration-test) @ maven-extension-demo ---
[INFO] Building: -Dmaven.ext.class.path\pom.xml
[INFO] run post-build script verify.groovy
WARNING: An illegal reflective access operation has occurred
WARNING: Illegal reflective access by org.codehaus.groovy.reflection.CachedClass (file:/f:/jenkins/jenkins-slave/workspace/.maven_repositories/1/org/codehaus/groovy/groovy-all/2.4.8/groovy-all-2.4.8.jar) to method java.lang.Object.finalize()
WARNING: Please consider reporting this to the maintainers of org.codehaus.groovy.reflection.CachedClass
WARNING: Use --illegal-access=warn to enable warnings of further illegal reflective access operations
WARNING: All illegal access operations will be denied in a future release
[INFO]           -Dmaven.ext.class.path\pom.xml ................... SUCCESS (44.0 s)
[INFO] Building: mvnExtensions\pom.xml
[INFO] run post-build script verify.groovy
[INFO]           mvnExtensions\pom.xml ............................ SUCCESS (11.4 s)
[INFO] Building: pomExtension\pom.xml
[INFO] run post-build script verify.groovy
[INFO]           pomExtension\pom.xml ............................. SUCCESS (7.6 s)
[INFO]
[INFO] --- maven-checkstyle-plugin:3.0.0:check (checkstyle-check) @ maven-extension-demo ---
[INFO] There is 1 error reported by Checkstyle 6.18 with config/maven_checks.xml ruleset.
[ERROR] src\main\java\org\apache\maven\demo\extension\EventSpyDemo.java:[79] (sizes) LineLength: Line is longer than 120 characters (found 146).
[INFO] ------------------------------------------------------------------------
[INFO] BUILD FAILURE
[INFO] ------------------------------------------------------------------------
[INFO] Total time:  01:12 min
[INFO] Finished at: 2020-06-14T10:34:55-07:00
[INFO] ------------------------------------------------------------------------
[INFO] [jenkins-event-spy] Generated F:\jenkins\jenkins-slave\workspace\ven-studies_maven-extension-demo@2@tmp\withMaven4cfde770\maven-spy-20200614-103342-6021929310429704102195.log
[ERROR] Failed to execute goal org.apache.maven.plugins:maven-checkstyle-plugin:3.0.0:check (checkstyle-check) on project maven-extension-demo: You have 1 Checkstyle violation. -> [Help 1]
org.apache.maven.lifecycle.LifecycleExecutionException: Failed to execute goal org.apache.maven.plugins:maven-checkstyle-plugin:3.0.0:check (checkstyle-check) on project maven-extension-demo: You have 1 Checkstyle violation.
    at org.apache.maven.lifecycle.internal.MojoExecutor.execute (MojoExecutor.java:215)
    at org.apache.maven.lifecycle.internal.MojoExecutor.execute (MojoExecutor.java:156)
    at org.apache.maven.lifecycle.internal.MojoExecutor.execute (MojoExecutor.java:148)
    at org.apache.maven.lifecycle.internal.LifecycleModuleBuilder.buildProject (LifecycleModuleBuilder.java:117)
    at org.apache.maven.lifecycle.internal.LifecycleModuleBuilder.buildProject (LifecycleModuleBuilder.java:81)
    at org.apache.maven.lifecycle.internal.builder.singlethreaded.SingleThreadedBuilder.build (SingleThreadedBuilder.java:56)
    at org.apache.maven.lifecycle.internal.LifecycleStarter.execute (LifecycleStarter.java:128)
    at org.apache.maven.DefaultMaven.doExecute (DefaultMaven.java:305)
    at org.apache.maven.DefaultMaven.doExecute (DefaultMaven.java:192)
    at org.apache.maven.DefaultMaven.execute (DefaultMaven.java:105)
    at org.apache.maven.cli.MavenCli.execute (MavenCli.java:956)
    at org.apache.maven.cli.MavenCli.doMain (MavenCli.java:288)
    at org.apache.maven.cli.MavenCli.main (MavenCli.java:192)
    at jdk.internal.reflect.NativeMethodAccessorImpl.invoke0 (Native Method)
    at jdk.internal.reflect.NativeMethodAccessorImpl.invoke (NativeMethodAccessorImpl.java:62)
    at jdk.internal.reflect.DelegatingMethodAccessorImpl.invoke (DelegatingMethodAccessorImpl.java:43)
    at java.lang.reflect.Method.invoke (Method.java:564)
    at org.codehaus.plexus.classworlds.launcher.Launcher.launchEnhanced (Launcher.java:282)
    at org.codehaus.plexus.classworlds.launcher.Launcher.launch (Launcher.java:225)
    at org.codehaus.plexus.classworlds.launcher.Launcher.mainWithExitCode (Launcher.java:406)
    at org.codehaus.plexus.classworlds.launcher.Launcher.main (Launcher.java:347)
Caused by: org.apache.maven.plugin.MojoFailureException: You have 1 Checkstyle violation.
    at org.apache.maven.plugins.checkstyle.CheckstyleViolationCheckMojo.execute (CheckstyleViolationCheckMojo.java:576)
    at org.apache.maven.plugin.DefaultBuildPluginManager.executeMojo (DefaultBuildPluginManager.java:137)
    at org.apache.maven.lifecycle.internal.MojoExecutor.execute (MojoExecutor.java:210)
    at org.apache.maven.lifecycle.internal.MojoExecutor.execute (MojoExecutor.java:156)
    at org.apache.maven.lifecycle.internal.MojoExecutor.execute (MojoExecutor.java:148)
    at org.apache.maven.lifecycle.internal.LifecycleModuleBuilder.buildProject (LifecycleModuleBuilder.java:117)
    at org.apache.maven.lifecycle.internal.LifecycleModuleBuilder.buildProject (LifecycleModuleBuilder.java:81)
    at org.apache.maven.lifecycle.internal.builder.singlethreaded.SingleThreadedBuilder.build (SingleThreadedBuilder.java:56)
    at org.apache.maven.lifecycle.internal.LifecycleStarter.execute (LifecycleStarter.java:128)
    at org.apache.maven.DefaultMaven.doExecute (DefaultMaven.java:305)
    at org.apache.maven.DefaultMaven.doExecute (DefaultMaven.java:192)
    at org.apache.maven.DefaultMaven.execute (DefaultMaven.java:105)
    at org.apache.maven.cli.MavenCli.execute (MavenCli.java:956)
    at org.apache.maven.cli.MavenCli.doMain (MavenCli.java:288)
    at org.apache.maven.cli.MavenCli.main (MavenCli.java:192)
    at jdk.internal.reflect.NativeMethodAccessorImpl.invoke0 (Native Method)
    at jdk.internal.reflect.NativeMethodAccessorImpl.invoke (NativeMethodAccessorImpl.java:62)
    at jdk.internal.reflect.DelegatingMethodAccessorImpl.invoke (DelegatingMethodAccessorImpl.java:43)
    at java.lang.reflect.Method.invoke (Method.java:564)
    at org.codehaus.plexus.classworlds.launcher.Launcher.launchEnhanced (Launcher.java:282)
    at org.codehaus.plexus.classworlds.launcher.Launcher.launch (Launcher.java:225)
    at org.codehaus.plexus.classworlds.launcher.Launcher.mainWithExitCode (Launcher.java:406)
    at org.codehaus.plexus.classworlds.launcher.Launcher.main (Launcher.java:347)
[ERROR]
[ERROR] Re-run Maven using the -X switch to enable full debug logging.
[ERROR]
[ERROR] For more information about the errors and possible solutions, please read the following articles:
[ERROR] [Help 1] http://cwiki.apache.org/confluence/display/MAVEN/MojoFailureException
[Pipeline] }
[Pipeline] // dir
[Pipeline] }
[withMaven] junitPublisher - Archive test results for Maven artifact org.apache.maven.demo:maven-extension-demo:jar:0.0.1-SNAPSHOT generated by maven-surefire-plugin:test (default-test): windows-jdk15-m3.6.x_build\target\surefire-reports\*.xml
Recording test results
None of the test reports contained any result
[withMaven] openTasksPublisher - Scan Tasks for Maven artifact org.apache.maven.demo:maven-extension-demo:jar:0.0.1-SNAPSHOT in source directory windows-jdk15-m3.6.x_build\src\main\java
[TASKS] Scanning folder 'f:\jenkins\jenkins-slave\workspace\ven-studies_maven-extension-demo@2' for files matching the pattern 'windows-jdk15-m3.6.x_build\src\main\java\**\*' - excludes: null
[TASKS] Found 4 files to scan for tasks
[TASKS] Found 0 open tasks.
Skipping warnings blame since pipelines do not have an SCM link.%n
[TASKS] Computing warning deltas based on reference build #4
[withMaven] invokerPublisher - Archive invoker results for Maven artifact MavenArtifact{org.apache.maven.demo:maven-extension-demo:jar:0.0.1-SNAPSHOT(version: 0.0.1-SNAPSHOT, snapshot:false) } generated by PluginInvocation{org.apache.maven.plugins:maven-invoker-plugin:3.2.1@integration-test  integration-test}: windows-jdk15-m3.6.x_build\target\invoker-reports\*.xml
[withMaven] Publishers: Generated Artifacts Publisher: 2406 ms, Junit Publisher: 919 ms, Open Task Scanner Publisher: 1949 ms, Invoker Publisher: 20934 ms
[Pipeline] // withMaven
[Pipeline] cleanWs
[WS-CLEANUP] Deleting project workspace...
[WS-CLEANUP] Deferred wipeout is used...
[WS-CLEANUP] done
[Pipeline] cleanWs
[WS-CLEANUP] Deleting project workspace...
[WS-CLEANUP] Deferred wipeout is used...
[WS-CLEANUP] done
[Pipeline] }
[Pipeline] // stage
[Pipeline] }
[Pipeline] // ws
[Pipeline] }
[Pipeline] // node
[Pipeline] }
Failed in branch windows-jdk15-m3.6.x_build
[Pipeline] // parallel
[Pipeline] stage
[Pipeline] { (Notifications)
[Pipeline] echo
Build result: FAILURE
[Pipeline] jiraIssueSelector
[Pipeline] echo
The authors of changes [hboutemy].
[Pipeline] echo
Sending email ...
[Pipeline] emailext
Reply | Threaded
Open this post in threaded view
|

Build succeeded in Jenkins: Maven TLP » maven-studies » maven-extension-demo #6

Apache Jenkins Server-2