Build failed in Jenkins: Maven TLP » maven-studies » maven-extension-demo #2

classic Classic list List threaded Threaded
2 messages Options
Reply | Threaded
Open this post in threaded view
|

Build failed in Jenkins: Maven TLP » maven-studies » maven-extension-demo #2

Apache Jenkins Server-2
See https://builds.apache.org/job/maven-box/job/maven-studies/job/maven-extension-demo/2/

Changes:

* more explanations
* add readme

No tests ran.

Build log:
[...truncated 29820 lines...]
[INFO] --------------------------------[ jar ]---------------------------------
[INFO]
[INFO] --- maven-clean-plugin:3.1.0:clean (default-clean) @ maven-extension-demo ---
[INFO]
[INFO] --- maven-enforcer-plugin:1.4.1:enforce (enforce-maven-version) @ maven-extension-demo ---
[INFO]
[INFO] --- maven-enforcer-plugin:1.4.1:enforce (enforce-bytecode-version) @ maven-extension-demo ---
[INFO]
[INFO] --- maven-enforcer-plugin:1.4.1:enforce (ban-known-bad-maven-versions) @ maven-extension-demo ---
[INFO]
[INFO] --- apache-rat-plugin:0.12:check (rat-check) @ maven-extension-demo ---
[INFO] Enabled default license matchers.
[INFO] Will parse SCM ignores for exclusions...
[INFO] Parsing exclusions from f:\jenkins\jenkins-slave\workspace\ven-studies_maven-extension-demo@3\windows-jdk14-m3.6.x_build\.gitignore
[INFO] Finished adding exclusions from SCM ignore files.
[INFO] 71 implicit excludes (use -debug for more details).
[INFO] Exclude: .repository/**
[INFO] Exclude: .maven/spy.log
[INFO] Exclude: dependency-reduced-pom.xml
[INFO] Exclude: .java-version
[INFO] 20 resources included (use -debug for more details)
[INFO] Rat check: Summary over all files. Unapproved: 0, unknown: 0, generated: 0, approved: 20 licenses.
[INFO]
[INFO] --- maven-remote-resources-plugin:1.5:process (process-resource-bundles) @ maven-extension-demo ---
[INFO]
[INFO] --- maven-resources-plugin:3.1.0:resources (default-resources) @ maven-extension-demo ---
[INFO] Using 'UTF-8' encoding to copy filtered resources.
[INFO] skip non existing resourceDirectory f:\jenkins\jenkins-slave\workspace\ven-studies_maven-extension-demo@3\windows-jdk14-m3.6.x_build\src\main\resources
[INFO] Copying 3 resources
[INFO]
[INFO] --- maven-compiler-plugin:3.7.0:compile (default-compile) @ maven-extension-demo ---
[INFO] Changes detected - recompiling the module!
[INFO] Compiling 4 source files to f:\jenkins\jenkins-slave\workspace\ven-studies_maven-extension-demo@3\windows-jdk14-m3.6.x_build\target\classes
[INFO] -------------------------------------------------------------
[ERROR] COMPILATION ERROR :
[INFO] -------------------------------------------------------------
[ERROR] Source option 6 is no longer supported. Use 7 or later.
[ERROR] Target option 6 is no longer supported. Use 7 or later.
[INFO] 2 errors
[INFO] -------------------------------------------------------------
[INFO] ------------------------------------------------------------------------
[INFO] BUILD FAILURE
[INFO] ------------------------------------------------------------------------
[INFO] Total time:  4.069 s
[INFO] Finished at: 2020-06-14T09:12:18-07:00
[INFO] ------------------------------------------------------------------------
[INFO] [jenkins-event-spy] Generated F:\jenkins\jenkins-slave\workspace\ven-studies_maven-extension-demo@3@tmp\withMavenbd55230e\maven-spy-20200614-091214-48413876386293581756174.log
[ERROR] Failed to execute goal org.apache.maven.plugins:maven-compiler-plugin:3.7.0:compile (default-compile) on project maven-extension-demo: Compilation failure: Compilation failure:
[ERROR] Source option 6 is no longer supported. Use 7 or later.
[ERROR] Target option 6 is no longer supported. Use 7 or later.
[ERROR] -> [Help 1]
org.apache.maven.lifecycle.LifecycleExecutionException: Failed to execute goal org.apache.maven.plugins:maven-compiler-plugin:3.7.0:compile (default-compile) on project maven-extension-demo: Compilation failure
    at org.apache.maven.lifecycle.internal.MojoExecutor.execute (MojoExecutor.java:215)
    at org.apache.maven.lifecycle.internal.MojoExecutor.execute (MojoExecutor.java:156)
    at org.apache.maven.lifecycle.internal.MojoExecutor.execute (MojoExecutor.java:148)
    at org.apache.maven.lifecycle.internal.LifecycleModuleBuilder.buildProject (LifecycleModuleBuilder.java:117)
    at org.apache.maven.lifecycle.internal.LifecycleModuleBuilder.buildProject (LifecycleModuleBuilder.java:81)
    at org.apache.maven.lifecycle.internal.builder.singlethreaded.SingleThreadedBuilder.build (SingleThreadedBuilder.java:56)
    at org.apache.maven.lifecycle.internal.LifecycleStarter.execute (LifecycleStarter.java:128)
    at org.apache.maven.DefaultMaven.doExecute (DefaultMaven.java:305)
    at org.apache.maven.DefaultMaven.doExecute (DefaultMaven.java:192)
    at org.apache.maven.DefaultMaven.execute (DefaultMaven.java:105)
    at org.apache.maven.cli.MavenCli.execute (MavenCli.java:956)
    at org.apache.maven.cli.MavenCli.doMain (MavenCli.java:288)
    at org.apache.maven.cli.MavenCli.main (MavenCli.java:192)
    at jdk.internal.reflect.NativeMethodAccessorImpl.invoke0 (Native Method)
    at jdk.internal.reflect.NativeMethodAccessorImpl.invoke (NativeMethodAccessorImpl.java:62)
    at jdk.internal.reflect.DelegatingMethodAccessorImpl.invoke (DelegatingMethodAccessorImpl.java:43)
    at java.lang.reflect.Method.invoke (Method.java:567)
    at org.codehaus.plexus.classworlds.launcher.Launcher.launchEnhanced (Launcher.java:282)
    at org.codehaus.plexus.classworlds.launcher.Launcher.launch (Launcher.java:225)
    at org.codehaus.plexus.classworlds.launcher.Launcher.mainWithExitCode (Launcher.java:406)
    at org.codehaus.plexus.classworlds.launcher.Launcher.main (Launcher.java:347)
Caused by: org.apache.maven.plugin.compiler.CompilationFailureException: Compilation failure
    at org.apache.maven.plugin.compiler.AbstractCompilerMojo.execute (AbstractCompilerMojo.java:1161)
    at org.apache.maven.plugin.compiler.CompilerMojo.execute (CompilerMojo.java:168)
    at org.apache.maven.plugin.DefaultBuildPluginManager.executeMojo (DefaultBuildPluginManager.java:137)
    at org.apache.maven.lifecycle.internal.MojoExecutor.execute (MojoExecutor.java:210)
    at org.apache.maven.lifecycle.internal.MojoExecutor.execute (MojoExecutor.java:156)
    at org.apache.maven.lifecycle.internal.MojoExecutor.execute (MojoExecutor.java:148)
    at org.apache.maven.lifecycle.internal.LifecycleModuleBuilder.buildProject (LifecycleModuleBuilder.java:117)
    at org.apache.maven.lifecycle.internal.LifecycleModuleBuilder.buildProject (LifecycleModuleBuilder.java:81)
    at org.apache.maven.lifecycle.internal.builder.singlethreaded.SingleThreadedBuilder.build (SingleThreadedBuilder.java:56)
    at org.apache.maven.lifecycle.internal.LifecycleStarter.execute (LifecycleStarter.java:128)
    at org.apache.maven.DefaultMaven.doExecute (DefaultMaven.java:305)
    at org.apache.maven.DefaultMaven.doExecute (DefaultMaven.java:192)
    at org.apache.maven.DefaultMaven.execute (DefaultMaven.java:105)
    at org.apache.maven.cli.MavenCli.execute (MavenCli.java:956)
    at org.apache.maven.cli.MavenCli.doMain (MavenCli.java:288)
    at org.apache.maven.cli.MavenCli.main (MavenCli.java:192)
    at jdk.internal.reflect.NativeMethodAccessorImpl.invoke0 (Native Method)
    at jdk.internal.reflect.NativeMethodAccessorImpl.invoke (NativeMethodAccessorImpl.java:62)
    at jdk.internal.reflect.DelegatingMethodAccessorImpl.invoke (DelegatingMethodAccessorImpl.java:43)
    at java.lang.reflect.Method.invoke (Method.java:567)
    at org.codehaus.plexus.classworlds.launcher.Launcher.launchEnhanced (Launcher.java:282)
    at org.codehaus.plexus.classworlds.launcher.Launcher.launch (Launcher.java:225)
    at org.codehaus.plexus.classworlds.launcher.Launcher.mainWithExitCode (Launcher.java:406)
    at org.codehaus.plexus.classworlds.launcher.Launcher.main (Launcher.java:347)
[ERROR]
[ERROR] Re-run Maven using the -X switch to enable full debug logging.
[ERROR]
[ERROR] For more information about the errors and possible solutions, please read the following articles:
[ERROR] [Help 1] http://cwiki.apache.org/confluence/display/MAVEN/MojoFailureException
[Pipeline] }
[Pipeline] // dir
[Pipeline] }
[Fast Archiver] No prior successful build to compare, so performing full copy of artifacts
[withMaven] openTasksPublisher - Scan Tasks for Maven artifact org.apache.maven.demo:maven-extension-demo:jar:0.0.1-SNAPSHOT in source directory windows-jdk14-m3.6.x_build\src\main\java
[TASKS] Scanning folder 'f:\jenkins\jenkins-slave\workspace\ven-studies_maven-extension-demo@3' for files matching the pattern 'windows-jdk14-m3.6.x_build\src\main\java\**\*' - excludes: null
[TASKS] Found 4 files to scan for tasks
[TASKS] Found 0 open tasks.
Skipping warnings blame since pipelines do not have an SCM link.%n
[withMaven] Publishers: Generated Artifacts Publisher: 11 ms, Open Task Scanner Publisher: 29 ms
[Pipeline] // withMaven
[Pipeline] cleanWs
[WS-CLEANUP] Deleting project workspace...
[WS-CLEANUP] Deferred wipeout is used...
[WS-CLEANUP] done
[Pipeline] cleanWs
[WS-CLEANUP] Deleting project workspace...
[WS-CLEANUP] Deferred wipeout is used...
[WS-CLEANUP] done
[Pipeline] }
[Pipeline] // stage
[Pipeline] }
[Pipeline] // ws
[Pipeline] }
[Pipeline] // node
[Pipeline] }
Failed in branch windows-jdk14-m3.6.x_build
[INFO] run post-build script verify.groovy
WARNING: An illegal reflective access operation has occurred
WARNING: Illegal reflective access by org.codehaus.groovy.reflection.CachedClass (file:/f:/jenkins/jenkins-slave/workspace/.maven_repositories/1/org/codehaus/groovy/groovy-all/2.4.8/groovy-all-2.4.8.jar) to method java.lang.Object.finalize()
WARNING: Please consider reporting this to the maintainers of org.codehaus.groovy.reflection.CachedClass
WARNING: Use --illegal-access=warn to enable warnings of further illegal reflective access operations
WARNING: All illegal access operations will be denied in a future release
[INFO]           -Dmaven.ext.class.path\pom.xml ................... SUCCESS (32.4 s)
[INFO] Building: mvnExtensions\pom.xml
[INFO] run post-build script verify.groovy
[INFO]           -Dmaven.ext.class.path\pom.xml ................... SUCCESS (37.4 s)
[INFO] Building: mvnExtensions\pom.xml
[INFO] run post-build script verify.groovy
[INFO]           mvnExtensions\pom.xml ............................ SUCCESS (9.7 s)
[INFO] Building: pomExtension\pom.xml
[INFO] run post-build script verify.groovy
[INFO]           mvnExtensions\pom.xml ............................ SUCCESS (8.5 s)
[INFO] Building: pomExtension\pom.xml
[INFO] run post-build script verify.groovy
[INFO]           pomExtension\pom.xml ............................. SUCCESS (5.5 s)
[INFO]
[INFO] --- maven-checkstyle-plugin:3.0.0:check (checkstyle-check) @ maven-extension-demo ---
[INFO] run post-build script verify.groovy
[INFO]           pomExtension\pom.xml ............................. SUCCESS (6.2 s)
[INFO]
[INFO] --- maven-checkstyle-plugin:3.0.0:check (checkstyle-check) @ maven-extension-demo ---
[INFO]
[INFO] --- maven-invoker-plugin:3.1.0:verify (integration-test) @ maven-extension-demo ---
[INFO] -------------------------------------------------
[INFO] Build Summary:
[INFO]   Passed: 3, Failed: 0, Errors: 0, Skipped: 0
[INFO] -------------------------------------------------
[INFO] ------------------------------------------------------------------------
[INFO] BUILD SUCCESS
[INFO] ------------------------------------------------------------------------
[INFO] Total time:  55.514 s
[INFO] Finished at: 2020-06-14T09:13:00-07:00
[INFO] ------------------------------------------------------------------------
[INFO] [jenkins-event-spy] Generated F:\jenkins\jenkins-slave\workspace\ven-studies_maven-extension-demo@2@2@tmp\withMaven02063a89\maven-spy-20200614-091205-5512808344515392255453.log
[Pipeline] }
[Pipeline] // dir
[Pipeline] }
[withMaven] artifactsPublisher - Archive artifact windows-jdk11-m3.6.x_build\pom.xml under org\apache\maven\demo\maven-extension-demo\0.0.1-SNAPSHOT\maven-extension-demo-0.0.1-SNAPSHOT.pom
[withMaven] artifactsPublisher - Archive artifact windows-jdk11-m3.6.x_build\target\maven-extension-demo-0.0.1-SNAPSHOT.jar under org\apache\maven\demo\maven-extension-demo\0.0.1-SNAPSHOT\maven-extension-demo-0.0.1-SNAPSHOT.jar
[Fast Archiver] No prior successful build to compare, so performing full copy of artifacts
[withMaven] junitPublisher - Archive test results for Maven artifact org.apache.maven.demo:maven-extension-demo:jar:0.0.1-SNAPSHOT generated by maven-surefire-plugin:test (default-test): windows-jdk11-m3.6.x_build\target\surefire-reports\*.xml
Recording test results
None of the test reports contained any result
[withMaven] openTasksPublisher - Scan Tasks for Maven artifact org.apache.maven.demo:maven-extension-demo:jar:0.0.1-SNAPSHOT in source directory windows-jdk11-m3.6.x_build\src\main\java
[TASKS] Scanning folder 'f:\jenkins\jenkins-slave\workspace\ven-studies_maven-extension-demo@2@2' for files matching the pattern 'windows-jdk11-m3.6.x_build\src\main\java\**\*' - excludes: null
[TASKS] Found 4 files to scan for tasks
[TASKS] Found 0 open tasks.
Skipping warnings blame since pipelines do not have an SCM link.%n
[withMaven] invokerPublisher - Archive invoker results for Maven artifact MavenArtifact{org.apache.maven.demo:maven-extension-demo:jar:0.0.1-SNAPSHOT(version: 0.0.1-SNAPSHOT, snapshot:false) } generated by PluginInvocation{org.apache.maven.plugins:maven-invoker-plugin:3.1.0@integration-test  integration-test}: windows-jdk11-m3.6.x_build\target\invoker-reports\*.xml
[INFO]
[INFO] --- maven-invoker-plugin:3.1.0:verify (integration-test) @ maven-extension-demo ---
[INFO] -------------------------------------------------
[INFO] Build Summary:
[INFO]   Passed: 3, Failed: 0, Errors: 0, Skipped: 0
[INFO] -------------------------------------------------
[INFO] ------------------------------------------------------------------------
[INFO] BUILD SUCCESS
[INFO] ------------------------------------------------------------------------
[INFO] Total time:  58.715 s
[INFO] Finished at: 2020-06-14T09:13:36-07:00
[INFO] ------------------------------------------------------------------------
[INFO] [jenkins-event-spy] Generated F:\jenkins\jenkins-slave\workspace\ven-studies_maven-extension-demo@3@tmp\withMavenc6f6062b\maven-spy-20200614-091237-556344971948796595933.log
Picked up JAVA_TOOL_OPTIONS: -Dmaven.ext.class.path="f:\jenkins\jenkins-slave\workspace\ven-studies_maven-extension-demo@3@tmp\withMavenc6f6062b\pipeline-maven-spy.jar" -Dorg.jenkinsci.plugins.pipeline.maven.reportsFolder="f:\jenkins\jenkins-slave\workspace\ven-studies_maven-extension-demo@3@tmp\withMavenc6f6062b"
[Pipeline] }
[Pipeline] // dir
[Pipeline] }
[withMaven] artifactsPublisher - Archive artifact windows-jdk8-m3.6.x_build\pom.xml under org\apache\maven\demo\maven-extension-demo\0.0.1-SNAPSHOT\maven-extension-demo-0.0.1-SNAPSHOT.pom
[withMaven] artifactsPublisher - Archive artifact windows-jdk8-m3.6.x_build\target\maven-extension-demo-0.0.1-SNAPSHOT.jar under org\apache\maven\demo\maven-extension-demo\0.0.1-SNAPSHOT\maven-extension-demo-0.0.1-SNAPSHOT.jar
[Fast Archiver] No prior successful build to compare, so performing full copy of artifacts
[withMaven] junitPublisher - Archive test results for Maven artifact org.apache.maven.demo:maven-extension-demo:jar:0.0.1-SNAPSHOT generated by maven-surefire-plugin:test (default-test): windows-jdk8-m3.6.x_build\target\surefire-reports\*.xml
Recording test results
None of the test reports contained any result
[withMaven] openTasksPublisher - Scan Tasks for Maven artifact org.apache.maven.demo:maven-extension-demo:jar:0.0.1-SNAPSHOT in source directory windows-jdk8-m3.6.x_build\src\main\java
[TASKS] Scanning folder 'f:\jenkins\jenkins-slave\workspace\ven-studies_maven-extension-demo@3' for files matching the pattern 'windows-jdk8-m3.6.x_build\src\main\java\**\*' - excludes: null
[TASKS] Found 4 files to scan for tasks
[TASKS] Found 0 open tasks.
Skipping warnings blame since pipelines do not have an SCM link.%n
[withMaven] invokerPublisher - Archive invoker results for Maven artifact MavenArtifact{org.apache.maven.demo:maven-extension-demo:jar:0.0.1-SNAPSHOT(version: 0.0.1-SNAPSHOT, snapshot:false) } generated by PluginInvocation{org.apache.maven.plugins:maven-invoker-plugin:3.1.0@integration-test  integration-test}: windows-jdk8-m3.6.x_build\target\invoker-reports\*.xml
[withMaven] Publishers: Generated Artifacts Publisher: 55 ms, Junit Publisher: 9 ms, Open Task Scanner Publisher: 28 ms, Invoker Publisher: 567 ms
[Pipeline] // withMaven
[Pipeline] cleanWs
[WS-CLEANUP] Deleting project workspace...
[WS-CLEANUP] Deferred wipeout is used...
[WS-CLEANUP] done
[Pipeline] }
[Pipeline] // stage
[Pipeline] }
[Pipeline] // ws
[Pipeline] }
[Pipeline] // node
[Pipeline] }
[withMaven] Publishers: Generated Artifacts Publisher: 55 ms, Junit Publisher: 13 ms, Open Task Scanner Publisher: 34 ms, Invoker Publisher: 718 ms, Pipeline Graph Publisher: 1 ms
[Pipeline] // withMaven
[Pipeline] cleanWs
[WS-CLEANUP] Deleting project workspace...
[WS-CLEANUP] Deferred wipeout is used...
[WS-CLEANUP] done
[Pipeline] }
[Pipeline] // stage
[Pipeline] }
[Pipeline] // ws
[Pipeline] }
[Pipeline] // node
[Pipeline] }
[Pipeline] // parallel
[Pipeline] stage
[Pipeline] { (Notifications)
[Pipeline] echo
Build result: FAILURE
[Pipeline] jiraIssueSelector
[Pipeline] echo
The authors of changes [hboutemy].
[Pipeline] echo
Sending email ...
[Pipeline] emailext
Reply | Threaded
Open this post in threaded view
|

Build succeeded in Jenkins: Maven TLP » maven-studies » maven-extension-demo #3

Apache Jenkins Server-2
See https://builds.apache.org/job/maven-box/job/maven-studies/job/maven-extension-demo/3/

Changes:

* update parent pom
* link to IT results

No tests ran.