Build failed in Jenkins: Maven TLP » maven-source-plugin » stabilize #2

Previous Topic Next Topic
 
classic Classic list List threaded Threaded
3 messages Options
Reply | Threaded
Open this post in threaded view
|

Build failed in Jenkins: Maven TLP » maven-source-plugin » stabilize #2

Apache Jenkins Server-2
See https://builds.apache.org/job/maven-box/job/maven-source-plugin/job/stabilize/2/

Changes:

* Call initialize phase, will trigger ant:sleep on unix+JDK8

All tests passed

Build log:
[...truncated 41515 lines...]
[INFO]           verify-parameter-goal-jar-no-fork\pom.xml ........ SUCCESS (3.3 s)
[INFO] Building: verify-parameter-goal-test-jar\pom.xml
[INFO] run post-build script verify.groovy
[INFO]           verify-parameter-goal-test-jar\pom.xml ........... SUCCESS (3.5 s)
[INFO] Building: verify-parameter-goal-test-jar-no-fork\pom.xml
[INFO] run post-build script verify.bsh
[INFO]           jar\pom.xml ...................................... SUCCESS (6.7 s)
[INFO] Building: jar-attached\pom.xml
[INFO] run post-build script verify.groovy
[INFO]           MSOURCES-95\pom.xml .............................. SUCCESS (5.8 s)
[INFO] Building: project-without-sources\pom.xml
[INFO] run post-build script verify.groovy
[INFO]           verify-parameter-goal-test-jar-no-fork\pom.xml ... SUCCESS (3.2 s)
[INFO]
[INFO] --- maven-checkstyle-plugin:3.0.0:check (checkstyle-check) @ maven-source-plugin ---
[INFO] run post-build script verify.bsh
[INFO]           project-without-sources\pom.xml .................. SUCCESS (3.0 s)
[INFO] Building: reproducible\pom.xml
[INFO]
[INFO] --- maven-invoker-plugin:3.2.1:verify (integration-test) @ maven-source-plugin ---
[INFO] -------------------------------------------------
[INFO] Build Summary:
[INFO]   Passed: 22, Failed: 0, Errors: 0, Skipped: 0
[INFO] -------------------------------------------------
[INFO] ------------------------------------------------------------------------
[INFO] BUILD SUCCESS
[INFO] ------------------------------------------------------------------------
[INFO] Total time:  02:05 min
[INFO] Finished at: 2020-07-31T08:10:03-07:00
[INFO] ------------------------------------------------------------------------
[INFO] [jenkins-event-spy] Generated F:\jenkins\jenkins-slave\workspace\ox_maven-source-plugin_stabilize@2@tmp\withMavenc588938f\maven-spy-20200731-080757-3927917609813717051901.log
[Pipeline] }
[Pipeline] // dir
[Pipeline] }
[withMaven] artifactsPublisher - Archive artifact windows-jdk11-m3.6.x_build\pom.xml under org\apache\maven\plugins\maven-source-plugin\3.2.2-SNAPSHOT\maven-source-plugin-3.2.2-SNAPSHOT.pom
[withMaven] artifactsPublisher - Archive artifact windows-jdk11-m3.6.x_build\target\maven-source-plugin-3.2.2-SNAPSHOT.jar under org\apache\maven\plugins\maven-source-plugin\3.2.2-SNAPSHOT\maven-source-plugin-3.2.2-SNAPSHOT.jar
[Fast Archiver] No prior successful build to compare, so performing full copy of artifacts
[withMaven] junitPublisher - Archive test results for Maven artifact org.apache.maven.plugins:maven-source-plugin:maven-plugin:3.2.2-SNAPSHOT generated by maven-surefire-plugin:test (default-test): windows-jdk11-m3.6.x_build\target\surefire-reports\*.xml
Recording test results
[withMaven] openTasksPublisher - Scan Tasks for Maven artifact org.apache.maven.plugins:maven-source-plugin:maven-plugin:3.2.2-SNAPSHOT in source directory windows-jdk11-m3.6.x_build\src\main\java
[TASKS] Scanning folder 'f:\jenkins\jenkins-slave\workspace\ox_maven-source-plugin_stabilize@2' for files matching the pattern 'windows-jdk11-m3.6.x_build\src\main\java\**\*' - excludes: null
[TASKS] Found 7 files to scan for tasks
[TASKS] Found 0 open tasks.
Skipping warnings blame since pipelines do not have an SCM link.%n
[withMaven] invokerPublisher - Archive invoker results for Maven artifact MavenArtifact{org.apache.maven.plugins:maven-source-plugin:maven-plugin:3.2.2-SNAPSHOT(version: 3.2.2-SNAPSHOT, snapshot:false) } generated by PluginInvocation{org.apache.maven.plugins:maven-invoker-plugin:3.2.1@integration-test  integration-test}: windows-jdk11-m3.6.x_build\target\invoker-reports\*.xml
[withMaven] Publishers: Generated Artifacts Publisher: 64 ms, Junit Publisher: 80 ms, Open Task Scanner Publisher: 37 ms, Invoker Publisher: 4591 ms, Pipeline Graph Publisher: 1 ms
[Pipeline] // withMaven
[Pipeline] cleanWs
[WS-CLEANUP] Deleting project workspace...
[WS-CLEANUP] Deferred wipeout is used...
[WS-CLEANUP] done
[Pipeline] }
[Pipeline] // stage
[Pipeline] }
[Pipeline] // ws
[Pipeline] }
[Pipeline] // node
[Pipeline] }
[INFO] run post-build script verify.groovy
[INFO]           reproducible\pom.xml ............................. SUCCESS (9.1 s)
[INFO] Building: test-jar\pom.xml
[INFO] run post-build script verify.bsh
[INFO]           jar-attached\pom.xml ............................. SUCCESS (15.0 s)
[INFO] Building: jar-classifier\pom.xml
[INFO] run post-build script verify.bsh
[INFO]           test-jar\pom.xml ................................. SUCCESS (3.1 s)
[INFO] Building: test-jar-classifier\pom.xml
[INFO] run post-build script verify.bsh
[INFO]           jar-classifier\pom.xml ........................... SUCCESS (3.4 s)
[INFO] Building: jar-includes-excludes\pom.xml
[INFO] run post-build script verify.bsh
[INFO]           test-jar-classifier\pom.xml ...................... SUCCESS (3.5 s)
[INFO] Building: test-jar-generated\pom.xml
[INFO] run post-build script verify.bsh
[INFO]           test-jar-generated\pom.xml ....................... SUCCESS (5.1 s)
[INFO] Building: test-jar-no-fork\pom.xml
[INFO] run post-build script verify.bsh
[INFO]           jar-includes-excludes\pom.xml .................... SUCCESS (7.1 s)
[INFO] Building: jar-no-fork\pom.xml
[INFO] run post-build script verify.bsh
[INFO]           test-jar-no-fork\pom.xml ......................... SUCCESS (5.9 s)
[INFO] Building: verify-parameter-goal-generated-test-jar\pom.xml
[INFO] run post-build script verify.bsh
[INFO]           jar-no-fork\pom.xml .............................. SUCCESS (6.1 s)
[INFO] Building: jar-with-archive-config\pom.xml
[INFO] run post-build script verify.groovy
[INFO]           verify-parameter-goal-generated-test-jar\pom.xml . SUCCESS (3.2 s)
[INFO] Building: verify-parameter-goal-jar\pom.xml
[INFO] run post-build script verify.bsh
[INFO]           jar-with-archive-config\pom.xml .................. SUCCESS (3.0 s)
[INFO] Building: jar-without-descriptor-config\pom.xml
[INFO] run post-build script verify.bsh
[INFO]           jar-without-descriptor-config\pom.xml ............ SUCCESS (2.1 s)
[INFO] Building: manifest-content\pom.xml
[INFO] run post-build script verify.groovy
[INFO]           verify-parameter-goal-jar\pom.xml ................ SUCCESS (3.0 s)
[INFO] Building: verify-parameter-goal-jar-no-fork\pom.xml
[INFO] run post-build script verify.groovy
[INFO]           verify-parameter-goal-jar-no-fork\pom.xml ........ SUCCESS (3.0 s)
[INFO] Building: verify-parameter-goal-test-jar\pom.xml
[INFO] run post-build script verify.bsh
[INFO]           manifest-content\pom.xml ......................... SUCCESS (2.9 s)
[INFO] Building: MSOURCES-62\pom.xml
[INFO] run post-build script verify.groovy
[INFO]           verify-parameter-goal-test-jar\pom.xml ........... SUCCESS (3.0 s)
[INFO] Building: verify-parameter-goal-test-jar-no-fork\pom.xml
[INFO] run post-build script verify.bsh
[INFO]           MSOURCES-62\pom.xml .............................. SUCCESS (3.7 s)
[INFO] Building: MSOURCES-64\pom.xml
[INFO] run post-build script verify.groovy
[INFO]           verify-parameter-goal-test-jar-no-fork\pom.xml ... SUCCESS (3.0 s)
[INFO]
[INFO] --- maven-checkstyle-plugin:3.0.0:check (checkstyle-check) @ maven-source-plugin ---
[INFO]
[INFO] --- maven-invoker-plugin:3.2.1:verify (integration-test) @ maven-source-plugin ---
[INFO] -------------------------------------------------
[INFO] Build Summary:
[INFO]   Passed: 22, Failed: 0, Errors: 0, Skipped: 0
[INFO] -------------------------------------------------
[INFO] ------------------------------------------------------------------------
[INFO] BUILD SUCCESS
[INFO] ------------------------------------------------------------------------
[INFO] Total time:  02:04 min
[INFO] Finished at: 2020-07-31T08:10:17-07:00
[INFO] ------------------------------------------------------------------------
[INFO] [jenkins-event-spy] Generated F:\jenkins\jenkins-slave\workspace\ox_maven-source-plugin_stabilize@3@2@tmp\withMaven9ad77092\maven-spy-20200731-080813-42711601875325730886494.log
[Pipeline] }
[Pipeline] // dir
[Pipeline] }
[withMaven] artifactsPublisher - Archive artifact windows-jdk14-m3.6.x_build\pom.xml under org\apache\maven\plugins\maven-source-plugin\3.2.2-SNAPSHOT\maven-source-plugin-3.2.2-SNAPSHOT.pom
[withMaven] artifactsPublisher - Archive artifact windows-jdk14-m3.6.x_build\target\maven-source-plugin-3.2.2-SNAPSHOT.jar under org\apache\maven\plugins\maven-source-plugin\3.2.2-SNAPSHOT\maven-source-plugin-3.2.2-SNAPSHOT.jar
[Fast Archiver] No prior successful build to compare, so performing full copy of artifacts
[withMaven] junitPublisher - Archive test results for Maven artifact org.apache.maven.plugins:maven-source-plugin:maven-plugin:3.2.2-SNAPSHOT generated by maven-surefire-plugin:test (default-test): windows-jdk14-m3.6.x_build\target\surefire-reports\*.xml
Recording test results
[withMaven] openTasksPublisher - Scan Tasks for Maven artifact org.apache.maven.plugins:maven-source-plugin:maven-plugin:3.2.2-SNAPSHOT in source directory windows-jdk14-m3.6.x_build\src\main\java
[TASKS] Scanning folder 'f:\jenkins\jenkins-slave\workspace\ox_maven-source-plugin_stabilize@3@2' for files matching the pattern 'windows-jdk14-m3.6.x_build\src\main\java\**\*' - excludes: null
[TASKS] Found 7 files to scan for tasks
[TASKS] Found 0 open tasks.
Skipping warnings blame since pipelines do not have an SCM link.%n
[withMaven] invokerPublisher - Archive invoker results for Maven artifact MavenArtifact{org.apache.maven.plugins:maven-source-plugin:maven-plugin:3.2.2-SNAPSHOT(version: 3.2.2-SNAPSHOT, snapshot:false) } generated by PluginInvocation{org.apache.maven.plugins:maven-invoker-plugin:3.2.1@integration-test  integration-test}: windows-jdk14-m3.6.x_build\target\invoker-reports\*.xml
[INFO] run post-build script verify.groovy
WARNING: An illegal reflective access operation has occurred
WARNING: Illegal reflective access by org.codehaus.groovy.reflection.CachedClass (file:/f:/jenkins/jenkins-slave/workspace/.maven_repositories/1/org/codehaus/groovy/groovy-all/2.4.8/groovy-all-2.4.8.jar) to method java.lang.Object.finalize()
WARNING: Please consider reporting this to the maintainers of org.codehaus.groovy.reflection.CachedClass
WARNING: Use --illegal-access=warn to enable warnings of further illegal reflective access operations
WARNING: All illegal access operations will be denied in a future release
[INFO]           MSOURCES-64\pom.xml .............................. SUCCESS (5.1 s)
[INFO] Building: MSOURCES-95\pom.xml
[withMaven] Publishers: Generated Artifacts Publisher: 55 ms, Junit Publisher: 80 ms, Open Task Scanner Publisher: 35 ms, Invoker Publisher: 4320 ms, Pipeline Graph Publisher: 1 ms
[Pipeline] // withMaven
[Pipeline] cleanWs
[WS-CLEANUP] Deleting project workspace...
[WS-CLEANUP] Deferred wipeout is used...
[WS-CLEANUP] done
[Pipeline] }
[Pipeline] // stage
[Pipeline] }
[Pipeline] // ws
[Pipeline] }
[Pipeline] // node
[Pipeline] }
[INFO] run post-build script verify.groovy
[INFO]           MSOURCES-95\pom.xml .............................. SUCCESS (6.4 s)
[INFO] Building: project-without-sources\pom.xml
[INFO] run post-build script verify.bsh
[INFO]           project-without-sources\pom.xml .................. SUCCESS (3.1 s)
[INFO] Building: reproducible\pom.xml
[INFO] run post-build script verify.groovy
[INFO]           reproducible\pom.xml ............................. SUCCESS (9.0 s)
[INFO] Building: test-jar\pom.xml
[INFO] run post-build script verify.bsh
[INFO]           test-jar\pom.xml ................................. SUCCESS (3.4 s)
[INFO] Building: test-jar-classifier\pom.xml
[INFO] run post-build script verify.bsh
[INFO]           test-jar-classifier\pom.xml ...................... SUCCESS (3.5 s)
[INFO] Building: test-jar-generated\pom.xml
[INFO] run post-build script verify.bsh
[INFO]           test-jar-generated\pom.xml ....................... SUCCESS (5.4 s)
[INFO] Building: test-jar-no-fork\pom.xml
[INFO] run post-build script verify.bsh
[INFO]           test-jar-no-fork\pom.xml ......................... SUCCESS (6.5 s)
[INFO] Building: verify-parameter-goal-generated-test-jar\pom.xml
[INFO] run post-build script verify.groovy
[INFO]           verify-parameter-goal-generated-test-jar\pom.xml . SUCCESS (3.1 s)
[INFO] Building: verify-parameter-goal-jar\pom.xml
[INFO] run post-build script verify.groovy
[INFO]           verify-parameter-goal-jar\pom.xml ................ SUCCESS (3.1 s)
[INFO] Building: verify-parameter-goal-jar-no-fork\pom.xml
[INFO] run post-build script verify.groovy
[INFO]           verify-parameter-goal-jar-no-fork\pom.xml ........ SUCCESS (3.2 s)
[INFO] Building: verify-parameter-goal-test-jar\pom.xml
[INFO] run post-build script verify.groovy
[INFO]           verify-parameter-goal-test-jar\pom.xml ........... SUCCESS (3.0 s)
[INFO] Building: verify-parameter-goal-test-jar-no-fork\pom.xml
[INFO] run post-build script verify.groovy
[INFO]           verify-parameter-goal-test-jar-no-fork\pom.xml ... SUCCESS (3.0 s)
[INFO]
[INFO] --- maven-checkstyle-plugin:3.0.0:check (checkstyle-check) @ maven-source-plugin ---
[INFO]
[INFO] --- maven-invoker-plugin:3.2.1:verify (integration-test) @ maven-source-plugin ---
[INFO] -------------------------------------------------
[INFO] Build Summary:
[INFO]   Passed: 22, Failed: 0, Errors: 0, Skipped: 0
[INFO] -------------------------------------------------
[INFO] ------------------------------------------------------------------------
[INFO] BUILD SUCCESS
[INFO] ------------------------------------------------------------------------
[INFO] Total time:  02:04 min
[INFO] Finished at: 2020-07-31T08:11:41-07:00
[INFO] ------------------------------------------------------------------------
[INFO] [jenkins-event-spy] Generated F:\jenkins\jenkins-slave\workspace\ox_maven-source-plugin_stabilize@3@2@tmp\withMaven8d74096b\maven-spy-20200731-080936-82016294144215830448430.log
[Pipeline] }
[Pipeline] // dir
[Pipeline] }
[withMaven] artifactsPublisher - Archive artifact windows-jdk15-m3.6.x_build\pom.xml under org\apache\maven\plugins\maven-source-plugin\3.2.2-SNAPSHOT\maven-source-plugin-3.2.2-SNAPSHOT.pom
[withMaven] artifactsPublisher - Archive artifact windows-jdk15-m3.6.x_build\target\maven-source-plugin-3.2.2-SNAPSHOT.jar under org\apache\maven\plugins\maven-source-plugin\3.2.2-SNAPSHOT\maven-source-plugin-3.2.2-SNAPSHOT.jar
[Fast Archiver] No prior successful build to compare, so performing full copy of artifacts
[withMaven] junitPublisher - Archive test results for Maven artifact org.apache.maven.plugins:maven-source-plugin:maven-plugin:3.2.2-SNAPSHOT generated by maven-surefire-plugin:test (default-test): windows-jdk15-m3.6.x_build\target\surefire-reports\*.xml
Recording test results
[withMaven] openTasksPublisher - Scan Tasks for Maven artifact org.apache.maven.plugins:maven-source-plugin:maven-plugin:3.2.2-SNAPSHOT in source directory windows-jdk15-m3.6.x_build\src\main\java
[TASKS] Scanning folder 'f:\jenkins\jenkins-slave\workspace\ox_maven-source-plugin_stabilize@3@2' for files matching the pattern 'windows-jdk15-m3.6.x_build\src\main\java\**\*' - excludes: null
[TASKS] Found 7 files to scan for tasks
[TASKS] Found 0 open tasks.
Skipping warnings blame since pipelines do not have an SCM link.%n
[withMaven] invokerPublisher - Archive invoker results for Maven artifact MavenArtifact{org.apache.maven.plugins:maven-source-plugin:maven-plugin:3.2.2-SNAPSHOT(version: 3.2.2-SNAPSHOT, snapshot:false) } generated by PluginInvocation{org.apache.maven.plugins:maven-invoker-plugin:3.2.1@integration-test  integration-test}: windows-jdk15-m3.6.x_build\target\invoker-reports\*.xml
[withMaven] Publishers: Generated Artifacts Publisher: 51 ms, Junit Publisher: 69 ms, Open Task Scanner Publisher: 30 ms, Invoker Publisher: 4507 ms, Pipeline Graph Publisher: 1 ms
[Pipeline] // withMaven
[Pipeline] cleanWs
[WS-CLEANUP] Deleting project workspace...
[WS-CLEANUP] Deferred wipeout is used...
[WS-CLEANUP] done
[Pipeline] }
[Pipeline] // stage
[Pipeline] }
[Pipeline] // ws
[Pipeline] }
[Pipeline] // node
[Pipeline] }
[Pipeline] // parallel
[Pipeline] stage
[Pipeline] { (Notifications)
[Pipeline] echo
Build result: FAILURE
[Pipeline] jiraIssueSelector
[Pipeline] echo
The authors of changes [rfscholte].
[Pipeline] echo
Sending email ...
[Pipeline] emailext
Reply | Threaded
Open this post in threaded view
|

Build failed in Jenkins: Maven TLP » maven-source-plugin » stabilize #3

Apache Jenkins Server-2
See https://builds.apache.org/job/maven-box/job/maven-source-plugin/job/stabilize/3/

Changes:

* Fix JDK range

All tests passed

Build log:
[...truncated 41950 lines...]
[Pipeline] // dir
[Pipeline] }
[withMaven] artifactsPublisher - Archive artifact windows-jdk8-m3.6.x_build\pom.xml under org\apache\maven\plugins\maven-source-plugin\3.2.2-SNAPSHOT\maven-source-plugin-3.2.2-SNAPSHOT.pom
[withMaven] artifactsPublisher - Archive artifact windows-jdk8-m3.6.x_build\target\maven-source-plugin-3.2.2-SNAPSHOT.jar under org\apache\maven\plugins\maven-source-plugin\3.2.2-SNAPSHOT\maven-source-plugin-3.2.2-SNAPSHOT.jar
[Fast Archiver] No prior successful build to compare, so performing full copy of artifacts
[withMaven] junitPublisher - Archive test results for Maven artifact org.apache.maven.plugins:maven-source-plugin:maven-plugin:3.2.2-SNAPSHOT generated by maven-surefire-plugin:test (default-test): windows-jdk8-m3.6.x_build\target\surefire-reports\*.xml
Recording test results
[withMaven] openTasksPublisher - Scan Tasks for Maven artifact org.apache.maven.plugins:maven-source-plugin:maven-plugin:3.2.2-SNAPSHOT in source directory windows-jdk8-m3.6.x_build\src\main\java
[TASKS] Scanning folder 'f:\jenkins\jenkins-slave\workspace\ox_maven-source-plugin_stabilize@3' for files matching the pattern 'windows-jdk8-m3.6.x_build\src\main\java\**\*' - excludes: null
[TASKS] Found 7 files to scan for tasks
[TASKS] Found 0 open tasks.
Skipping warnings blame since pipelines do not have an SCM link.%n
[withMaven] invokerPublisher - Archive invoker results for Maven artifact MavenArtifact{org.apache.maven.plugins:maven-source-plugin:maven-plugin:3.2.2-SNAPSHOT(version: 3.2.2-SNAPSHOT, snapshot:false) } generated by PluginInvocation{org.apache.maven.plugins:maven-invoker-plugin:3.2.1@integration-test  integration-test}: windows-jdk8-m3.6.x_build\target\invoker-reports\*.xml
[withMaven] openTasksPublisher - Scan Tasks for Maven artifact org.apache.maven.plugins:maven-source-plugin:maven-plugin:3.2.2-SNAPSHOT in source directory linux-jdk14-m3.6.x_build/src/main/java
[TASKS] Scanning folder '/home/jenkins/jenkins-slave/workspace/ox_maven-source-plugin_stabilize@2' for files matching the pattern 'linux-jdk14-m3.6.x_build/src/main/java/**/*' - excludes: null
[TASKS] Found 7 files to scan for tasks
[TASKS] Found 0 open tasks.
Skipping warnings blame since pipelines do not have an SCM link.%n
[withMaven] invokerPublisher - Archive invoker results for Maven artifact MavenArtifact{org.apache.maven.plugins:maven-source-plugin:maven-plugin:3.2.2-SNAPSHOT(version: 3.2.2-SNAPSHOT, snapshot:false) } generated by PluginInvocation{org.apache.maven.plugins:maven-invoker-plugin:3.2.1@integration-test  integration-test}: linux-jdk14-m3.6.x_build/target/invoker-reports/*.xml
[INFO] run post-build script verify.groovy
[INFO]           verify-parameter-goal-test-jar-no-fork\pom.xml ... SUCCESS (3.1 s)
[INFO]
[INFO] --- maven-checkstyle-plugin:3.0.0:check (checkstyle-check) @ maven-source-plugin ---
[INFO] run post-build script verify.bsh
[INFO]           test-jar\pom.xml ................................. SUCCESS (3.0 s)
[INFO] Building: test-jar-classifier\pom.xml
[INFO] run post-build script verify.bsh
[INFO]           test-jar\pom.xml ................................. SUCCESS (3.1 s)
[INFO] Building: test-jar-classifier\pom.xml
[INFO]
[INFO] --- maven-invoker-plugin:3.2.1:verify (integration-test) @ maven-source-plugin ---
[INFO] -------------------------------------------------
[INFO] Build Summary:
[INFO]   Passed: 22, Failed: 0, Errors: 0, Skipped: 0
[INFO] -------------------------------------------------
[INFO] ------------------------------------------------------------------------
[INFO] BUILD SUCCESS
[INFO] ------------------------------------------------------------------------
[INFO] Total time:  02:02 min
[INFO] Finished at: 2020-07-31T08:18:34-07:00
[INFO] ------------------------------------------------------------------------
[INFO] [jenkins-event-spy] Generated F:\jenkins\jenkins-slave\workspace\ox_maven-source-plugin_stabilize@2@2@tmp\withMaven37ffbeb2\maven-spy-20200731-081631-1859995722823146557599.log
[Pipeline] }
[Pipeline] // dir
[Pipeline] }
[withMaven] artifactsPublisher - Archive artifact windows-jdk11-m3.6.x_build\pom.xml under org\apache\maven\plugins\maven-source-plugin\3.2.2-SNAPSHOT\maven-source-plugin-3.2.2-SNAPSHOT.pom
[withMaven] artifactsPublisher - Archive artifact windows-jdk11-m3.6.x_build\target\maven-source-plugin-3.2.2-SNAPSHOT.jar under org\apache\maven\plugins\maven-source-plugin\3.2.2-SNAPSHOT\maven-source-plugin-3.2.2-SNAPSHOT.jar
[Fast Archiver] No prior successful build to compare, so performing full copy of artifacts
[withMaven] junitPublisher - Archive test results for Maven artifact org.apache.maven.plugins:maven-source-plugin:maven-plugin:3.2.2-SNAPSHOT generated by maven-surefire-plugin:test (default-test): windows-jdk11-m3.6.x_build\target\surefire-reports\*.xml
Recording test results
[withMaven] openTasksPublisher - Scan Tasks for Maven artifact org.apache.maven.plugins:maven-source-plugin:maven-plugin:3.2.2-SNAPSHOT in source directory windows-jdk11-m3.6.x_build\src\main\java
[TASKS] Scanning folder 'f:\jenkins\jenkins-slave\workspace\ox_maven-source-plugin_stabilize@2@2' for files matching the pattern 'windows-jdk11-m3.6.x_build\src\main\java\**\*' - excludes: null
[TASKS] Found 7 files to scan for tasks
[TASKS] Found 0 open tasks.
Skipping warnings blame since pipelines do not have an SCM link.%n
[withMaven] invokerPublisher - Archive invoker results for Maven artifact MavenArtifact{org.apache.maven.plugins:maven-source-plugin:maven-plugin:3.2.2-SNAPSHOT(version: 3.2.2-SNAPSHOT, snapshot:false) } generated by PluginInvocation{org.apache.maven.plugins:maven-invoker-plugin:3.2.1@integration-test  integration-test}: windows-jdk11-m3.6.x_build\target\invoker-reports\*.xml
[INFO] run post-build script verify.bsh
[INFO]           test-jar-classifier\pom.xml ...................... SUCCESS (3.5 s)
[INFO] Building: test-jar-generated\pom.xml
[withMaven] Publishers: Generated Artifacts Publisher: 56 ms, Junit Publisher: 78 ms, Open Task Scanner Publisher: 45 ms, Invoker Publisher: 4547 ms, Pipeline Graph Publisher: 1 ms
[Pipeline] // withMaven
[INFO] run post-build script verify.bsh
[INFO]           test-jar-classifier\pom.xml ...................... SUCCESS (3.6 s)
[INFO] Building: test-jar-generated\pom.xml
[Pipeline] cleanWs
[WS-CLEANUP] Deleting project workspace...
[WS-CLEANUP] Deferred wipeout is used...
[WS-CLEANUP] done
[Pipeline] }
[Pipeline] // stage
[Pipeline] }
[Pipeline] // ws
[Pipeline] }
[Pipeline] // node
[Pipeline] }
[withMaven] Publishers: Generated Artifacts Publisher: 61 ms, Junit Publisher: 87 ms, Open Task Scanner Publisher: 39 ms, Invoker Publisher: 4829 ms, Pipeline Graph Publisher: 1 ms
[Pipeline] // withMaven
[Pipeline] cleanWs
[WS-CLEANUP] Deleting project workspace...
[WS-CLEANUP] Deferred wipeout is used...
[WS-CLEANUP] done
[Pipeline] }
[Pipeline] // stage
[Pipeline] }
[Pipeline] // ws
[Pipeline] }
[Pipeline] // node
[Pipeline] }
[INFO] run post-build script verify.bsh
[INFO]           test-jar-generated\pom.xml ....................... SUCCESS (4.9 s)
[INFO] Building: test-jar-no-fork\pom.xml
[INFO] run post-build script verify.bsh
[INFO]           test-jar-generated\pom.xml ....................... SUCCESS (5.0 s)
[INFO] Building: test-jar-no-fork\pom.xml
[withMaven] Publishers: Generated Artifacts Publisher: 949 ms, Junit Publisher: 1110 ms, Open Task Scanner Publisher: 342 ms, Invoker Publisher: 19103 ms, Pipeline Graph Publisher: 1 ms
[Pipeline] // withMaven
[Pipeline] cleanWs
[WS-CLEANUP] Deleting project workspace...
[WS-CLEANUP] Deferred wipeout is used...
[WS-CLEANUP] done
[Pipeline] }
[Pipeline] // stage
[Pipeline] }
[Pipeline] // ws
[Pipeline] }
[Pipeline] // node
[Pipeline] }
[INFO] run post-build script verify.bsh
[INFO]           test-jar-no-fork\pom.xml ......................... SUCCESS (6.6 s)
[INFO] Building: verify-parameter-goal-generated-test-jar\pom.xml
[INFO] run post-build script verify.bsh
[INFO]           test-jar-no-fork\pom.xml ......................... SUCCESS (6.6 s)
[INFO] Building: verify-parameter-goal-generated-test-jar\pom.xml
[INFO] run post-build script verify.groovy
[INFO]           verify-parameter-goal-generated-test-jar\pom.xml . SUCCESS (3.0 s)
[INFO] Building: verify-parameter-goal-jar\pom.xml
[INFO] run post-build script verify.groovy
[INFO]           verify-parameter-goal-generated-test-jar\pom.xml . SUCCESS (3.1 s)
[INFO] Building: verify-parameter-goal-jar\pom.xml
[withMaven] Publishers: Generated Artifacts Publisher: 953 ms, Junit Publisher: 1119 ms, Open Task Scanner Publisher: 347 ms, Invoker Publisher: 19009 ms, Pipeline Graph Publisher: 1 ms
[Pipeline] // withMaven
[Pipeline] cleanWs
[WS-CLEANUP] Deleting project workspace...
[WS-CLEANUP] Deferred wipeout is used...
[WS-CLEANUP] done
[Pipeline] }
[Pipeline] // stage
[Pipeline] }
[Pipeline] // ws
[Pipeline] }
[Pipeline] // node
[Pipeline] }
[INFO] run post-build script verify.groovy
[INFO]           verify-parameter-goal-jar\pom.xml ................ SUCCESS (3.2 s)
[INFO] Building: verify-parameter-goal-jar-no-fork\pom.xml
[INFO] run post-build script verify.groovy
[INFO]           verify-parameter-goal-jar\pom.xml ................ SUCCESS (3.4 s)
[INFO] Building: verify-parameter-goal-jar-no-fork\pom.xml
[INFO] run post-build script verify.groovy
[INFO]           verify-parameter-goal-jar-no-fork\pom.xml ........ SUCCESS (3.4 s)
[INFO] Building: verify-parameter-goal-test-jar\pom.xml
[INFO] run post-build script verify.groovy
[INFO]           verify-parameter-goal-jar-no-fork\pom.xml ........ SUCCESS (3.3 s)
[INFO] Building: verify-parameter-goal-test-jar\pom.xml
[INFO] run post-build script verify.groovy
[INFO]           verify-parameter-goal-test-jar\pom.xml ........... SUCCESS (3.0 s)
[INFO] Building: verify-parameter-goal-test-jar-no-fork\pom.xml
[INFO] run post-build script verify.groovy
[INFO]           verify-parameter-goal-test-jar\pom.xml ........... SUCCESS (3.1 s)
[INFO] Building: verify-parameter-goal-test-jar-no-fork\pom.xml
[INFO] run post-build script verify.groovy
[INFO]           verify-parameter-goal-test-jar-no-fork\pom.xml ... SUCCESS (3.2 s)
[INFO]
[INFO] --- maven-checkstyle-plugin:3.0.0:check (checkstyle-check) @ maven-source-plugin ---
[INFO] run post-build script verify.groovy
[INFO]           verify-parameter-goal-test-jar-no-fork\pom.xml ... SUCCESS (3.1 s)
[INFO]
[INFO] --- maven-checkstyle-plugin:3.0.0:check (checkstyle-check) @ maven-source-plugin ---
[INFO]
[INFO] --- maven-invoker-plugin:3.2.1:verify (integration-test) @ maven-source-plugin ---
[INFO] -------------------------------------------------
[INFO] Build Summary:
[INFO]   Passed: 22, Failed: 0, Errors: 0, Skipped: 0
[INFO] -------------------------------------------------
[INFO] ------------------------------------------------------------------------
[INFO] BUILD SUCCESS
[INFO] ------------------------------------------------------------------------
[INFO] Total time:  02:08 min
[INFO] Finished at: 2020-07-31T08:19:32-07:00
[INFO] ------------------------------------------------------------------------
[INFO] [jenkins-event-spy] Generated F:\jenkins\jenkins-slave\workspace\ox_maven-source-plugin_stabilize@3@tmp\withMavenecc51651\maven-spy-20200731-081723-5827608999894066850582.log
[Pipeline] }
[Pipeline] // dir
[Pipeline] }
[withMaven] artifactsPublisher - Archive artifact windows-jdk15-m3.6.x_build\pom.xml under org\apache\maven\plugins\maven-source-plugin\3.2.2-SNAPSHOT\maven-source-plugin-3.2.2-SNAPSHOT.pom
[withMaven] artifactsPublisher - Archive artifact windows-jdk15-m3.6.x_build\target\maven-source-plugin-3.2.2-SNAPSHOT.jar under org\apache\maven\plugins\maven-source-plugin\3.2.2-SNAPSHOT\maven-source-plugin-3.2.2-SNAPSHOT.jar
[Fast Archiver] No prior successful build to compare, so performing full copy of artifacts
[withMaven] junitPublisher - Archive test results for Maven artifact org.apache.maven.plugins:maven-source-plugin:maven-plugin:3.2.2-SNAPSHOT generated by maven-surefire-plugin:test (default-test): windows-jdk15-m3.6.x_build\target\surefire-reports\*.xml
Recording test results
[withMaven] openTasksPublisher - Scan Tasks for Maven artifact org.apache.maven.plugins:maven-source-plugin:maven-plugin:3.2.2-SNAPSHOT in source directory windows-jdk15-m3.6.x_build\src\main\java
[TASKS] Scanning folder 'f:\jenkins\jenkins-slave\workspace\ox_maven-source-plugin_stabilize@3' for files matching the pattern 'windows-jdk15-m3.6.x_build\src\main\java\**\*' - excludes: null
[TASKS] Found 7 files to scan for tasks
[TASKS] Found 0 open tasks.
Skipping warnings blame since pipelines do not have an SCM link.%n
[INFO]
[INFO] --- maven-invoker-plugin:3.2.1:verify (integration-test) @ maven-source-plugin ---
[INFO] -------------------------------------------------
[INFO] Build Summary:
[INFO]   Passed: 22, Failed: 0, Errors: 0, Skipped: 0
[INFO] -------------------------------------------------
[INFO] ------------------------------------------------------------------------
[INFO] BUILD SUCCESS
[INFO] ------------------------------------------------------------------------
[INFO] Total time:  02:10 min
[INFO] Finished at: 2020-07-31T08:19:33-07:00
[INFO] ------------------------------------------------------------------------
[INFO] [jenkins-event-spy] Generated F:\jenkins\jenkins-slave\workspace\ox_maven-source-plugin_stabilize@2@2@tmp\withMaven31a64da0\maven-spy-20200731-081721-9024016508821055710467.log
[withMaven] invokerPublisher - Archive invoker results for Maven artifact MavenArtifact{org.apache.maven.plugins:maven-source-plugin:maven-plugin:3.2.2-SNAPSHOT(version: 3.2.2-SNAPSHOT, snapshot:false) } generated by PluginInvocation{org.apache.maven.plugins:maven-invoker-plugin:3.2.1@integration-test  integration-test}: windows-jdk15-m3.6.x_build\target\invoker-reports\*.xml
[Pipeline] }
[Pipeline] // dir
[Pipeline] }
[withMaven] artifactsPublisher - Archive artifact windows-jdk14-m3.6.x_build\pom.xml under org\apache\maven\plugins\maven-source-plugin\3.2.2-SNAPSHOT\maven-source-plugin-3.2.2-SNAPSHOT.pom
[withMaven] artifactsPublisher - Archive artifact windows-jdk14-m3.6.x_build\target\maven-source-plugin-3.2.2-SNAPSHOT.jar under org\apache\maven\plugins\maven-source-plugin\3.2.2-SNAPSHOT\maven-source-plugin-3.2.2-SNAPSHOT.jar
[Fast Archiver] No prior successful build to compare, so performing full copy of artifacts
[withMaven] junitPublisher - Archive test results for Maven artifact org.apache.maven.plugins:maven-source-plugin:maven-plugin:3.2.2-SNAPSHOT generated by maven-surefire-plugin:test (default-test): windows-jdk14-m3.6.x_build\target\surefire-reports\*.xml
Recording test results
[withMaven] openTasksPublisher - Scan Tasks for Maven artifact org.apache.maven.plugins:maven-source-plugin:maven-plugin:3.2.2-SNAPSHOT in source directory windows-jdk14-m3.6.x_build\src\main\java
[TASKS] Scanning folder 'f:\jenkins\jenkins-slave\workspace\ox_maven-source-plugin_stabilize@2@2' for files matching the pattern 'windows-jdk14-m3.6.x_build\src\main\java\**\*' - excludes: null
[TASKS] Found 7 files to scan for tasks
[TASKS] Found 0 open tasks.
Skipping warnings blame since pipelines do not have an SCM link.%n
[withMaven] invokerPublisher - Archive invoker results for Maven artifact MavenArtifact{org.apache.maven.plugins:maven-source-plugin:maven-plugin:3.2.2-SNAPSHOT(version: 3.2.2-SNAPSHOT, snapshot:false) } generated by PluginInvocation{org.apache.maven.plugins:maven-invoker-plugin:3.2.1@integration-test  integration-test}: windows-jdk14-m3.6.x_build\target\invoker-reports\*.xml
[withMaven] Publishers: Generated Artifacts Publisher: 53 ms, Junit Publisher: 71 ms, Open Task Scanner Publisher: 44 ms, Invoker Publisher: 4957 ms, Pipeline Graph Publisher: 1 ms
[Pipeline] // withMaven
[Pipeline] cleanWs
[WS-CLEANUP] Deleting project workspace...
[WS-CLEANUP] Deferred wipeout is used...
[WS-CLEANUP] done
[Pipeline] }
[Pipeline] // stage
[Pipeline] }
[Pipeline] // ws
[Pipeline] }
[Pipeline] // node
[Pipeline] }
[withMaven] Publishers: Generated Artifacts Publisher: 81 ms, Junit Publisher: 65 ms, Open Task Scanner Publisher: 35 ms, Invoker Publisher: 5091 ms
[Pipeline] // withMaven
[Pipeline] cleanWs
[WS-CLEANUP] Deleting project workspace...
[WS-CLEANUP] Deferred wipeout is used...
[WS-CLEANUP] done
[Pipeline] }
[Pipeline] // stage
[Pipeline] }
[Pipeline] // ws
[Pipeline] }
[Pipeline] // node
[Pipeline] }
[Pipeline] // parallel
[Pipeline] stage
[Pipeline] { (Notifications)
[Pipeline] echo
Build result: FAILURE
[Pipeline] jiraIssueSelector
[Pipeline] echo
The authors of changes [rfscholte].
[Pipeline] echo
Sending email ...
[Pipeline] emailext
Reply | Threaded
Open this post in threaded view
|

Build failed in Jenkins: Maven TLP » maven-source-plugin » stabilize #4

Apache Jenkins Server-2
See https://builds.apache.org/job/maven-box/job/maven-source-plugin/job/stabilize/4/

Changes:

* Add profile id

All tests passed

Build log:
[...truncated 41957 lines...]
[Pipeline] cleanWs
[WS-CLEANUP] Deleting project workspace...
[WS-CLEANUP] Deferred wipeout is used...
[WS-CLEANUP] done
[Pipeline] cleanWs
[INFO] run post-build script verify.bsh
[INFO]           jar-no-fork/pom.xml .............................. SUCCESS (6.3 s)
[INFO] Building: project-without-sources/pom.xml
[WS-CLEANUP] Deleting project workspace...
[WS-CLEANUP] Deferred wipeout is used...
[WS-CLEANUP] done
[Pipeline] }
[Pipeline] // stage
[Pipeline] }
[Pipeline] // ws
[Pipeline] }
[Pipeline] // node
[Pipeline] }
Failed in branch linux-jdk8-m3.6.x_build
[INFO] run post-build script verify.bsh
[INFO]           test-jar-no-fork/pom.xml ......................... SUCCESS (4.4 s)
[INFO] Building: verify-parameter-goal-test-jar/pom.xml
[INFO] run post-build script verify.bsh
[INFO]           project-without-sources/pom.xml .................. SUCCESS (3.4 s)
[INFO] Building: MSOURCES-95/pom.xml
[INFO] run post-build script verify.groovy
[INFO]           MSOURCES-95/pom.xml .............................. SUCCESS (7.7 s)
[INFO] Building: jar-attached/pom.xml
[INFO] run post-build script verify.groovy
[INFO]           verify-parameter-goal-test-jar/pom.xml ........... SUCCESS (2.5 s)
[INFO] Building: jar-without-descriptor-config/pom.xml
[INFO] run post-build script verify.bsh
[INFO]           jar-without-descriptor-config/pom.xml ............ SUCCESS (2.4 s)
[INFO] Building: verify-parameter-goal-jar/pom.xml
[INFO] run post-build script verify.bsh
[INFO]           jar-attached/pom.xml ............................. SUCCESS (6.1 s)
[INFO] Building: jar-classifier/pom.xml
[INFO] run post-build script verify.groovy
[INFO]           verify-parameter-goal-jar/pom.xml ................ SUCCESS (2.6 s)
[INFO] Building: test-jar-generated/pom.xml
[INFO] run post-build script verify.groovy
[INFO]           MSOURCES-95/pom.xml .............................. SUCCESS (7.2 s)
[INFO] Building: test-jar-classifier/pom.xml
[INFO] run post-build script verify.bsh
[INFO]           test-jar-generated/pom.xml ....................... SUCCESS (3.8 s)
[INFO] Building: jar/pom.xml
[INFO] run post-build script verify.bsh
[INFO]           test-jar-classifier/pom.xml ...................... SUCCESS (3.9 s)
[INFO] Building: test-jar-generated/pom.xml
[INFO] run post-build script verify.bsh
[INFO]           jar-classifier/pom.xml ........................... SUCCESS (4.1 s)
[INFO] Building: verify-parameter-goal-test-jar-no-fork/pom.xml
[INFO] run post-build script verify.bsh
[INFO]           jar/pom.xml ...................................... SUCCESS (2.6 s)
[INFO] Building: test-jar/pom.xml
[INFO] run post-build script verify.groovy
[INFO]           verify-parameter-goal-test-jar-no-fork/pom.xml ... SUCCESS (3.8 s)
[INFO] Building: project-without-sources/pom.xml
[INFO] run post-build script verify.bsh
[INFO]           test-jar/pom.xml ................................. SUCCESS (2.7 s)
[INFO] Building: jar-no-fork/pom.xml
[INFO] run post-build script verify.bsh
[INFO]           test-jar-generated/pom.xml ....................... SUCCESS (5.4 s)
[INFO] Building: test-jar/pom.xml
[INFO] run post-build script verify.bsh
[INFO]           project-without-sources/pom.xml .................. SUCCESS (3.7 s)
[INFO] Building: manifest-content/pom.xml
[INFO] run post-build script verify.bsh
[INFO]           jar-no-fork/pom.xml .............................. SUCCESS (4.4 s)
[INFO]
[INFO] --- maven-checkstyle-plugin:3.0.0:check (checkstyle-check) @ maven-source-plugin ---
[INFO] run post-build script verify.bsh
[INFO]           test-jar/pom.xml ................................. SUCCESS (3.8 s)
[INFO] Building: verify-parameter-goal-generated-test-jar/pom.xml
[INFO]
[INFO] --- maven-invoker-plugin:3.2.1:verify (integration-test) @ maven-source-plugin ---
[INFO] -------------------------------------------------
[INFO] Build Summary:
[INFO]   Passed: 22, Failed: 0, Errors: 0, Skipped: 0
[INFO] -------------------------------------------------
[INFO] ------------------------------------------------------------------------
[INFO] BUILD SUCCESS
[INFO] ------------------------------------------------------------------------
[INFO] Total time:  01:24 min
[INFO] Finished at: 2020-07-31T15:46:03Z
[INFO] ------------------------------------------------------------------------
[INFO] [jenkins-event-spy] Generated /home/jenkins/jenkins-slave/workspace/ox_maven-source-plugin_stabilize@2@tmp/withMaven6c2a053e/maven-spy-20200731-154438-81114617904182236006935.log
[Pipeline] }
[Pipeline] // dir
[Pipeline] }
[INFO] run post-build script verify.bsh
[INFO]           manifest-content/pom.xml ......................... SUCCESS (3.9 s)
[INFO] Building: jar-without-descriptor-config/pom.xml
[withMaven] artifactsPublisher - Archive artifact linux-jdk14-m3.6.x_build/pom.xml under org/apache/maven/plugins/maven-source-plugin/3.2.2-SNAPSHOT/maven-source-plugin-3.2.2-SNAPSHOT.pom
[withMaven] artifactsPublisher - Archive artifact linux-jdk14-m3.6.x_build/target/maven-source-plugin-3.2.2-SNAPSHOT.jar under org/apache/maven/plugins/maven-source-plugin/3.2.2-SNAPSHOT/maven-source-plugin-3.2.2-SNAPSHOT.jar
[Fast Archiver] No prior successful build to compare, so performing full copy of artifacts
[INFO] run post-build script verify.groovy
[INFO]           verify-parameter-goal-generated-test-jar/pom.xml . SUCCESS (3.5 s)
[INFO] Building: MSOURCES-64/pom.xml
[withMaven] junitPublisher - Archive test results for Maven artifact org.apache.maven.plugins:maven-source-plugin:maven-plugin:3.2.2-SNAPSHOT generated by maven-surefire-plugin:test (default-test): linux-jdk14-m3.6.x_build/target/surefire-reports/*.xml
Recording test results
[withMaven] openTasksPublisher - Scan Tasks for Maven artifact org.apache.maven.plugins:maven-source-plugin:maven-plugin:3.2.2-SNAPSHOT in source directory linux-jdk14-m3.6.x_build/src/main/java
[TASKS] Scanning folder '/home/jenkins/jenkins-slave/workspace/ox_maven-source-plugin_stabilize@2' for files matching the pattern 'linux-jdk14-m3.6.x_build/src/main/java/**/*' - excludes: null
[TASKS] Found 7 files to scan for tasks
[TASKS] Found 0 open tasks.
Skipping warnings blame since pipelines do not have an SCM link.%n
[withMaven] invokerPublisher - Archive invoker results for Maven artifact MavenArtifact{org.apache.maven.plugins:maven-source-plugin:maven-plugin:3.2.2-SNAPSHOT(version: 3.2.2-SNAPSHOT, snapshot:false) } generated by PluginInvocation{org.apache.maven.plugins:maven-invoker-plugin:3.2.1@integration-test  integration-test}: linux-jdk14-m3.6.x_build/target/invoker-reports/*.xml
[INFO] run post-build script verify.bsh
[INFO]           jar-without-descriptor-config/pom.xml ............ SUCCESS (4.0 s)
[INFO] Building: verify-parameter-goal-jar-no-fork/pom.xml
[INFO] run post-build script verify.groovy
[INFO]           MSOURCES-64/pom.xml .............................. SUCCESS (4.8 s)
[INFO] Building: jar-attached/pom.xml
[INFO] run post-build script verify.groovy
[INFO]           verify-parameter-goal-jar-no-fork/pom.xml ........ SUCCESS (3.9 s)
[INFO] Building: MSOURCES-64/pom.xml
[INFO] run post-build script verify.bsh
[INFO]           jar-attached/pom.xml ............................. SUCCESS (5.7 s)
[INFO] Building: manifest-content/pom.xml
[INFO] run post-build script verify.groovy
[INFO]           MSOURCES-64/pom.xml .............................. SUCCESS (5.5 s)
[INFO]
[INFO] --- maven-checkstyle-plugin:3.0.0:check (checkstyle-check) @ maven-source-plugin ---
[INFO] run post-build script verify.bsh
[INFO]           manifest-content/pom.xml ......................... SUCCESS (3.6 s)
[INFO] Building: jar-classifier/pom.xml
[INFO]
[INFO] --- maven-invoker-plugin:3.2.1:verify (integration-test) @ maven-source-plugin ---
[INFO] -------------------------------------------------
[INFO] Build Summary:
[INFO]   Passed: 22, Failed: 0, Errors: 0, Skipped: 0
[INFO] -------------------------------------------------
[INFO] ------------------------------------------------------------------------
[INFO] BUILD SUCCESS
[INFO] ------------------------------------------------------------------------
[INFO] Total time:  02:12 min
[INFO] Finished at: 2020-07-31T15:46:22Z
[INFO] ------------------------------------------------------------------------
[INFO] [jenkins-event-spy] Generated /home/jenkins/jenkins-slave/workspace/ox_maven-source-plugin_stabilize@2@tmp/withMavendd46430b/maven-spy-20200731-154409-4275420620179128662931.log
[Pipeline] }
[Pipeline] // dir
[Pipeline] }
[withMaven] artifactsPublisher - Archive artifact linux-jdk11-m3.6.x_build/pom.xml under org/apache/maven/plugins/maven-source-plugin/3.2.2-SNAPSHOT/maven-source-plugin-3.2.2-SNAPSHOT.pom
[withMaven] artifactsPublisher - Archive artifact linux-jdk11-m3.6.x_build/target/maven-source-plugin-3.2.2-SNAPSHOT.jar under org/apache/maven/plugins/maven-source-plugin/3.2.2-SNAPSHOT/maven-source-plugin-3.2.2-SNAPSHOT.jar
[INFO] run post-build script verify.bsh
[INFO]           jar-classifier/pom.xml ........................... SUCCESS (3.9 s)
[INFO] Building: verify-parameter-goal-jar-no-fork/pom.xml
[Fast Archiver] No prior successful build to compare, so performing full copy of artifacts
[withMaven] junitPublisher - Archive test results for Maven artifact org.apache.maven.plugins:maven-source-plugin:maven-plugin:3.2.2-SNAPSHOT generated by maven-surefire-plugin:test (default-test): linux-jdk11-m3.6.x_build/target/surefire-reports/*.xml
Recording test results
[withMaven] openTasksPublisher - Scan Tasks for Maven artifact org.apache.maven.plugins:maven-source-plugin:maven-plugin:3.2.2-SNAPSHOT in source directory linux-jdk11-m3.6.x_build/src/main/java
[withMaven] Publishers: Generated Artifacts Publisher: 987 ms, Junit Publisher: 1126 ms, Open Task Scanner Publisher: 336 ms, Invoker Publisher: 19127 ms
[TASKS] Scanning folder '/home/jenkins/jenkins-slave/workspace/ox_maven-source-plugin_stabilize@2' for files matching the pattern 'linux-jdk11-m3.6.x_build/src/main/java/**/*' - excludes: null
[TASKS] Found 7 files to scan for tasks
[TASKS] Found 0 open tasks.
Skipping warnings blame since pipelines do not have an SCM link.%n
[Pipeline] // withMaven
[Pipeline] cleanWs
[INFO] run post-build script verify.groovy
[INFO]           verify-parameter-goal-jar-no-fork/pom.xml ........ SUCCESS (3.6 s)
[INFO] Building: verify-parameter-goal-test-jar/pom.xml
[WS-CLEANUP] Deleting project workspace...
[WS-CLEANUP] Deferred wipeout is used...
[withMaven] invokerPublisher - Archive invoker results for Maven artifact MavenArtifact{org.apache.maven.plugins:maven-source-plugin:maven-plugin:3.2.2-SNAPSHOT(version: 3.2.2-SNAPSHOT, snapshot:false) } generated by PluginInvocation{org.apache.maven.plugins:maven-invoker-plugin:3.2.1@integration-test  integration-test}: linux-jdk11-m3.6.x_build/target/invoker-reports/*.xml
[WS-CLEANUP] done
[Pipeline] }
[Pipeline] // stage
[Pipeline] }
[Pipeline] // ws
[Pipeline] }
[Pipeline] // node
[Pipeline] }
[INFO] run post-build script verify.groovy
[INFO]           verify-parameter-goal-test-jar/pom.xml ........... SUCCESS (3.4 s)
[INFO] Building: jar-without-descriptor-config/pom.xml
[INFO] run post-build script verify.bsh
[INFO]           jar-without-descriptor-config/pom.xml ............ SUCCESS (3.5 s)
[INFO] Building: reproducible/pom.xml
[INFO] run post-build script verify.groovy
[INFO]           reproducible/pom.xml ............................. SUCCESS (5.8 s)
[INFO] Building: MSOURCES-62/pom.xml
[INFO] run post-build script verify.bsh
[INFO]           MSOURCES-62/pom.xml .............................. SUCCESS (5.1 s)
[INFO]
[INFO] --- maven-checkstyle-plugin:3.0.0:check (checkstyle-check) @ maven-source-plugin ---
[INFO]
[INFO] --- maven-invoker-plugin:3.2.1:verify (integration-test) @ maven-source-plugin ---
[INFO] -------------------------------------------------
[INFO] Build Summary:
[INFO]   Passed: 22, Failed: 0, Errors: 0, Skipped: 0
[INFO] -------------------------------------------------
[INFO] ------------------------------------------------------------------------
[INFO] BUILD SUCCESS
[INFO] ------------------------------------------------------------------------
[INFO] Total time:  02:01 min
[INFO] Finished at: 2020-07-31T15:46:52Z
[INFO] ------------------------------------------------------------------------
[INFO] [jenkins-event-spy] Generated /home/jenkins/jenkins-slave/workspace/ox_maven-source-plugin_stabilize@2@tmp/withMavene94e0920/maven-spy-20200731-154450-5764155167861698512603.log
[Pipeline] }
[Pipeline] // dir
[Pipeline] }
[withMaven] artifactsPublisher - Archive artifact linux-jdk15-m3.6.x_build/pom.xml under org/apache/maven/plugins/maven-source-plugin/3.2.2-SNAPSHOT/maven-source-plugin-3.2.2-SNAPSHOT.pom
[withMaven] artifactsPublisher - Archive artifact linux-jdk15-m3.6.x_build/target/maven-source-plugin-3.2.2-SNAPSHOT.jar under org/apache/maven/plugins/maven-source-plugin/3.2.2-SNAPSHOT/maven-source-plugin-3.2.2-SNAPSHOT.jar
[Fast Archiver] No prior successful build to compare, so performing full copy of artifacts
[withMaven] junitPublisher - Archive test results for Maven artifact org.apache.maven.plugins:maven-source-plugin:maven-plugin:3.2.2-SNAPSHOT generated by maven-surefire-plugin:test (default-test): linux-jdk15-m3.6.x_build/target/surefire-reports/*.xml
Recording test results
[withMaven] openTasksPublisher - Scan Tasks for Maven artifact org.apache.maven.plugins:maven-source-plugin:maven-plugin:3.2.2-SNAPSHOT in source directory linux-jdk15-m3.6.x_build/src/main/java
[TASKS] Scanning folder '/home/jenkins/jenkins-slave/workspace/ox_maven-source-plugin_stabilize@2' for files matching the pattern 'linux-jdk15-m3.6.x_build/src/main/java/**/*' - excludes: null
[TASKS] Found 7 files to scan for tasks
[TASKS] Found 0 open tasks.
Skipping warnings blame since pipelines do not have an SCM link.%n
[withMaven] invokerPublisher - Archive invoker results for Maven artifact MavenArtifact{org.apache.maven.plugins:maven-source-plugin:maven-plugin:3.2.2-SNAPSHOT(version: 3.2.2-SNAPSHOT, snapshot:false) } generated by PluginInvocation{org.apache.maven.plugins:maven-invoker-plugin:3.2.1@integration-test  integration-test}: linux-jdk15-m3.6.x_build/target/invoker-reports/*.xml
[withMaven] Publishers: Generated Artifacts Publisher: 1864 ms, Junit Publisher: 2075 ms, Open Task Scanner Publisher: 676 ms, Invoker Publisher: 31177 ms, Pipeline Graph Publisher: 1 ms
[Pipeline] // withMaven
[Pipeline] cleanWs
[WS-CLEANUP] Deleting project workspace...
[WS-CLEANUP] Deferred wipeout is used...
[WS-CLEANUP] done
[Pipeline] }
[Pipeline] // stage
[Pipeline] }
[Pipeline] // ws
[Pipeline] }
[Pipeline] // node
[Pipeline] }
[withMaven] Publishers: Generated Artifacts Publisher: 1276 ms, Junit Publisher: 1116 ms, Open Task Scanner Publisher: 328 ms, Invoker Publisher: 21534 ms, Pipeline Graph Publisher: 1 ms
[Pipeline] // withMaven
[Pipeline] cleanWs
[WS-CLEANUP] Deleting project workspace...
[WS-CLEANUP] Deferred wipeout is used...
[WS-CLEANUP] done
[Pipeline] }
[Pipeline] // stage
[Pipeline] }
[Pipeline] // ws
[Pipeline] }
[Pipeline] // node
[Pipeline] }
[Pipeline] // parallel
[Pipeline] stage
[Pipeline] { (Notifications)
[Pipeline] echo
Build result: FAILURE
[Pipeline] jiraIssueSelector
[Pipeline] echo
The authors of changes [rfscholte].
[Pipeline] echo
Sending email ...
[Pipeline] emailext