Build failed in Jenkins: Maven TLP » maven-source-plugin » master #39

classic Classic list List threaded Threaded
6 messages Options
Reply | Threaded
Open this post in threaded view
|

Build failed in Jenkins: Maven TLP » maven-source-plugin » master #39

Apache Jenkins Server-2
See https://builds.apache.org/job/maven-box/job/maven-source-plugin/job/master/39/

Changes:

* H30 is having issues

All tests passed

Build log:
[...truncated 6080 lines...]
    at jdk.internal.reflect.NativeMethodAccessorImpl.invoke (NativeMethodAccessorImpl.java:62)
    at jdk.internal.reflect.DelegatingMethodAccessorImpl.invoke (DelegatingMethodAccessorImpl.java:43)
    at java.lang.reflect.Method.invoke (Method.java:567)
    at org.codehaus.plexus.classworlds.launcher.Launcher.launchEnhanced (Launcher.java:282)
    at org.codehaus.plexus.classworlds.launcher.Launcher.launch (Launcher.java:225)
    at org.codehaus.plexus.classworlds.launcher.Launcher.mainWithExitCode (Launcher.java:406)
    at org.codehaus.plexus.classworlds.launcher.Launcher.main (Launcher.java:347)
Caused by: org.apache.maven.plugin.MojoFailureException: 1 build failed. See console output above for details.
    at org.apache.maven.plugins.invoker.InvokerSession.handleFailures (InvokerSession.java:260)
    at org.apache.maven.plugins.invoker.VerifyMojo.execute (VerifyMojo.java:137)
    at org.apache.maven.plugin.DefaultBuildPluginManager.executeMojo (DefaultBuildPluginManager.java:137)
    at org.apache.maven.lifecycle.internal.MojoExecutor.execute (MojoExecutor.java:210)
    at org.apache.maven.lifecycle.internal.MojoExecutor.execute (MojoExecutor.java:156)
    at org.apache.maven.lifecycle.internal.MojoExecutor.execute (MojoExecutor.java:148)
    at org.apache.maven.lifecycle.internal.LifecycleModuleBuilder.buildProject (LifecycleModuleBuilder.java:117)
    at org.apache.maven.lifecycle.internal.LifecycleModuleBuilder.buildProject (LifecycleModuleBuilder.java:81)
    at org.apache.maven.lifecycle.internal.builder.singlethreaded.SingleThreadedBuilder.build (SingleThreadedBuilder.java:56)
    at org.apache.maven.lifecycle.internal.LifecycleStarter.execute (LifecycleStarter.java:128)
    at org.apache.maven.DefaultMaven.doExecute (DefaultMaven.java:305)
    at org.apache.maven.DefaultMaven.doExecute (DefaultMaven.java:192)
    at org.apache.maven.DefaultMaven.execute (DefaultMaven.java:105)
    at org.apache.maven.cli.MavenCli.execute (MavenCli.java:956)
    at org.apache.maven.cli.MavenCli.doMain (MavenCli.java:288)
    at org.apache.maven.cli.MavenCli.main (MavenCli.java:192)
    at jdk.internal.reflect.NativeMethodAccessorImpl.invoke0 (Native Method)
    at jdk.internal.reflect.NativeMethodAccessorImpl.invoke (NativeMethodAccessorImpl.java:62)
    at jdk.internal.reflect.DelegatingMethodAccessorImpl.invoke (DelegatingMethodAccessorImpl.java:43)
    at java.lang.reflect.Method.invoke (Method.java:567)
    at org.codehaus.plexus.classworlds.launcher.Launcher.launchEnhanced (Launcher.java:282)
    at org.codehaus.plexus.classworlds.launcher.Launcher.launch (Launcher.java:225)
    at org.codehaus.plexus.classworlds.launcher.Launcher.mainWithExitCode (Launcher.java:406)
    at org.codehaus.plexus.classworlds.launcher.Launcher.main (Launcher.java:347)
[ERROR]
[ERROR] Re-run Maven using the -X switch to enable full debug logging.
[ERROR]
[ERROR] For more information about the errors and possible solutions, please read the following articles:
[ERROR] [Help 1] http://cwiki.apache.org/confluence/display/MAVEN/MojoFailureException
[Pipeline] }
[Pipeline] // dir
[Pipeline] }
[withMaven] junitPublisher - Archive test results for Maven artifact org.apache.maven.plugins:maven-source-plugin:maven-plugin:3.2.2-SNAPSHOT generated by maven-surefire-plugin:test (default-test): windows-jdk13-m3.6.x_build\target\surefire-reports\*.xml
Recording test results
[withMaven] openTasksPublisher - Scan Tasks for Maven artifact org.apache.maven.plugins:maven-source-plugin:maven-plugin:3.2.2-SNAPSHOT in source directory windows-jdk13-m3.6.x_build\src\main\java
[TASKS] Scanning folder 'f:\jenkins\jenkins-slave\workspace\n-box_maven-source-plugin_master@2' for files matching the pattern 'windows-jdk13-m3.6.x_build\src\main\java\**\*' - excludes: null
[TASKS] Found 7 files to scan for tasks
[TASKS] Found 0 open tasks.
Skipping warnings blame since pipelines do not have an SCM link.%n
[TASKS] Computing warning deltas based on reference build #38
[withMaven] invokerPublisher - Archive invoker results for Maven artifact MavenArtifact{org.apache.maven.plugins:maven-source-plugin:maven-plugin:3.2.2-SNAPSHOT(version: 3.2.2-SNAPSHOT, snapshot:false) } generated by PluginInvocation{org.apache.maven.plugins:maven-invoker-plugin:3.1.0@integration-test  integration-test}: windows-jdk13-m3.6.x_build\target\invoker-reports\*.xml
[INFO] run post-build script verify.groovy
[INFO]           MSOURCES-95\pom.xml .............................. SUCCESS (7.7 s)
[INFO] Building: project-without-sources\pom.xml
[withMaven] Publishers: Generated Artifacts Publisher: 16 ms, Junit Publisher: 81 ms, Open Task Scanner Publisher: 49 ms, Invoker Publisher: 4594 ms
[Pipeline] // withMaven
[Pipeline] cleanWs
[WS-CLEANUP] Deleting project workspace...
[WS-CLEANUP] Deferred wipeout is used...
[WS-CLEANUP] done
[Pipeline] cleanWs
[WS-CLEANUP] Deleting project workspace...
[WS-CLEANUP] Deferred wipeout is used...
[WS-CLEANUP] done
[Pipeline] }
[Pipeline] // stage
[Pipeline] }
[Pipeline] // ws
[Pipeline] }
[Pipeline] // node
[Pipeline] }
Failed in branch windows-jdk13-m3.6.x_build
[INFO] run post-build script verify.bsh
[INFO]           project-without-sources\pom.xml .................. SUCCESS (3.9 s)
[INFO] Building: reproducible\pom.xml
[INFO] run post-build script verify.groovy
[INFO]           reproducible\pom.xml ............................. FAILED (12.5 s)
[INFO]   The post-build script did not succeed. assert buf.startsWith( "reproducible-1.0-sources.jar sha1 = 3a3687b063cfc164fbbccd1b9573b4232f540e8a" )
       |   |
       |   false
       reproducible-1.0-sources.jar sha1 = 499c6f39564643f1e55da33967121fc56fe24537
       
       encoding: UTF8
       timezone offset (minutes): 480
       M size (cmp) crc      java time     date       time           zip time   mode   name -comment; extra
       8   25 ( 27) ee027fb2 1566437332000 2019-08-21 18:28:52 -0700 1326814106 100644 META-INF/MANIFEST.MF ; 0
       0    0 (  0)        0 1566437332000 2019-08-21 18:28:52 -0700 1326814106  40755 META-INF/ ; 0
       0    0 (  0)        0 1566437332000 2019-08-21 18:28:52 -0700 1326814106  40755 dir-A/ ; 0
       0    0 (  0)        0 1566437332000 2019-08-21 18:28:52 -0700 1326814106  40755 dir-C/ ; 0
       0    0 (  0)        0 1566437332000 2019-08-21 18:28:52 -0700 1326814106  40755 dir-b/ ; 0
       0    0 (  0)        0 1566437332000 2019-08-21 18:28:52 -0700 1326814106  40755 dir-b/B2/ ; 0
       0    0 (  0)        0 1566437332000 2019-08-21 18:28:52 -0700 1326814106  40755 dir-b/B4/ ; 0
       0    0 (  0)        0 1566437332000 2019-08-21 18:28:52 -0700 1326814106  40755 dir-b/b1/ ; 0
       0    0 (  0)        0 1566437332000 2019-08-21 18:28:52 -0700 1326814106  40755 dir-b/b3/ ; 0
       0    0 (  0)        0 1566437332000 2019-08-21 18:28:52 -0700 1326814106  40755 dir-d/ ; 0
       8  281 (118) d793ddf2 1566437332000 2019-08-21 18:28:52 -0700 1326814106 100644 META-INF/DEPENDENCIES ; 0
       8 11358 (3949) 86e2b4b4 1566437332000 2019-08-21 18:28:52 -0700 1326814106 100644 META-INF/LICENSE ; 0
       8  183 (129) 62b3bac9 1566437332000 2019-08-21 18:28:52 -0700 1326814106 100644 META-INF/NOTICE ; 0
       8    9 ( 11) 1c933a72 1566437332000 2019-08-21 18:28:52 -0700 1326814106 100644 Uppercase.txt ; 0
       8    2 (  4) 606c3d3b 1566437332000 2019-08-21 18:28:52 -0700 1326814106 100644 dir-A/A2.txt ; 0
       8    2 (  4) 890f980e 1566437332000 2019-08-21 18:28:52 -0700 1326814106 100644 dir-A/A4.txt ; 0
       8    2 (  4) 6ce14823 1566437332000 2019-08-21 18:28:52 -0700 1326814106 100644 dir-A/a1.txt ; 0
       8    2 (  4) 82ef290f 1566437332000 2019-08-21 18:28:52 -0700 1326814106 100644 dir-A/a3.txt ; 0
       8    1 (  3) 3dd7ffa7 1566437332000 2019-08-21 18:28:52 -0700 1326814106 100644 dir-C/C.txt ; 0
       8    2 (  4) 4b416ef8 1566437332000 2019-08-21 18:28:52 -0700 1326814106 100644 dir-b/B2/B2.txt ; 0
       8    2 (  4) a222cbcd 1566437332000 2019-08-21 18:28:52 -0700 1326814106 100644 dir-b/B4/B4.txt ; 0
       8    1 (  3) 71beeff9 1566437332000 2019-08-21 18:28:52 -0700 1326814106 100644 dir-b/b.txt ; 0
       8    2 (  4) 47cc1be0 1566437332000 2019-08-21 18:28:52 -0700 1326814106 100644 dir-b/b1/b1.txt ; 0
       8    2 (  4) a9c27acc 1566437332000 2019-08-21 18:28:52 -0700 1326814106 100644 dir-b/b3/b3.txt ; 0
       8    1 (  3) 98dd4acc 1566437332000 2019-08-21 18:28:52 -0700 1326814106 100644 dir-d/d.txt ; 0
       8   10 ( 12) d68eda01 1566437332000 2019-08-21 18:28:52 -0700 1326814106 100644 executable.txt ; 0
       8    9 ( 11) fe3d51f2 1566437332000 2019-08-21 18:28:52 -0700 1326814106 100644 lowercase.txt ; 0
[INFO] Building: test-jar\pom.xml
[INFO] run post-build script verify.bsh
[INFO]           test-jar\pom.xml ................................. SUCCESS (4.3 s)
[INFO] Building: test-jar-classifier\pom.xml
[INFO] run post-build script verify.bsh
[INFO]           test-jar-classifier\pom.xml ...................... SUCCESS (4.3 s)
[INFO] Building: test-jar-generated\pom.xml
[INFO] run post-build script verify.bsh
[INFO]           test-jar-generated\pom.xml ....................... SUCCESS (6.2 s)
[INFO] Building: test-jar-no-fork\pom.xml
[INFO] run post-build script verify.bsh
[INFO]           test-jar-no-fork\pom.xml ......................... SUCCESS (7.4 s)
[INFO] Building: verify-parameter-goal-generated-test-jar\pom.xml
[INFO] run post-build script verify.groovy
[INFO]           verify-parameter-goal-generated-test-jar\pom.xml . SUCCESS (4.0 s)
[INFO] Building: verify-parameter-goal-jar\pom.xml
[INFO] run post-build script verify.groovy
[INFO]           verify-parameter-goal-jar\pom.xml ................ SUCCESS (3.9 s)
[INFO] Building: verify-parameter-goal-jar-no-fork\pom.xml
[INFO] run post-build script verify.groovy
[INFO]           verify-parameter-goal-jar-no-fork\pom.xml ........ SUCCESS (3.9 s)
[INFO] Building: verify-parameter-goal-test-jar\pom.xml
[INFO] run post-build script verify.groovy
[INFO]           verify-parameter-goal-test-jar\pom.xml ........... SUCCESS (3.7 s)
[INFO] Building: verify-parameter-goal-test-jar-no-fork\pom.xml
[INFO] run post-build script verify.groovy
[INFO]           verify-parameter-goal-test-jar-no-fork\pom.xml ... SUCCESS (3.7 s)
[INFO]
[INFO] --- maven-checkstyle-plugin:3.0.0:check (checkstyle-check) @ maven-source-plugin ---
[INFO]
[INFO] --- maven-invoker-plugin:3.1.0:verify (integration-test) @ maven-source-plugin ---
[INFO] -------------------------------------------------
[INFO] Build Summary:
[INFO]   Passed: 21, Failed: 1, Errors: 0, Skipped: 0
[INFO] -------------------------------------------------
[ERROR] The following builds failed:
[ERROR] *  reproducible\pom.xml
[INFO] -------------------------------------------------
[INFO] ------------------------------------------------------------------------
[INFO] BUILD FAILURE
[INFO] ------------------------------------------------------------------------
[INFO] Total time:  02:49 min
[INFO] Finished at: 2020-01-12T11:23:45-08:00
[INFO] ------------------------------------------------------------------------
[INFO] [jenkins-event-spy] Generated F:\jenkins\jenkins-slave\workspace\n-box_maven-source-plugin_master@2@tmp\withMaven07ce0558\maven-spy-20200112-112056-1064064908782421299235.log
[ERROR] Failed to execute goal org.apache.maven.plugins:maven-invoker-plugin:3.1.0:verify (integration-test) on project maven-source-plugin: 1 build failed. See console output above for details. -> [Help 1]
org.apache.maven.lifecycle.LifecycleExecutionException: Failed to execute goal org.apache.maven.plugins:maven-invoker-plugin:3.1.0:verify (integration-test) on project maven-source-plugin: 1 build failed. See console output above for details.
    at org.apache.maven.lifecycle.internal.MojoExecutor.execute (MojoExecutor.java:215)
    at org.apache.maven.lifecycle.internal.MojoExecutor.execute (MojoExecutor.java:156)
    at org.apache.maven.lifecycle.internal.MojoExecutor.execute (MojoExecutor.java:148)
    at org.apache.maven.lifecycle.internal.LifecycleModuleBuilder.buildProject (LifecycleModuleBuilder.java:117)
    at org.apache.maven.lifecycle.internal.LifecycleModuleBuilder.buildProject (LifecycleModuleBuilder.java:81)
    at org.apache.maven.lifecycle.internal.builder.singlethreaded.SingleThreadedBuilder.build (SingleThreadedBuilder.java:56)
    at org.apache.maven.lifecycle.internal.LifecycleStarter.execute (LifecycleStarter.java:128)
    at org.apache.maven.DefaultMaven.doExecute (DefaultMaven.java:305)
    at org.apache.maven.DefaultMaven.doExecute (DefaultMaven.java:192)
    at org.apache.maven.DefaultMaven.execute (DefaultMaven.java:105)
    at org.apache.maven.cli.MavenCli.execute (MavenCli.java:956)
    at org.apache.maven.cli.MavenCli.doMain (MavenCli.java:288)
    at org.apache.maven.cli.MavenCli.main (MavenCli.java:192)
    at jdk.internal.reflect.NativeMethodAccessorImpl.invoke0 (Native Method)
    at jdk.internal.reflect.NativeMethodAccessorImpl.invoke (NativeMethodAccessorImpl.java:62)
    at jdk.internal.reflect.DelegatingMethodAccessorImpl.invoke (DelegatingMethodAccessorImpl.java:43)
    at java.lang.reflect.Method.invoke (Method.java:567)
    at org.codehaus.plexus.classworlds.launcher.Launcher.launchEnhanced (Launcher.java:282)
    at org.codehaus.plexus.classworlds.launcher.Launcher.launch (Launcher.java:225)
    at org.codehaus.plexus.classworlds.launcher.Launcher.mainWithExitCode (Launcher.java:406)
    at org.codehaus.plexus.classworlds.launcher.Launcher.main (Launcher.java:347)
Caused by: org.apache.maven.plugin.MojoFailureException: 1 build failed. See console output above for details.
    at org.apache.maven.plugins.invoker.InvokerSession.handleFailures (InvokerSession.java:260)
    at org.apache.maven.plugins.invoker.VerifyMojo.execute (VerifyMojo.java:137)
    at org.apache.maven.plugin.DefaultBuildPluginManager.executeMojo (DefaultBuildPluginManager.java:137)
    at org.apache.maven.lifecycle.internal.MojoExecutor.execute (MojoExecutor.java:210)
    at org.apache.maven.lifecycle.internal.MojoExecutor.execute (MojoExecutor.java:156)
    at org.apache.maven.lifecycle.internal.MojoExecutor.execute (MojoExecutor.java:148)
    at org.apache.maven.lifecycle.internal.LifecycleModuleBuilder.buildProject (LifecycleModuleBuilder.java:117)
    at org.apache.maven.lifecycle.internal.LifecycleModuleBuilder.buildProject (LifecycleModuleBuilder.java:81)
    at org.apache.maven.lifecycle.internal.builder.singlethreaded.SingleThreadedBuilder.build (SingleThreadedBuilder.java:56)
    at org.apache.maven.lifecycle.internal.LifecycleStarter.execute (LifecycleStarter.java:128)
    at org.apache.maven.DefaultMaven.doExecute (DefaultMaven.java:305)
    at org.apache.maven.DefaultMaven.doExecute (DefaultMaven.java:192)
    at org.apache.maven.DefaultMaven.execute (DefaultMaven.java:105)
    at org.apache.maven.cli.MavenCli.execute (MavenCli.java:956)
    at org.apache.maven.cli.MavenCli.doMain (MavenCli.java:288)
    at org.apache.maven.cli.MavenCli.main (MavenCli.java:192)
    at jdk.internal.reflect.NativeMethodAccessorImpl.invoke0 (Native Method)
    at jdk.internal.reflect.NativeMethodAccessorImpl.invoke (NativeMethodAccessorImpl.java:62)
    at jdk.internal.reflect.DelegatingMethodAccessorImpl.invoke (DelegatingMethodAccessorImpl.java:43)
    at java.lang.reflect.Method.invoke (Method.java:567)
    at org.codehaus.plexus.classworlds.launcher.Launcher.launchEnhanced (Launcher.java:282)
    at org.codehaus.plexus.classworlds.launcher.Launcher.launch (Launcher.java:225)
    at org.codehaus.plexus.classworlds.launcher.Launcher.mainWithExitCode (Launcher.java:406)
    at org.codehaus.plexus.classworlds.launcher.Launcher.main (Launcher.java:347)
[ERROR]
[ERROR] Re-run Maven using the -X switch to enable full debug logging.
[ERROR]
[ERROR] For more information about the errors and possible solutions, please read the following articles:
[ERROR] [Help 1] http://cwiki.apache.org/confluence/display/MAVEN/MojoFailureException
[Pipeline] }
[Pipeline] // dir
[Pipeline] }
[withMaven] junitPublisher - Archive test results for Maven artifact org.apache.maven.plugins:maven-source-plugin:maven-plugin:3.2.2-SNAPSHOT generated by maven-surefire-plugin:test (default-test): windows-jdk14-m3.6.x_build\target\surefire-reports\*.xml
Recording test results
[withMaven] openTasksPublisher - Scan Tasks for Maven artifact org.apache.maven.plugins:maven-source-plugin:maven-plugin:3.2.2-SNAPSHOT in source directory windows-jdk14-m3.6.x_build\src\main\java
[TASKS] Scanning folder 'f:\jenkins\jenkins-slave\workspace\n-box_maven-source-plugin_master@2' for files matching the pattern 'windows-jdk14-m3.6.x_build\src\main\java\**\*' - excludes: null
[TASKS] Found 7 files to scan for tasks
[TASKS] Found 0 open tasks.
Skipping warnings blame since pipelines do not have an SCM link.%n
[TASKS] Computing warning deltas based on reference build #38
[withMaven] invokerPublisher - Archive invoker results for Maven artifact MavenArtifact{org.apache.maven.plugins:maven-source-plugin:maven-plugin:3.2.2-SNAPSHOT(version: 3.2.2-SNAPSHOT, snapshot:false) } generated by PluginInvocation{org.apache.maven.plugins:maven-invoker-plugin:3.1.0@integration-test  integration-test}: windows-jdk14-m3.6.x_build\target\invoker-reports\*.xml
[withMaven] Publishers: Generated Artifacts Publisher: 17 ms, Junit Publisher: 90 ms, Open Task Scanner Publisher: 47 ms, Invoker Publisher: 5587 ms
[Pipeline] // withMaven
[Pipeline] cleanWs
[WS-CLEANUP] Deleting project workspace...
[WS-CLEANUP] Deferred wipeout is used...
[WS-CLEANUP] done
[Pipeline] cleanWs
[WS-CLEANUP] Deleting project workspace...
[WS-CLEANUP] Deferred wipeout is used...
[WS-CLEANUP] done
[Pipeline] }
[Pipeline] // stage
[Pipeline] }
[Pipeline] // ws
[Pipeline] }
[Pipeline] // node
[Pipeline] }
Failed in branch windows-jdk14-m3.6.x_build
[Pipeline] // parallel
[Pipeline] stage
[Pipeline] { (Notifications)
[Pipeline] echo
Build result: FAILURE
[Pipeline] jiraIssueSelector
[Pipeline] echo
The authors of changes [rfscholte].
[Pipeline] echo
Sending email ...
[Pipeline] emailext
Reply | Threaded
Open this post in threaded view
|

Build failed in Jenkins: Maven TLP » maven-source-plugin » master #40

Apache Jenkins Server-2
See https://builds.apache.org/job/maven-box/job/maven-source-plugin/job/master/40/

Changes:

* Add JDK 15
* Add Maven 3.6.3

All tests passed

Build log:
[...truncated 3058 lines...]
    at org.codehaus.plexus.classworlds.launcher.Launcher.main (Launcher.java:347)
[ERROR]
[ERROR] Re-run Maven using the -X switch to enable full debug logging.
[ERROR]
[ERROR] For more information about the errors and possible solutions, please read the following articles:
[ERROR] [Help 1] http://cwiki.apache.org/confluence/display/MAVEN/MojoFailureException
[Pipeline] }
[Pipeline] // dir
[Pipeline] }
[withMaven] junitPublisher - Archive test results for Maven artifact org.apache.maven.plugins:maven-source-plugin:maven-plugin:3.2.2-SNAPSHOT generated by maven-surefire-plugin:test (default-test): linux-jdk13-m3.6.x_build/target/surefire-reports/*.xml
Recording test results
[withMaven] openTasksPublisher - Scan Tasks for Maven artifact org.apache.maven.plugins:maven-source-plugin:maven-plugin:3.2.2-SNAPSHOT in source directory linux-jdk13-m3.6.x_build/src/main/java
[TASKS] Scanning folder '/home/jenkins/jenkins-slave/workspace/n-box_maven-source-plugin_master@2' for files matching the pattern 'linux-jdk13-m3.6.x_build/src/main/java/**/*' - excludes: null
[TASKS] Found 7 files to scan for tasks
[TASKS] Found 0 open tasks.
Skipping warnings blame since pipelines do not have an SCM link.%n
[TASKS] Computing warning deltas based on reference build #38
[INFO] run post-build script verify.groovy
[INFO]           MSOURCES-95/pom.xml .............................. SUCCESS (5.4 s)
[INFO] Building: manifest-content/pom.xml
[withMaven] invokerPublisher - Archive invoker results for Maven artifact MavenArtifact{org.apache.maven.plugins:maven-source-plugin:maven-plugin:3.2.2-SNAPSHOT(version: 3.2.2-SNAPSHOT, snapshot:false) } generated by PluginInvocation{org.apache.maven.plugins:maven-invoker-plugin:3.1.0@integration-test  integration-test}: linux-jdk13-m3.6.x_build/target/invoker-reports/*.xml
[INFO] run post-build script verify.bsh
[INFO]           manifest-content/pom.xml ......................... SUCCESS (2.7 s)
[INFO] Building: test-jar-no-fork/pom.xml
[INFO] run post-build script verify.bsh
[INFO]           test-jar-no-fork/pom.xml ......................... SUCCESS (4.7 s)
[INFO] Building: verify-parameter-goal-generated-test-jar/pom.xml
[INFO] run post-build script verify.groovy
[INFO]           verify-parameter-goal-generated-test-jar/pom.xml . SUCCESS (2.7 s)
[INFO] Building: verify-parameter-goal-jar-no-fork/pom.xml
[withMaven] Publishers: Generated Artifacts Publisher: 315 ms, Junit Publisher: 1136 ms, Open Task Scanner Publisher: 347 ms, Invoker Publisher: 22404 ms
[Pipeline] // withMaven
[Pipeline] cleanWs
[WS-CLEANUP] Deleting project workspace...
[WS-CLEANUP] Deferred wipeout is used...
[INFO] run post-build script verify.groovy
[INFO]           verify-parameter-goal-jar-no-fork/pom.xml ........ SUCCESS (2.6 s)
[INFO] Building: reproducible/pom.xml
[WS-CLEANUP] done
[Pipeline] cleanWs
[WS-CLEANUP] Deleting project workspace...
[WS-CLEANUP] Deferred wipeout is used...
[WS-CLEANUP] done
[Pipeline] }
[Pipeline] // stage
[Pipeline] }
[Pipeline] // ws
[Pipeline] }
[Pipeline] // node
[Pipeline] }
Failed in branch linux-jdk11-m3.6.x_build
[INFO] run post-build script verify.groovy
[INFO]           reproducible/pom.xml ............................. FAILED (4.1 s)
[INFO]   The post-build script did not succeed. assert buf.startsWith( "reproducible-1.0-sources.jar sha1 = 3a3687b063cfc164fbbccd1b9573b4232f540e8a" )
       |   |
       |   false
       reproducible-1.0-sources.jar sha1 = 499c6f39564643f1e55da33967121fc56fe24537
       
       encoding: UTF8
       timezone offset (minutes): 0
       M size (cmp) crc      java time     date       time           zip time   mode   name -comment; extra
       8   25 ( 27) ee027fb2 1566412132000 2019-08-21 18:28:52 +0000 1326814106 100644 META-INF/MANIFEST.MF ; 0
       0    0 (  0)        0 1566412132000 2019-08-21 18:28:52 +0000 1326814106  40755 META-INF/ ; 0
       0    0 (  0)        0 1566412132000 2019-08-21 18:28:52 +0000 1326814106  40755 dir-A/ ; 0
       0    0 (  0)        0 1566412132000 2019-08-21 18:28:52 +0000 1326814106  40755 dir-C/ ; 0
       0    0 (  0)        0 1566412132000 2019-08-21 18:28:52 +0000 1326814106  40755 dir-b/ ; 0
       0    0 (  0)        0 1566412132000 2019-08-21 18:28:52 +0000 1326814106  40755 dir-b/B2/ ; 0
       0    0 (  0)        0 1566412132000 2019-08-21 18:28:52 +0000 1326814106  40755 dir-b/B4/ ; 0
       0    0 (  0)        0 1566412132000 2019-08-21 18:28:52 +0000 1326814106  40755 dir-b/b1/ ; 0
       0    0 (  0)        0 1566412132000 2019-08-21 18:28:52 +0000 1326814106  40755 dir-b/b3/ ; 0
       0    0 (  0)        0 1566412132000 2019-08-21 18:28:52 +0000 1326814106  40755 dir-d/ ; 0
       8  281 (118) d793ddf2 1566412132000 2019-08-21 18:28:52 +0000 1326814106 100644 META-INF/DEPENDENCIES ; 0
       8 11358 (3949) 86e2b4b4 1566412132000 2019-08-21 18:28:52 +0000 1326814106 100644 META-INF/LICENSE ; 0
       8  183 (129) 62b3bac9 1566412132000 2019-08-21 18:28:52 +0000 1326814106 100644 META-INF/NOTICE ; 0
       8    9 ( 11) 1c933a72 1566412132000 2019-08-21 18:28:52 +0000 1326814106 100644 Uppercase.txt ; 0
       8    2 (  4) 606c3d3b 1566412132000 2019-08-21 18:28:52 +0000 1326814106 100644 dir-A/A2.txt ; 0
       8    2 (  4) 890f980e 1566412132000 2019-08-21 18:28:52 +0000 1326814106 100644 dir-A/A4.txt ; 0
       8    2 (  4) 6ce14823 1566412132000 2019-08-21 18:28:52 +0000 1326814106 100644 dir-A/a1.txt ; 0
       8    2 (  4) 82ef290f 1566412132000 2019-08-21 18:28:52 +0000 1326814106 100644 dir-A/a3.txt ; 0
       8    1 (  3) 3dd7ffa7 1566412132000 2019-08-21 18:28:52 +0000 1326814106 100644 dir-C/C.txt ; 0
       8    2 (  4) 4b416ef8 1566412132000 2019-08-21 18:28:52 +0000 1326814106 100644 dir-b/B2/B2.txt ; 0
       8    2 (  4) a222cbcd 1566412132000 2019-08-21 18:28:52 +0000 1326814106 100644 dir-b/B4/B4.txt ; 0
       8    1 (  3) 71beeff9 1566412132000 2019-08-21 18:28:52 +0000 1326814106 100644 dir-b/b.txt ; 0
       8    2 (  4) 47cc1be0 1566412132000 2019-08-21 18:28:52 +0000 1326814106 100644 dir-b/b1/b1.txt ; 0
       8    2 (  4) a9c27acc 1566412132000 2019-08-21 18:28:52 +0000 1326814106 100644 dir-b/b3/b3.txt ; 0
       8    1 (  3) 98dd4acc 1566412132000 2019-08-21 18:28:52 +0000 1326814106 100644 dir-d/d.txt ; 0
       8   10 ( 12) d68eda01 1566412132000 2019-08-21 18:28:52 +0000 1326814106 100644 executable.txt ; 0
       8    9 ( 11) fe3d51f2 1566412132000 2019-08-21 18:28:52 +0000 1326814106 100644 lowercase.txt ; 0
[INFO] Building: MSOURCES-64/pom.xml
[INFO] run post-build script verify.groovy
[withMaven] Publishers: Generated Artifacts Publisher: 314 ms, Junit Publisher: 1133 ms, Open Task Scanner Publisher: 333 ms, Invoker Publisher: 19241 ms
[Pipeline] // withMaven
[Pipeline] cleanWs
[INFO]           MSOURCES-64/pom.xml .............................. SUCCESS (3.7 s)
[INFO] Building: test-jar-generated/pom.xml
[WS-CLEANUP] Deleting project workspace...
[WS-CLEANUP] Deferred wipeout is used...
[WS-CLEANUP] done
[Pipeline] cleanWs
[WS-CLEANUP] Deleting project workspace...
[WS-CLEANUP] Deferred wipeout is used...
[WS-CLEANUP] done
[Pipeline] }
[Pipeline] // stage
[Pipeline] }
[Pipeline] // ws
[Pipeline] }
[Pipeline] // node
[Pipeline] }
Failed in branch linux-jdk13-m3.6.x_build
[INFO] run post-build script verify.bsh
[INFO]           test-jar-generated/pom.xml ....................... SUCCESS (4.0 s)
[INFO]
[INFO] --- maven-checkstyle-plugin:3.0.0:check (checkstyle-check) @ maven-source-plugin ---
[INFO]
[INFO] --- maven-invoker-plugin:3.1.0:verify (integration-test) @ maven-source-plugin ---
[INFO] -------------------------------------------------
[INFO] Build Summary:
[INFO]   Passed: 21, Failed: 1, Errors: 0, Skipped: 0
[INFO] -------------------------------------------------
[ERROR] The following builds failed:
[ERROR] *  reproducible/pom.xml
[INFO] -------------------------------------------------
[INFO] ------------------------------------------------------------------------
[INFO] BUILD FAILURE
[INFO] ------------------------------------------------------------------------
[INFO] Total time:  01:29 min
[INFO] Finished at: 2020-01-16T08:52:38Z
[INFO] ------------------------------------------------------------------------
[INFO] [jenkins-event-spy] Generated /home/jenkins/jenkins-slave/workspace/n-box_maven-source-plugin_master@2@tmp/withMaven93c69d5a/maven-spy-20200116-085108-61417714581983728056296.log
[ERROR] Failed to execute goal org.apache.maven.plugins:maven-invoker-plugin:3.1.0:verify (integration-test) on project maven-source-plugin: 1 build failed. See console output above for details. -> [Help 1]
org.apache.maven.lifecycle.LifecycleExecutionException: Failed to execute goal org.apache.maven.plugins:maven-invoker-plugin:3.1.0:verify (integration-test) on project maven-source-plugin: 1 build failed. See console output above for details.
    at org.apache.maven.lifecycle.internal.MojoExecutor.execute (MojoExecutor.java:215)
    at org.apache.maven.lifecycle.internal.MojoExecutor.execute (MojoExecutor.java:156)
    at org.apache.maven.lifecycle.internal.MojoExecutor.execute (MojoExecutor.java:148)
    at org.apache.maven.lifecycle.internal.LifecycleModuleBuilder.buildProject (LifecycleModuleBuilder.java:117)
    at org.apache.maven.lifecycle.internal.LifecycleModuleBuilder.buildProject (LifecycleModuleBuilder.java:81)
    at org.apache.maven.lifecycle.internal.builder.singlethreaded.SingleThreadedBuilder.build (SingleThreadedBuilder.java:56)
    at org.apache.maven.lifecycle.internal.LifecycleStarter.execute (LifecycleStarter.java:128)
    at org.apache.maven.DefaultMaven.doExecute (DefaultMaven.java:305)
    at org.apache.maven.DefaultMaven.doExecute (DefaultMaven.java:192)
    at org.apache.maven.DefaultMaven.execute (DefaultMaven.java:105)
    at org.apache.maven.cli.MavenCli.execute (MavenCli.java:956)
    at org.apache.maven.cli.MavenCli.doMain (MavenCli.java:288)
    at org.apache.maven.cli.MavenCli.main (MavenCli.java:192)
    at jdk.internal.reflect.NativeMethodAccessorImpl.invoke0 (Native Method)
    at jdk.internal.reflect.NativeMethodAccessorImpl.invoke (NativeMethodAccessorImpl.java:62)
    at jdk.internal.reflect.DelegatingMethodAccessorImpl.invoke (DelegatingMethodAccessorImpl.java:43)
    at java.lang.reflect.Method.invoke (Method.java:564)
    at org.codehaus.plexus.classworlds.launcher.Launcher.launchEnhanced (Launcher.java:282)
    at org.codehaus.plexus.classworlds.launcher.Launcher.launch (Launcher.java:225)
    at org.codehaus.plexus.classworlds.launcher.Launcher.mainWithExitCode (Launcher.java:406)
    at org.codehaus.plexus.classworlds.launcher.Launcher.main (Launcher.java:347)
Caused by: org.apache.maven.plugin.MojoFailureException: 1 build failed. See console output above for details.
    at org.apache.maven.plugins.invoker.InvokerSession.handleFailures (InvokerSession.java:260)
    at org.apache.maven.plugins.invoker.VerifyMojo.execute (VerifyMojo.java:137)
    at org.apache.maven.plugin.DefaultBuildPluginManager.executeMojo (DefaultBuildPluginManager.java:137)
    at org.apache.maven.lifecycle.internal.MojoExecutor.execute (MojoExecutor.java:210)
    at org.apache.maven.lifecycle.internal.MojoExecutor.execute (MojoExecutor.java:156)
    at org.apache.maven.lifecycle.internal.MojoExecutor.execute (MojoExecutor.java:148)
    at org.apache.maven.lifecycle.internal.LifecycleModuleBuilder.buildProject (LifecycleModuleBuilder.java:117)
    at org.apache.maven.lifecycle.internal.LifecycleModuleBuilder.buildProject (LifecycleModuleBuilder.java:81)
    at org.apache.maven.lifecycle.internal.builder.singlethreaded.SingleThreadedBuilder.build (SingleThreadedBuilder.java:56)
    at org.apache.maven.lifecycle.internal.LifecycleStarter.execute (LifecycleStarter.java:128)
    at org.apache.maven.DefaultMaven.doExecute (DefaultMaven.java:305)
    at org.apache.maven.DefaultMaven.doExecute (DefaultMaven.java:192)
    at org.apache.maven.DefaultMaven.execute (DefaultMaven.java:105)
    at org.apache.maven.cli.MavenCli.execute (MavenCli.java:956)
    at org.apache.maven.cli.MavenCli.doMain (MavenCli.java:288)
    at org.apache.maven.cli.MavenCli.main (MavenCli.java:192)
    at jdk.internal.reflect.NativeMethodAccessorImpl.invoke0 (Native Method)
    at jdk.internal.reflect.NativeMethodAccessorImpl.invoke (NativeMethodAccessorImpl.java:62)
    at jdk.internal.reflect.DelegatingMethodAccessorImpl.invoke (DelegatingMethodAccessorImpl.java:43)
    at java.lang.reflect.Method.invoke (Method.java:564)
    at org.codehaus.plexus.classworlds.launcher.Launcher.launchEnhanced (Launcher.java:282)
    at org.codehaus.plexus.classworlds.launcher.Launcher.launch (Launcher.java:225)
    at org.codehaus.plexus.classworlds.launcher.Launcher.mainWithExitCode (Launcher.java:406)
    at org.codehaus.plexus.classworlds.launcher.Launcher.main (Launcher.java:347)
[ERROR]
[ERROR] Re-run Maven using the -X switch to enable full debug logging.
[ERROR]
[ERROR] For more information about the errors and possible solutions, please read the following articles:
[ERROR] [Help 1] http://cwiki.apache.org/confluence/display/MAVEN/MojoFailureException
[Pipeline] }
[Pipeline] // dir
[Pipeline] }
[withMaven] junitPublisher - Archive test results for Maven artifact org.apache.maven.plugins:maven-source-plugin:maven-plugin:3.2.2-SNAPSHOT generated by maven-surefire-plugin:test (default-test): linux-jdk14-m3.6.x_build/target/surefire-reports/*.xml
Recording test results
[withMaven] openTasksPublisher - Scan Tasks for Maven artifact org.apache.maven.plugins:maven-source-plugin:maven-plugin:3.2.2-SNAPSHOT in source directory linux-jdk14-m3.6.x_build/src/main/java
[TASKS] Scanning folder '/home/jenkins/jenkins-slave/workspace/n-box_maven-source-plugin_master@2' for files matching the pattern 'linux-jdk14-m3.6.x_build/src/main/java/**/*' - excludes: null
[TASKS] Found 7 files to scan for tasks
[TASKS] Found 0 open tasks.
Skipping warnings blame since pipelines do not have an SCM link.%n
[TASKS] Computing warning deltas based on reference build #38
[withMaven] invokerPublisher - Archive invoker results for Maven artifact MavenArtifact{org.apache.maven.plugins:maven-source-plugin:maven-plugin:3.2.2-SNAPSHOT(version: 3.2.2-SNAPSHOT, snapshot:false) } generated by PluginInvocation{org.apache.maven.plugins:maven-invoker-plugin:3.1.0@integration-test  integration-test}: linux-jdk14-m3.6.x_build/target/invoker-reports/*.xml
[withMaven] Publishers: Generated Artifacts Publisher: 315 ms, Junit Publisher: 1137 ms, Open Task Scanner Publisher: 335 ms, Invoker Publisher: 20014 ms
[Pipeline] // withMaven
[Pipeline] cleanWs
[WS-CLEANUP] Deleting project workspace...
[WS-CLEANUP] Deferred wipeout is used...
[WS-CLEANUP] done
[Pipeline] cleanWs
[WS-CLEANUP] Deleting project workspace...
[WS-CLEANUP] Deferred wipeout is used...
[WS-CLEANUP] done
[Pipeline] }
[Pipeline] // stage
[Pipeline] }
[Pipeline] // ws
[Pipeline] }
[Pipeline] // node
[Pipeline] }
Failed in branch linux-jdk14-m3.6.x_build
Aborted by slachiewicz
[Pipeline] // node
[Pipeline] // node
[Pipeline] // node
[Pipeline] // node
[Pipeline] // node
[Pipeline] // node
[Pipeline] // node
[Pipeline] // node
[Pipeline] }
Failed in branch windows-jdk7-m3.2.x_build
[Pipeline] }
Failed in branch windows-jdk7-m3.3.x_build
[Pipeline] }
Failed in branch windows-jdk7-m3.5.x_build
[Pipeline] }
Failed in branch windows-jdk7-m3.6.x_build
[Pipeline] }
Failed in branch windows-jdk8-m3.6.x_build
[Pipeline] }
Failed in branch windows-jdk11-m3.6.x_build
[Pipeline] }
Failed in branch windows-jdk13-m3.6.x_build
[Pipeline] }
Failed in branch windows-jdk14-m3.6.x_build
[Pipeline] // parallel
[Pipeline] stage
[Pipeline] { (Notifications)
[Pipeline] echo
Build result: FAILURE
[Pipeline] jiraIssueSelector
[Pipeline] echo
The authors of changes [slachiewicz].
[Pipeline] echo
Sending email ...
[Pipeline] emailext
Reply | Threaded
Open this post in threaded view
|

Build failed in Jenkins: Maven TLP » maven-source-plugin » master #41

Apache Jenkins Server-2
See https://builds.apache.org/job/maven-box/job/maven-source-plugin/job/master/41/

No changes.

All tests passed

Build log:
[...truncated 6094 lines...]
[ERROR] For more information about the errors and possible solutions, please read the following articles:
[ERROR] [Help 1] http://cwiki.apache.org/confluence/display/MAVEN/MojoFailureException
[Pipeline] }
[Pipeline] // dir
[Pipeline] }
[withMaven] junitPublisher - Archive test results for Maven artifact org.apache.maven.plugins:maven-source-plugin:maven-plugin:3.2.2-SNAPSHOT generated by maven-surefire-plugin:test (default-test): linux-jdk13-m3.6.x_build/target/surefire-reports/*.xml
Recording test results
[INFO] run post-build script verify.bsh
[INFO]           jar-no-fork/pom.xml .............................. SUCCESS (16.8 s)
[INFO] Building: jar-attached/pom.xml
[withMaven] openTasksPublisher - Scan Tasks for Maven artifact org.apache.maven.plugins:maven-source-plugin:maven-plugin:3.2.2-SNAPSHOT in source directory linux-jdk13-m3.6.x_build/src/main/java
[TASKS] Scanning folder '/home/jenkins/jenkins-slave/workspace/n-box_maven-source-plugin_master@2' for files matching the pattern 'linux-jdk13-m3.6.x_build/src/main/java/**/*' - excludes: null
[TASKS] Found 7 files to scan for tasks
[TASKS] Found 0 open tasks.
Skipping warnings blame since pipelines do not have an SCM link.%n
[TASKS] Computing warning deltas based on reference build #38
[withMaven] invokerPublisher - Archive invoker results for Maven artifact MavenArtifact{org.apache.maven.plugins:maven-source-plugin:maven-plugin:3.2.2-SNAPSHOT(version: 3.2.2-SNAPSHOT, snapshot:false) } generated by PluginInvocation{org.apache.maven.plugins:maven-invoker-plugin:3.1.0@integration-test  integration-test}: linux-jdk13-m3.6.x_build/target/invoker-reports/*.xml
[INFO] run post-build script verify.bsh
[INFO]           jar-attached/pom.xml ............................. SUCCESS (11.9 s)
[INFO] Building: verify-parameter-goal-test-jar/pom.xml
[INFO] run post-build script verify.groovy
WARNING: An illegal reflective access operation has occurred
WARNING: Illegal reflective access by org.codehaus.groovy.reflection.CachedClass (file:/home/jenkins/jenkins-slave/workspace/.maven_repositories/0/org/codehaus/groovy/groovy-all/2.4.8/groovy-all-2.4.8.jar) to method java.lang.Object.finalize()
WARNING: Please consider reporting this to the maintainers of org.codehaus.groovy.reflection.CachedClass
WARNING: Use --illegal-access=warn to enable warnings of further illegal reflective access operations
WARNING: All illegal access operations will be denied in a future release
[INFO]           verify-parameter-goal-test-jar/pom.xml ........... SUCCESS (8.3 s)
[INFO] Building: verify-parameter-goal-test-jar-no-fork/pom.xml
[withMaven] Publishers: Generated Artifacts Publisher: 913 ms, Junit Publisher: 1304 ms, Open Task Scanner Publisher: 371 ms, Invoker Publisher: 19079 ms
[Pipeline] // withMaven
[Pipeline] cleanWs
[WS-CLEANUP] Deleting project workspace...
[WS-CLEANUP] Deferred wipeout is used...
[WS-CLEANUP] done
[Pipeline] cleanWs
[WS-CLEANUP] Deleting project workspace...
[WS-CLEANUP] Deferred wipeout is used...
[WS-CLEANUP] done
[Pipeline] }
[Pipeline] // stage
[Pipeline] }
[Pipeline] // ws
[Pipeline] }
[Pipeline] // node
[Pipeline] }
Failed in branch linux-jdk13-m3.6.x_build
[INFO] run post-build script verify.groovy
[INFO]           verify-parameter-goal-test-jar-no-fork/pom.xml ... SUCCESS (7.7 s)
[INFO] Building: jar-classifier/pom.xml
[INFO] run post-build script verify.bsh
[INFO]           jar-classifier/pom.xml ........................... SUCCESS (6.5 s)
[INFO] Building: MSOURCES-64/pom.xml
[INFO] run post-build script verify.groovy
[INFO]           MSOURCES-64/pom.xml .............................. SUCCESS (9.8 s)
[INFO] Building: test-jar-generated/pom.xml
[INFO] run post-build script verify.bsh
[INFO]           test-jar-generated/pom.xml ....................... SUCCESS (10.8 s)
[INFO] Building: MSOURCES-62/pom.xml
[INFO] run post-build script verify.bsh
[INFO]           MSOURCES-62/pom.xml .............................. SUCCESS (9.0 s)
[INFO] Building: test-jar/pom.xml
[INFO] run post-build script verify.bsh
[INFO]           test-jar/pom.xml ................................. SUCCESS (6.5 s)
[INFO] Building: test-jar-no-fork/pom.xml
[INFO] run post-build script verify.bsh
[INFO]           test-jar-no-fork/pom.xml ......................... SUCCESS (9.8 s)
[INFO] Building: manifest-content/pom.xml
[INFO] run post-build script verify.bsh
[INFO]           manifest-content/pom.xml ......................... SUCCESS (5.9 s)
[INFO] Building: jar-without-descriptor-config/pom.xml
[INFO] run post-build script verify.bsh
[INFO]           jar-without-descriptor-config/pom.xml ............ SUCCESS (5.5 s)
[INFO] Building: reproducible/pom.xml
[INFO] run post-build script verify.groovy
[INFO]           reproducible/pom.xml ............................. FAILED (8.8 s)
[INFO]   The post-build script did not succeed. assert buf.startsWith( "reproducible-1.0-sources.jar sha1 = 3a3687b063cfc164fbbccd1b9573b4232f540e8a" )
       |   |
       |   false
       reproducible-1.0-sources.jar sha1 = 499c6f39564643f1e55da33967121fc56fe24537
       
       encoding: UTF8
       timezone offset (minutes): 0
       M size (cmp) crc      java time     date       time           zip time   mode   name -comment; extra
       8   25 ( 27) ee027fb2 1566412132000 2019-08-21 18:28:52 +0000 1326814106 100644 META-INF/MANIFEST.MF ; 0
       0    0 (  0)        0 1566412132000 2019-08-21 18:28:52 +0000 1326814106  40755 META-INF/ ; 0
       0    0 (  0)        0 1566412132000 2019-08-21 18:28:52 +0000 1326814106  40755 dir-A/ ; 0
       0    0 (  0)        0 1566412132000 2019-08-21 18:28:52 +0000 1326814106  40755 dir-C/ ; 0
       0    0 (  0)        0 1566412132000 2019-08-21 18:28:52 +0000 1326814106  40755 dir-b/ ; 0
       0    0 (  0)        0 1566412132000 2019-08-21 18:28:52 +0000 1326814106  40755 dir-b/B2/ ; 0
       0    0 (  0)        0 1566412132000 2019-08-21 18:28:52 +0000 1326814106  40755 dir-b/B4/ ; 0
       0    0 (  0)        0 1566412132000 2019-08-21 18:28:52 +0000 1326814106  40755 dir-b/b1/ ; 0
       0    0 (  0)        0 1566412132000 2019-08-21 18:28:52 +0000 1326814106  40755 dir-b/b3/ ; 0
       0    0 (  0)        0 1566412132000 2019-08-21 18:28:52 +0000 1326814106  40755 dir-d/ ; 0
       8  281 (118) d793ddf2 1566412132000 2019-08-21 18:28:52 +0000 1326814106 100644 META-INF/DEPENDENCIES ; 0
       8 11358 (3949) 86e2b4b4 1566412132000 2019-08-21 18:28:52 +0000 1326814106 100644 META-INF/LICENSE ; 0
       8  183 (129) 62b3bac9 1566412132000 2019-08-21 18:28:52 +0000 1326814106 100644 META-INF/NOTICE ; 0
       8    9 ( 11) 1c933a72 1566412132000 2019-08-21 18:28:52 +0000 1326814106 100644 Uppercase.txt ; 0
       8    2 (  4) 606c3d3b 1566412132000 2019-08-21 18:28:52 +0000 1326814106 100644 dir-A/A2.txt ; 0
       8    2 (  4) 890f980e 1566412132000 2019-08-21 18:28:52 +0000 1326814106 100644 dir-A/A4.txt ; 0
       8    2 (  4) 6ce14823 1566412132000 2019-08-21 18:28:52 +0000 1326814106 100644 dir-A/a1.txt ; 0
       8    2 (  4) 82ef290f 1566412132000 2019-08-21 18:28:52 +0000 1326814106 100644 dir-A/a3.txt ; 0
       8    1 (  3) 3dd7ffa7 1566412132000 2019-08-21 18:28:52 +0000 1326814106 100644 dir-C/C.txt ; 0
       8    2 (  4) 4b416ef8 1566412132000 2019-08-21 18:28:52 +0000 1326814106 100644 dir-b/B2/B2.txt ; 0
       8    2 (  4) a222cbcd 1566412132000 2019-08-21 18:28:52 +0000 1326814106 100644 dir-b/B4/B4.txt ; 0
       8    1 (  3) 71beeff9 1566412132000 2019-08-21 18:28:52 +0000 1326814106 100644 dir-b/b.txt ; 0
       8    2 (  4) 47cc1be0 1566412132000 2019-08-21 18:28:52 +0000 1326814106 100644 dir-b/b1/b1.txt ; 0
       8    2 (  4) a9c27acc 1566412132000 2019-08-21 18:28:52 +0000 1326814106 100644 dir-b/b3/b3.txt ; 0
       8    1 (  3) 98dd4acc 1566412132000 2019-08-21 18:28:52 +0000 1326814106 100644 dir-d/d.txt ; 0
       8   10 ( 12) d68eda01 1566412132000 2019-08-21 18:28:52 +0000 1326814106 100644 executable.txt ; 0
       8    9 ( 11) fe3d51f2 1566412132000 2019-08-21 18:28:52 +0000 1326814106 100644 lowercase.txt ; 0
[INFO] Building: verify-parameter-goal-jar/pom.xml
[INFO] run post-build script verify.groovy
[INFO]           verify-parameter-goal-jar/pom.xml ................ SUCCESS (6.1 s)
[INFO] Building: jar-includes-excludes/pom.xml
[INFO] run post-build script verify.bsh
[INFO]           jar-includes-excludes/pom.xml .................... SUCCESS (12.9 s)
[INFO] Building: test-jar-classifier/pom.xml
[INFO] run post-build script verify.bsh
[INFO]           test-jar-classifier/pom.xml ...................... SUCCESS (7.4 s)
[INFO] Building: verify-parameter-goal-generated-test-jar/pom.xml
[INFO] run post-build script verify.groovy
[INFO]           verify-parameter-goal-generated-test-jar/pom.xml . SUCCESS (5.5 s)
[INFO] Building: jar-with-archive-config/pom.xml
[INFO] run post-build script verify.bsh
[INFO]           jar-with-archive-config/pom.xml .................. SUCCESS (6.2 s)
[INFO] Building: jar/pom.xml
[INFO] run post-build script verify.bsh
[INFO]           jar/pom.xml ...................................... SUCCESS (7.8 s)
[INFO] Building: project-without-sources/pom.xml
[INFO] run post-build script verify.bsh
[INFO]           project-without-sources/pom.xml .................. SUCCESS (6.6 s)
[INFO] Building: MSOURCES-95/pom.xml
[INFO] run post-build script verify.groovy
[INFO]           MSOURCES-95/pom.xml .............................. SUCCESS (11.8 s)
[INFO] Building: verify-parameter-goal-jar-no-fork/pom.xml
[INFO] run post-build script verify.groovy
[INFO]           verify-parameter-goal-jar-no-fork/pom.xml ........ SUCCESS (4.7 s)
[INFO]
[INFO] --- maven-checkstyle-plugin:3.0.0:check (checkstyle-check) @ maven-source-plugin ---
[INFO]
[INFO] --- maven-invoker-plugin:3.1.0:verify (integration-test) @ maven-source-plugin ---
[INFO] -------------------------------------------------
[INFO] Build Summary:
[INFO]   Passed: 21, Failed: 1, Errors: 0, Skipped: 0
[INFO] -------------------------------------------------
[ERROR] The following builds failed:
[ERROR] *  reproducible/pom.xml
[INFO] -------------------------------------------------
[INFO] ------------------------------------------------------------------------
[INFO] BUILD FAILURE
[INFO] ------------------------------------------------------------------------
[INFO] Total time:  03:41 min
[INFO] Finished at: 2020-01-16T18:30:59Z
[INFO] ------------------------------------------------------------------------
[INFO] [jenkins-event-spy] Generated /home/jenkins/jenkins-slave/workspace/n-box_maven-source-plugin_master@2@tmp/withMavenc999fb85/maven-spy-20200116-182717-906320673380930918428.log
[ERROR] Failed to execute goal org.apache.maven.plugins:maven-invoker-plugin:3.1.0:verify (integration-test) on project maven-source-plugin: 1 build failed. See console output above for details. -> [Help 1]
org.apache.maven.lifecycle.LifecycleExecutionException: Failed to execute goal org.apache.maven.plugins:maven-invoker-plugin:3.1.0:verify (integration-test) on project maven-source-plugin: 1 build failed. See console output above for details.
    at org.apache.maven.lifecycle.internal.MojoExecutor.execute (MojoExecutor.java:215)
    at org.apache.maven.lifecycle.internal.MojoExecutor.execute (MojoExecutor.java:156)
    at org.apache.maven.lifecycle.internal.MojoExecutor.execute (MojoExecutor.java:148)
    at org.apache.maven.lifecycle.internal.LifecycleModuleBuilder.buildProject (LifecycleModuleBuilder.java:117)
    at org.apache.maven.lifecycle.internal.LifecycleModuleBuilder.buildProject (LifecycleModuleBuilder.java:81)
    at org.apache.maven.lifecycle.internal.builder.singlethreaded.SingleThreadedBuilder.build (SingleThreadedBuilder.java:56)
    at org.apache.maven.lifecycle.internal.LifecycleStarter.execute (LifecycleStarter.java:128)
    at org.apache.maven.DefaultMaven.doExecute (DefaultMaven.java:305)
    at org.apache.maven.DefaultMaven.doExecute (DefaultMaven.java:192)
    at org.apache.maven.DefaultMaven.execute (DefaultMaven.java:105)
    at org.apache.maven.cli.MavenCli.execute (MavenCli.java:956)
    at org.apache.maven.cli.MavenCli.doMain (MavenCli.java:288)
    at org.apache.maven.cli.MavenCli.main (MavenCli.java:192)
    at jdk.internal.reflect.NativeMethodAccessorImpl.invoke0 (Native Method)
    at jdk.internal.reflect.NativeMethodAccessorImpl.invoke (NativeMethodAccessorImpl.java:62)
    at jdk.internal.reflect.DelegatingMethodAccessorImpl.invoke (DelegatingMethodAccessorImpl.java:43)
    at java.lang.reflect.Method.invoke (Method.java:564)
    at org.codehaus.plexus.classworlds.launcher.Launcher.launchEnhanced (Launcher.java:282)
    at org.codehaus.plexus.classworlds.launcher.Launcher.launch (Launcher.java:225)
    at org.codehaus.plexus.classworlds.launcher.Launcher.mainWithExitCode (Launcher.java:406)
    at org.codehaus.plexus.classworlds.launcher.Launcher.main (Launcher.java:347)
Caused by: org.apache.maven.plugin.MojoFailureException: 1 build failed. See console output above for details.
    at org.apache.maven.plugins.invoker.InvokerSession.handleFailures (InvokerSession.java:260)
    at org.apache.maven.plugins.invoker.VerifyMojo.execute (VerifyMojo.java:137)
    at org.apache.maven.plugin.DefaultBuildPluginManager.executeMojo (DefaultBuildPluginManager.java:137)
    at org.apache.maven.lifecycle.internal.MojoExecutor.execute (MojoExecutor.java:210)
    at org.apache.maven.lifecycle.internal.MojoExecutor.execute (MojoExecutor.java:156)
    at org.apache.maven.lifecycle.internal.MojoExecutor.execute (MojoExecutor.java:148)
    at org.apache.maven.lifecycle.internal.LifecycleModuleBuilder.buildProject (LifecycleModuleBuilder.java:117)
    at org.apache.maven.lifecycle.internal.LifecycleModuleBuilder.buildProject (LifecycleModuleBuilder.java:81)
    at org.apache.maven.lifecycle.internal.builder.singlethreaded.SingleThreadedBuilder.build (SingleThreadedBuilder.java:56)
    at org.apache.maven.lifecycle.internal.LifecycleStarter.execute (LifecycleStarter.java:128)
    at org.apache.maven.DefaultMaven.doExecute (DefaultMaven.java:305)
    at org.apache.maven.DefaultMaven.doExecute (DefaultMaven.java:192)
    at org.apache.maven.DefaultMaven.execute (DefaultMaven.java:105)
    at org.apache.maven.cli.MavenCli.execute (MavenCli.java:956)
    at org.apache.maven.cli.MavenCli.doMain (MavenCli.java:288)
    at org.apache.maven.cli.MavenCli.main (MavenCli.java:192)
    at jdk.internal.reflect.NativeMethodAccessorImpl.invoke0 (Native Method)
    at jdk.internal.reflect.NativeMethodAccessorImpl.invoke (NativeMethodAccessorImpl.java:62)
    at jdk.internal.reflect.DelegatingMethodAccessorImpl.invoke (DelegatingMethodAccessorImpl.java:43)
    at java.lang.reflect.Method.invoke (Method.java:564)
    at org.codehaus.plexus.classworlds.launcher.Launcher.launchEnhanced (Launcher.java:282)
    at org.codehaus.plexus.classworlds.launcher.Launcher.launch (Launcher.java:225)
    at org.codehaus.plexus.classworlds.launcher.Launcher.mainWithExitCode (Launcher.java:406)
    at org.codehaus.plexus.classworlds.launcher.Launcher.main (Launcher.java:347)
[ERROR]
[ERROR] Re-run Maven using the -X switch to enable full debug logging.
[ERROR]
[ERROR] For more information about the errors and possible solutions, please read the following articles:
[ERROR] [Help 1] http://cwiki.apache.org/confluence/display/MAVEN/MojoFailureException
[Pipeline] }
[Pipeline] // dir
[Pipeline] }
[withMaven] junitPublisher - Archive test results for Maven artifact org.apache.maven.plugins:maven-source-plugin:maven-plugin:3.2.2-SNAPSHOT generated by maven-surefire-plugin:test (default-test): linux-jdk14-m3.6.x_build/target/surefire-reports/*.xml
Recording test results
[withMaven] openTasksPublisher - Scan Tasks for Maven artifact org.apache.maven.plugins:maven-source-plugin:maven-plugin:3.2.2-SNAPSHOT in source directory linux-jdk14-m3.6.x_build/src/main/java
[TASKS] Scanning folder '/home/jenkins/jenkins-slave/workspace/n-box_maven-source-plugin_master@2' for files matching the pattern 'linux-jdk14-m3.6.x_build/src/main/java/**/*' - excludes: null
[TASKS] Found 7 files to scan for tasks
[TASKS] Found 0 open tasks.
Skipping warnings blame since pipelines do not have an SCM link.%n
[TASKS] Computing warning deltas based on reference build #38
[withMaven] invokerPublisher - Archive invoker results for Maven artifact MavenArtifact{org.apache.maven.plugins:maven-source-plugin:maven-plugin:3.2.2-SNAPSHOT(version: 3.2.2-SNAPSHOT, snapshot:false) } generated by PluginInvocation{org.apache.maven.plugins:maven-invoker-plugin:3.1.0@integration-test  integration-test}: linux-jdk14-m3.6.x_build/target/invoker-reports/*.xml
[withMaven] Publishers: Generated Artifacts Publisher: 315 ms, Junit Publisher: 1126 ms, Open Task Scanner Publisher: 350 ms, Invoker Publisher: 19496 ms
[Pipeline] // withMaven
[Pipeline] cleanWs
[WS-CLEANUP] Deleting project workspace...
[WS-CLEANUP] Deferred wipeout is used...
[WS-CLEANUP] done
[Pipeline] cleanWs
[WS-CLEANUP] Deleting project workspace...
[WS-CLEANUP] Deferred wipeout is used...
[WS-CLEANUP] done
[Pipeline] }
[Pipeline] // stage
[Pipeline] }
[Pipeline] // ws
[Pipeline] }
[Pipeline] // node
[Pipeline] }
Failed in branch linux-jdk14-m3.6.x_build
[Pipeline] // parallel
[Pipeline] stage
[Pipeline] { (Notifications)
[Pipeline] echo
Build result: FAILURE
[Pipeline] jiraIssueSelector
[Pipeline] echo
The authors of changes [].
[Pipeline] echo
Sending email ...
[Pipeline] emailext
Reply | Threaded
Open this post in threaded view
|

Build failed in Jenkins: Maven TLP » maven-source-plugin » master #42

Apache Jenkins Server-2
See https://builds.apache.org/job/maven-box/job/maven-source-plugin/job/master/42/

No changes.

All tests passed

Build log:
[...truncated 6102 lines...]
[WS-CLEANUP] Deleting project workspace...
[WS-CLEANUP] Deferred wipeout is used...
[WS-CLEANUP] done
[Pipeline] }
[Pipeline] // stage
[Pipeline] }
[Pipeline] // ws
[Pipeline] }
[Pipeline] // node
[Pipeline] }
Failed in branch windows-jdk11-m3.6.x_build
[INFO] run post-build script verify.groovy
[INFO]           verify-parameter-goal-jar\pom.xml ................ SUCCESS (2.5 s)
[INFO] Building: verify-parameter-goal-jar-no-fork\pom.xml
[INFO] run post-build script verify.groovy
[INFO]           verify-parameter-goal-test-jar-no-fork/pom.xml ... SUCCESS (5.9 s)
[INFO] Building: jar/pom.xml
[INFO] run post-build script verify.groovy
[INFO]           verify-parameter-goal-jar-no-fork\pom.xml ........ SUCCESS (3.3 s)
[INFO] Building: verify-parameter-goal-test-jar\pom.xml
[INFO] run post-build script verify.groovy
[INFO]           verify-parameter-goal-test-jar\pom.xml ........... SUCCESS (3.1 s)
[INFO] Building: verify-parameter-goal-test-jar-no-fork\pom.xml
[INFO] run post-build script verify.bsh
[INFO]           jar/pom.xml ...................................... SUCCESS (6.4 s)
[INFO] Building: jar-attached/pom.xml
[INFO] run post-build script verify.groovy
[INFO]           verify-parameter-goal-test-jar-no-fork\pom.xml ... SUCCESS (3.6 s)
[INFO]
[INFO] --- maven-checkstyle-plugin:3.0.0:check (checkstyle-check) @ maven-source-plugin ---
[INFO]
[INFO] --- maven-invoker-plugin:3.1.0:verify (integration-test) @ maven-source-plugin ---
[INFO] -------------------------------------------------
[INFO] Build Summary:
[INFO]   Passed: 21, Failed: 1, Errors: 0, Skipped: 0
[INFO] -------------------------------------------------
[ERROR] The following builds failed:
[ERROR] *  reproducible\pom.xml
[INFO] -------------------------------------------------
[INFO] ------------------------------------------------------------------------
[INFO] BUILD FAILURE
[INFO] ------------------------------------------------------------------------
[INFO] Total time:  02:29 min
[INFO] Finished at: 2020-01-16T13:42:45-08:00
[INFO] ------------------------------------------------------------------------
[INFO] [jenkins-event-spy] Generated F:\jenkins\jenkins-slave\workspace\n-box_maven-source-plugin_master@2@tmp\withMaven7fc16a27\maven-spy-20200116-134016-3152175057275045568786.log
[ERROR] Failed to execute goal org.apache.maven.plugins:maven-invoker-plugin:3.1.0:verify (integration-test) on project maven-source-plugin: 1 build failed. See console output above for details. -> [Help 1]
org.apache.maven.lifecycle.LifecycleExecutionException: Failed to execute goal org.apache.maven.plugins:maven-invoker-plugin:3.1.0:verify (integration-test) on project maven-source-plugin: 1 build failed. See console output above for details.
    at org.apache.maven.lifecycle.internal.MojoExecutor.execute (MojoExecutor.java:215)
    at org.apache.maven.lifecycle.internal.MojoExecutor.execute (MojoExecutor.java:156)
    at org.apache.maven.lifecycle.internal.MojoExecutor.execute (MojoExecutor.java:148)
    at org.apache.maven.lifecycle.internal.LifecycleModuleBuilder.buildProject (LifecycleModuleBuilder.java:117)
    at org.apache.maven.lifecycle.internal.LifecycleModuleBuilder.buildProject (LifecycleModuleBuilder.java:81)
    at org.apache.maven.lifecycle.internal.builder.singlethreaded.SingleThreadedBuilder.build (SingleThreadedBuilder.java:56)
    at org.apache.maven.lifecycle.internal.LifecycleStarter.execute (LifecycleStarter.java:128)
    at org.apache.maven.DefaultMaven.doExecute (DefaultMaven.java:305)
    at org.apache.maven.DefaultMaven.doExecute (DefaultMaven.java:192)
    at org.apache.maven.DefaultMaven.execute (DefaultMaven.java:105)
    at org.apache.maven.cli.MavenCli.execute (MavenCli.java:956)
    at org.apache.maven.cli.MavenCli.doMain (MavenCli.java:288)
    at org.apache.maven.cli.MavenCli.main (MavenCli.java:192)
    at jdk.internal.reflect.NativeMethodAccessorImpl.invoke0 (Native Method)
    at jdk.internal.reflect.NativeMethodAccessorImpl.invoke (NativeMethodAccessorImpl.java:62)
    at jdk.internal.reflect.DelegatingMethodAccessorImpl.invoke (DelegatingMethodAccessorImpl.java:43)
    at java.lang.reflect.Method.invoke (Method.java:567)
    at org.codehaus.plexus.classworlds.launcher.Launcher.launchEnhanced (Launcher.java:282)
    at org.codehaus.plexus.classworlds.launcher.Launcher.launch (Launcher.java:225)
    at org.codehaus.plexus.classworlds.launcher.Launcher.mainWithExitCode (Launcher.java:406)
    at org.codehaus.plexus.classworlds.launcher.Launcher.main (Launcher.java:347)
Caused by: org.apache.maven.plugin.MojoFailureException: 1 build failed. See console output above for details.
    at org.apache.maven.plugins.invoker.InvokerSession.handleFailures (InvokerSession.java:260)
    at org.apache.maven.plugins.invoker.VerifyMojo.execute (VerifyMojo.java:137)
    at org.apache.maven.plugin.DefaultBuildPluginManager.executeMojo (DefaultBuildPluginManager.java:137)
    at org.apache.maven.lifecycle.internal.MojoExecutor.execute (MojoExecutor.java:210)
    at org.apache.maven.lifecycle.internal.MojoExecutor.execute (MojoExecutor.java:156)
    at org.apache.maven.lifecycle.internal.MojoExecutor.execute (MojoExecutor.java:148)
    at org.apache.maven.lifecycle.internal.LifecycleModuleBuilder.buildProject (LifecycleModuleBuilder.java:117)
    at org.apache.maven.lifecycle.internal.LifecycleModuleBuilder.buildProject (LifecycleModuleBuilder.java:81)
    at org.apache.maven.lifecycle.internal.builder.singlethreaded.SingleThreadedBuilder.build (SingleThreadedBuilder.java:56)
    at org.apache.maven.lifecycle.internal.LifecycleStarter.execute (LifecycleStarter.java:128)
    at org.apache.maven.DefaultMaven.doExecute (DefaultMaven.java:305)
    at org.apache.maven.DefaultMaven.doExecute (DefaultMaven.java:192)
    at org.apache.maven.DefaultMaven.execute (DefaultMaven.java:105)
    at org.apache.maven.cli.MavenCli.execute (MavenCli.java:956)
    at org.apache.maven.cli.MavenCli.doMain (MavenCli.java:288)
    at org.apache.maven.cli.MavenCli.main (MavenCli.java:192)
    at jdk.internal.reflect.NativeMethodAccessorImpl.invoke0 (Native Method)
    at jdk.internal.reflect.NativeMethodAccessorImpl.invoke (NativeMethodAccessorImpl.java:62)
    at jdk.internal.reflect.DelegatingMethodAccessorImpl.invoke (DelegatingMethodAccessorImpl.java:43)
    at java.lang.reflect.Method.invoke (Method.java:567)
    at org.codehaus.plexus.classworlds.launcher.Launcher.launchEnhanced (Launcher.java:282)
    at org.codehaus.plexus.classworlds.launcher.Launcher.launch (Launcher.java:225)
    at org.codehaus.plexus.classworlds.launcher.Launcher.mainWithExitCode (Launcher.java:406)
    at org.codehaus.plexus.classworlds.launcher.Launcher.main (Launcher.java:347)
[ERROR]
[ERROR] Re-run Maven using the -X switch to enable full debug logging.
[ERROR]
[ERROR] For more information about the errors and possible solutions, please read the following articles:
[ERROR] [Help 1] http://cwiki.apache.org/confluence/display/MAVEN/MojoFailureException
[Pipeline] }
[Pipeline] // dir
[Pipeline] }
[withMaven] junitPublisher - Archive test results for Maven artifact org.apache.maven.plugins:maven-source-plugin:maven-plugin:3.2.2-SNAPSHOT generated by maven-surefire-plugin:test (default-test): windows-jdk14-m3.6.x_build\target\surefire-reports\*.xml
Recording test results
[withMaven] openTasksPublisher - Scan Tasks for Maven artifact org.apache.maven.plugins:maven-source-plugin:maven-plugin:3.2.2-SNAPSHOT in source directory windows-jdk14-m3.6.x_build\src\main\java
[TASKS] Scanning folder 'f:\jenkins\jenkins-slave\workspace\n-box_maven-source-plugin_master@2' for files matching the pattern 'windows-jdk14-m3.6.x_build\src\main\java\**\*' - excludes: null
[TASKS] Found 7 files to scan for tasks
[TASKS] Found 0 open tasks.
Skipping warnings blame since pipelines do not have an SCM link.%n
[TASKS] Computing warning deltas based on reference build #38
[withMaven] invokerPublisher - Archive invoker results for Maven artifact MavenArtifact{org.apache.maven.plugins:maven-source-plugin:maven-plugin:3.2.2-SNAPSHOT(version: 3.2.2-SNAPSHOT, snapshot:false) } generated by PluginInvocation{org.apache.maven.plugins:maven-invoker-plugin:3.1.0@integration-test  integration-test}: windows-jdk14-m3.6.x_build\target\invoker-reports\*.xml
[withMaven] Publishers: Generated Artifacts Publisher: 15 ms, Junit Publisher: 56 ms, Open Task Scanner Publisher: 47 ms, Invoker Publisher: 4180 ms
[Pipeline] // withMaven
[Pipeline] cleanWs
[WS-CLEANUP] Deleting project workspace...
[WS-CLEANUP] Deferred wipeout is used...
[WS-CLEANUP] done
[Pipeline] cleanWs
[WS-CLEANUP] Deleting project workspace...
[WS-CLEANUP] Deferred wipeout is used...
[WS-CLEANUP] done
[Pipeline] }
[Pipeline] // stage
[Pipeline] }
[Pipeline] // ws
[Pipeline] }
[Pipeline] // node
[Pipeline] }
Failed in branch windows-jdk14-m3.6.x_build
[INFO] run post-build script verify.bsh
[INFO]           jar-attached/pom.xml ............................. SUCCESS (10.0 s)
[INFO] Building: test-jar-classifier/pom.xml
[INFO] run post-build script verify.bsh
[INFO]           test-jar-classifier/pom.xml ...................... SUCCESS (6.6 s)
[INFO] Building: jar-without-descriptor-config/pom.xml
[INFO] run post-build script verify.bsh
[INFO]           jar-without-descriptor-config/pom.xml ............ SUCCESS (6.3 s)
[INFO]
[INFO] --- maven-checkstyle-plugin:3.0.0:check (checkstyle-check) @ maven-source-plugin ---
[INFO]
[INFO] --- maven-invoker-plugin:3.1.0:verify (integration-test) @ maven-source-plugin ---
[INFO] -------------------------------------------------
[INFO] Build Summary:
[INFO]   Passed: 21, Failed: 1, Errors: 0, Skipped: 0
[INFO] -------------------------------------------------
[ERROR] The following builds failed:
[ERROR] *  reproducible/pom.xml
[INFO] -------------------------------------------------
[INFO] ------------------------------------------------------------------------
[INFO] BUILD FAILURE
[INFO] ------------------------------------------------------------------------
[INFO] Total time: 03:29 min
[INFO] Finished at: 2020-01-16T21:43:08Z
[INFO] ------------------------------------------------------------------------
[INFO] [jenkins-event-spy] Generated /home/jenkins/jenkins-slave/workspace/n-box_maven-source-plugin_master@2@tmp/withMaven3776d65d/maven-spy-20200116-213938-2321619800746484801487.log
[ERROR] Failed to execute goal org.apache.maven.plugins:maven-invoker-plugin:3.1.0:verify (integration-test) on project maven-source-plugin: 1 build failed. See console output above for details. -> [Help 1]
org.apache.maven.lifecycle.LifecycleExecutionException: Failed to execute goal org.apache.maven.plugins:maven-invoker-plugin:3.1.0:verify (integration-test) on project maven-source-plugin: 1 build failed. See console output above for details.
    at org.apache.maven.lifecycle.internal.MojoExecutor.execute (MojoExecutor.java:213)
    at org.apache.maven.lifecycle.internal.MojoExecutor.execute (MojoExecutor.java:154)
    at org.apache.maven.lifecycle.internal.MojoExecutor.execute (MojoExecutor.java:146)
    at org.apache.maven.lifecycle.internal.LifecycleModuleBuilder.buildProject (LifecycleModuleBuilder.java:117)
    at org.apache.maven.lifecycle.internal.LifecycleModuleBuilder.buildProject (LifecycleModuleBuilder.java:81)
    at org.apache.maven.lifecycle.internal.builder.singlethreaded.SingleThreadedBuilder.build (SingleThreadedBuilder.java:56)
    at org.apache.maven.lifecycle.internal.LifecycleStarter.execute (LifecycleStarter.java:128)
    at org.apache.maven.DefaultMaven.doExecute (DefaultMaven.java:305)
    at org.apache.maven.DefaultMaven.doExecute (DefaultMaven.java:192)
    at org.apache.maven.DefaultMaven.execute (DefaultMaven.java:105)
    at org.apache.maven.cli.MavenCli.execute (MavenCli.java:954)
    at org.apache.maven.cli.MavenCli.doMain (MavenCli.java:288)
    at org.apache.maven.cli.MavenCli.main (MavenCli.java:192)
    at sun.reflect.NativeMethodAccessorImpl.invoke0 (Native Method)
    at sun.reflect.NativeMethodAccessorImpl.invoke (NativeMethodAccessorImpl.java:57)
    at sun.reflect.DelegatingMethodAccessorImpl.invoke (DelegatingMethodAccessorImpl.java:43)
    at java.lang.reflect.Method.invoke (Method.java:606)
    at org.codehaus.plexus.classworlds.launcher.Launcher.launchEnhanced (Launcher.java:289)
    at org.codehaus.plexus.classworlds.launcher.Launcher.launch (Launcher.java:229)
    at org.codehaus.plexus.classworlds.launcher.Launcher.mainWithExitCode (Launcher.java:415)
    at org.codehaus.plexus.classworlds.launcher.Launcher.main (Launcher.java:356)
Caused by: org.apache.maven.plugin.MojoFailureException: 1 build failed. See console output above for details.
    at org.apache.maven.plugins.invoker.InvokerSession.handleFailures (InvokerSession.java:260)
    at org.apache.maven.plugins.invoker.VerifyMojo.execute (VerifyMojo.java:137)
    at org.apache.maven.plugin.DefaultBuildPluginManager.executeMojo (DefaultBuildPluginManager.java:137)
    at org.apache.maven.lifecycle.internal.MojoExecutor.execute (MojoExecutor.java:208)
    at org.apache.maven.lifecycle.internal.MojoExecutor.execute (MojoExecutor.java:154)
    at org.apache.maven.lifecycle.internal.MojoExecutor.execute (MojoExecutor.java:146)
    at org.apache.maven.lifecycle.internal.LifecycleModuleBuilder.buildProject (LifecycleModuleBuilder.java:117)
    at org.apache.maven.lifecycle.internal.LifecycleModuleBuilder.buildProject (LifecycleModuleBuilder.java:81)
    at org.apache.maven.lifecycle.internal.builder.singlethreaded.SingleThreadedBuilder.build (SingleThreadedBuilder.java:56)
    at org.apache.maven.lifecycle.internal.LifecycleStarter.execute (LifecycleStarter.java:128)
    at org.apache.maven.DefaultMaven.doExecute (DefaultMaven.java:305)
    at org.apache.maven.DefaultMaven.doExecute (DefaultMaven.java:192)
    at org.apache.maven.DefaultMaven.execute (DefaultMaven.java:105)
    at org.apache.maven.cli.MavenCli.execute (MavenCli.java:954)
    at org.apache.maven.cli.MavenCli.doMain (MavenCli.java:288)
    at org.apache.maven.cli.MavenCli.main (MavenCli.java:192)
    at sun.reflect.NativeMethodAccessorImpl.invoke0 (Native Method)
    at sun.reflect.NativeMethodAccessorImpl.invoke (NativeMethodAccessorImpl.java:57)
    at sun.reflect.DelegatingMethodAccessorImpl.invoke (DelegatingMethodAccessorImpl.java:43)
    at java.lang.reflect.Method.invoke (Method.java:606)
    at org.codehaus.plexus.classworlds.launcher.Launcher.launchEnhanced (Launcher.java:289)
    at org.codehaus.plexus.classworlds.launcher.Launcher.launch (Launcher.java:229)
    at org.codehaus.plexus.classworlds.launcher.Launcher.mainWithExitCode (Launcher.java:415)
    at org.codehaus.plexus.classworlds.launcher.Launcher.main (Launcher.java:356)
[ERROR]
[ERROR] Re-run Maven using the -X switch to enable full debug logging.
[ERROR]
[ERROR] For more information about the errors and possible solutions, please read the following articles:
[ERROR] [Help 1] http://cwiki.apache.org/confluence/display/MAVEN/MojoFailureException
[Pipeline] }
[Pipeline] // dir
[Pipeline] }
[withMaven] junitPublisher - Archive test results for Maven artifact org.apache.maven.plugins:maven-source-plugin:maven-plugin:3.2.2-SNAPSHOT generated by maven-surefire-plugin:test (default-test): linux-jdk7-m3.5.x_build/target/surefire-reports/*.xml
Recording test results
[withMaven] openTasksPublisher - Scan Tasks for Maven artifact org.apache.maven.plugins:maven-source-plugin:maven-plugin:3.2.2-SNAPSHOT in source directory linux-jdk7-m3.5.x_build/src/main/java
[TASKS] Scanning folder '/home/jenkins/jenkins-slave/workspace/n-box_maven-source-plugin_master@2' for files matching the pattern 'linux-jdk7-m3.5.x_build/src/main/java/**/*' - excludes: null
[TASKS] Found 7 files to scan for tasks
[TASKS] Found 0 open tasks.
Skipping warnings blame since pipelines do not have an SCM link.%n
[TASKS] Computing warning deltas based on reference build #38
[withMaven] invokerPublisher - Archive invoker results for Maven artifact MavenArtifact{org.apache.maven.plugins:maven-source-plugin:maven-plugin:3.2.2-SNAPSHOT(version: 3.2.2-SNAPSHOT, snapshot:false) } generated by PluginInvocation{org.apache.maven.plugins:maven-invoker-plugin:3.1.0@integration-test  integration-test}: linux-jdk7-m3.5.x_build/target/invoker-reports/*.xml
[withMaven] Publishers: Generated Artifacts Publisher: 315 ms, Junit Publisher: 1132 ms, Open Task Scanner Publisher: 346 ms, Invoker Publisher: 20069 ms
[Pipeline] // withMaven
[Pipeline] cleanWs
[WS-CLEANUP] Deleting project workspace...
[WS-CLEANUP] Deferred wipeout is used...
[WS-CLEANUP] done
[Pipeline] cleanWs
[WS-CLEANUP] Deleting project workspace...
[WS-CLEANUP] Deferred wipeout is used...
[WS-CLEANUP] done
[Pipeline] }
[Pipeline] // stage
[Pipeline] }
[Pipeline] // ws
[Pipeline] }
[Pipeline] // node
[Pipeline] }
Failed in branch linux-jdk7-m3.5.x_build
[Pipeline] // parallel
[Pipeline] stage
[Pipeline] { (Notifications)
[Pipeline] echo
Build result: FAILURE
[Pipeline] jiraIssueSelector
[Pipeline] echo
The authors of changes [].
[Pipeline] echo
Sending email ...
[Pipeline] emailext
Reply | Threaded
Open this post in threaded view
|

Build failed in Jenkins: Maven TLP » maven-source-plugin » master #43

Apache Jenkins Server-2
See https://builds.apache.org/job/maven-box/job/maven-source-plugin/job/master/43/

Changes:

* H30 is having issues

All tests passed

Build log:
[...truncated 6072 lines...]
[INFO]           test-jar-generated\pom.xml ....................... SUCCESS (4.5 s)
[INFO] Building: test-jar-no-fork\pom.xml
[INFO] run post-build script verify.bsh
[INFO]           test-jar-no-fork\pom.xml ......................... SUCCESS (5.4 s)
[INFO] Building: verify-parameter-goal-generated-test-jar\pom.xml
[INFO] run post-build script verify.bsh
[INFO]           test-jar-no-fork\pom.xml ......................... SUCCESS (5.5 s)
[INFO] Building: verify-parameter-goal-generated-test-jar\pom.xml
[INFO] run post-build script verify.groovy
[INFO]           verify-parameter-goal-generated-test-jar\pom.xml . SUCCESS (3.1 s)
[INFO] Building: verify-parameter-goal-jar\pom.xml
[INFO] run post-build script verify.groovy
[INFO]           verify-parameter-goal-generated-test-jar\pom.xml . SUCCESS (3.1 s)
[INFO] Building: verify-parameter-goal-jar\pom.xml
[INFO] run post-build script verify.groovy
[INFO]           verify-parameter-goal-jar\pom.xml ................ SUCCESS (3.6 s)
[INFO] Building: verify-parameter-goal-jar-no-fork\pom.xml
[INFO] run post-build script verify.groovy
[INFO]           verify-parameter-goal-jar\pom.xml ................ SUCCESS (3.3 s)
[INFO] Building: verify-parameter-goal-jar-no-fork\pom.xml
[INFO] run post-build script verify.groovy
[INFO]           verify-parameter-goal-jar-no-fork\pom.xml ........ SUCCESS (3.2 s)
[INFO] Building: verify-parameter-goal-test-jar\pom.xml
[INFO] run post-build script verify.groovy
[INFO]           verify-parameter-goal-jar-no-fork\pom.xml ........ SUCCESS (3.2 s)
[INFO] Building: verify-parameter-goal-test-jar\pom.xml
[INFO] run post-build script verify.groovy
[INFO]           verify-parameter-goal-test-jar\pom.xml ........... SUCCESS (3.4 s)
[INFO] Building: verify-parameter-goal-test-jar-no-fork\pom.xml
[INFO] run post-build script verify.groovy
[INFO]           verify-parameter-goal-test-jar\pom.xml ........... SUCCESS (3.6 s)
[INFO] Building: verify-parameter-goal-test-jar-no-fork\pom.xml
[INFO] run post-build script verify.groovy
[INFO]           verify-parameter-goal-test-jar-no-fork\pom.xml ... SUCCESS (3.5 s)
[INFO]
[INFO] --- maven-checkstyle-plugin:3.0.0:check (checkstyle-check) @ maven-source-plugin ---
[INFO] run post-build script verify.groovy
[INFO]           verify-parameter-goal-test-jar-no-fork\pom.xml ... SUCCESS (3.4 s)
[INFO]
[INFO] --- maven-checkstyle-plugin:3.0.0:check (checkstyle-check) @ maven-source-plugin ---
[INFO]
[INFO] --- maven-invoker-plugin:3.1.0:verify (integration-test) @ maven-source-plugin ---
[INFO] -------------------------------------------------
[INFO] Build Summary:
[INFO]   Passed: 21, Failed: 1, Errors: 0, Skipped: 0
[INFO] -------------------------------------------------
[ERROR] The following builds failed:
[ERROR] *  reproducible\pom.xml
[INFO] -------------------------------------------------
[INFO] ------------------------------------------------------------------------
[INFO] BUILD FAILURE
[INFO] ------------------------------------------------------------------------
[INFO] Total time:  03:13 min
[INFO] Finished at: 2020-01-17T11:25:35-08:00
[INFO] ------------------------------------------------------------------------
[INFO] [jenkins-event-spy] Generated F:\jenkins\jenkins-slave\workspace\n-box_maven-source-plugin_master@3@tmp\withMavenb7818ee1\maven-spy-20200117-112220-7014289618851575584351.log
[ERROR] Failed to execute goal org.apache.maven.plugins:maven-invoker-plugin:3.1.0:verify (integration-test) on project maven-source-plugin: 1 build failed. See console output above for details. -> [Help 1]
org.apache.maven.lifecycle.LifecycleExecutionException: Failed to execute goal org.apache.maven.plugins:maven-invoker-plugin:3.1.0:verify (integration-test) on project maven-source-plugin: 1 build failed. See console output above for details.
    at org.apache.maven.lifecycle.internal.MojoExecutor.execute (MojoExecutor.java:215)
    at org.apache.maven.lifecycle.internal.MojoExecutor.execute (MojoExecutor.java:156)
    at org.apache.maven.lifecycle.internal.MojoExecutor.execute (MojoExecutor.java:148)
    at org.apache.maven.lifecycle.internal.LifecycleModuleBuilder.buildProject (LifecycleModuleBuilder.java:117)
    at org.apache.maven.lifecycle.internal.LifecycleModuleBuilder.buildProject (LifecycleModuleBuilder.java:81)
    at org.apache.maven.lifecycle.internal.builder.singlethreaded.SingleThreadedBuilder.build (SingleThreadedBuilder.java:56)
    at org.apache.maven.lifecycle.internal.LifecycleStarter.execute (LifecycleStarter.java:128)
    at org.apache.maven.DefaultMaven.doExecute (DefaultMaven.java:305)
    at org.apache.maven.DefaultMaven.doExecute (DefaultMaven.java:192)
    at org.apache.maven.DefaultMaven.execute (DefaultMaven.java:105)
    at org.apache.maven.cli.MavenCli.execute (MavenCli.java:956)
    at org.apache.maven.cli.MavenCli.doMain (MavenCli.java:288)
    at org.apache.maven.cli.MavenCli.main (MavenCli.java:192)
    at jdk.internal.reflect.NativeMethodAccessorImpl.invoke0 (Native Method)
    at jdk.internal.reflect.NativeMethodAccessorImpl.invoke (NativeMethodAccessorImpl.java:62)
    at jdk.internal.reflect.DelegatingMethodAccessorImpl.invoke (DelegatingMethodAccessorImpl.java:43)
    at java.lang.reflect.Method.invoke (Method.java:566)
    at org.codehaus.plexus.classworlds.launcher.Launcher.launchEnhanced (Launcher.java:282)
    at org.codehaus.plexus.classworlds.launcher.Launcher.launch (Launcher.java:225)
    at org.codehaus.plexus.classworlds.launcher.Launcher.mainWithExitCode (Launcher.java:406)
    at org.codehaus.plexus.classworlds.launcher.Launcher.main (Launcher.java:347)
Caused by: org.apache.maven.plugin.MojoFailureException: 1 build failed. See console output above for details.
    at org.apache.maven.plugins.invoker.InvokerSession.handleFailures (InvokerSession.java:260)
    at org.apache.maven.plugins.invoker.VerifyMojo.execute (VerifyMojo.java:137)
    at org.apache.maven.plugin.DefaultBuildPluginManager.executeMojo (DefaultBuildPluginManager.java:137)
    at org.apache.maven.lifecycle.internal.MojoExecutor.execute (MojoExecutor.java:210)
    at org.apache.maven.lifecycle.internal.MojoExecutor.execute (MojoExecutor.java:156)
    at org.apache.maven.lifecycle.internal.MojoExecutor.execute (MojoExecutor.java:148)
    at org.apache.maven.lifecycle.internal.LifecycleModuleBuilder.buildProject (LifecycleModuleBuilder.java:117)
    at org.apache.maven.lifecycle.internal.LifecycleModuleBuilder.buildProject (LifecycleModuleBuilder.java:81)
    at org.apache.maven.lifecycle.internal.builder.singlethreaded.SingleThreadedBuilder.build (SingleThreadedBuilder.java:56)
    at org.apache.maven.lifecycle.internal.LifecycleStarter.execute (LifecycleStarter.java:128)
    at org.apache.maven.DefaultMaven.doExecute (DefaultMaven.java:305)
    at org.apache.maven.DefaultMaven.doExecute (DefaultMaven.java:192)
    at org.apache.maven.DefaultMaven.execute (DefaultMaven.java:105)
    at org.apache.maven.cli.MavenCli.execute (MavenCli.java:956)
    at org.apache.maven.cli.MavenCli.doMain (MavenCli.java:288)
    at org.apache.maven.cli.MavenCli.main (MavenCli.java:192)
    at jdk.internal.reflect.NativeMethodAccessorImpl.invoke0 (Native Method)
    at jdk.internal.reflect.NativeMethodAccessorImpl.invoke (NativeMethodAccessorImpl.java:62)
    at jdk.internal.reflect.DelegatingMethodAccessorImpl.invoke (DelegatingMethodAccessorImpl.java:43)
    at java.lang.reflect.Method.invoke (Method.java:566)
    at org.codehaus.plexus.classworlds.launcher.Launcher.launchEnhanced (Launcher.java:282)
    at org.codehaus.plexus.classworlds.launcher.Launcher.launch (Launcher.java:225)
    at org.codehaus.plexus.classworlds.launcher.Launcher.mainWithExitCode (Launcher.java:406)
    at org.codehaus.plexus.classworlds.launcher.Launcher.main (Launcher.java:347)
[ERROR]
[ERROR] Re-run Maven using the -X switch to enable full debug logging.
[ERROR]
[ERROR] For more information about the errors and possible solutions, please read the following articles:
[ERROR] [Help 1] http://cwiki.apache.org/confluence/display/MAVEN/MojoFailureException
[Pipeline] }
[Pipeline] // dir
[Pipeline] }
[INFO]
[INFO] --- maven-invoker-plugin:3.1.0:verify (integration-test) @ maven-source-plugin ---
[INFO] -------------------------------------------------
[INFO] Build Summary:
[INFO]   Passed: 21, Failed: 1, Errors: 0, Skipped: 0
[INFO] -------------------------------------------------
[ERROR] The following builds failed:
[ERROR] *  reproducible\pom.xml
[INFO] -------------------------------------------------
[INFO] ------------------------------------------------------------------------
[INFO] BUILD FAILURE
[INFO] ------------------------------------------------------------------------
[INFO] Total time:  03:14 min
[INFO] Finished at: 2020-01-17T11:25:35-08:00
[INFO] ------------------------------------------------------------------------
[INFO] [jenkins-event-spy] Generated F:\jenkins\jenkins-slave\workspace\n-box_maven-source-plugin_master@2@2@tmp\withMaven9501d124\maven-spy-20200117-112220-70718419052515149063311.log
[ERROR] Failed to execute goal org.apache.maven.plugins:maven-invoker-plugin:3.1.0:verify (integration-test) on project maven-source-plugin: 1 build failed. See console output above for details. -> [Help 1]
org.apache.maven.lifecycle.LifecycleExecutionException: Failed to execute goal org.apache.maven.plugins:maven-invoker-plugin:3.1.0:verify (integration-test) on project maven-source-plugin: 1 build failed. See console output above for details.
    at org.apache.maven.lifecycle.internal.MojoExecutor.execute (MojoExecutor.java:215)
    at org.apache.maven.lifecycle.internal.MojoExecutor.execute (MojoExecutor.java:156)
    at org.apache.maven.lifecycle.internal.MojoExecutor.execute (MojoExecutor.java:148)
    at org.apache.maven.lifecycle.internal.LifecycleModuleBuilder.buildProject (LifecycleModuleBuilder.java:117)
    at org.apache.maven.lifecycle.internal.LifecycleModuleBuilder.buildProject (LifecycleModuleBuilder.java:81)
    at org.apache.maven.lifecycle.internal.builder.singlethreaded.SingleThreadedBuilder.build (SingleThreadedBuilder.java:56)
    at org.apache.maven.lifecycle.internal.LifecycleStarter.execute (LifecycleStarter.java:128)
    at org.apache.maven.DefaultMaven.doExecute (DefaultMaven.java:305)
    at org.apache.maven.DefaultMaven.doExecute (DefaultMaven.java:192)
    at org.apache.maven.DefaultMaven.execute (DefaultMaven.java:105)
    at org.apache.maven.cli.MavenCli.execute (MavenCli.java:956)
    at org.apache.maven.cli.MavenCli.doMain (MavenCli.java:288)
    at org.apache.maven.cli.MavenCli.main (MavenCli.java:192)
    at jdk.internal.reflect.NativeMethodAccessorImpl.invoke0 (Native Method)
    at jdk.internal.reflect.NativeMethodAccessorImpl.invoke (NativeMethodAccessorImpl.java:62)
    at jdk.internal.reflect.DelegatingMethodAccessorImpl.invoke (DelegatingMethodAccessorImpl.java:43)
    at java.lang.reflect.Method.invoke (Method.java:567)
    at org.codehaus.plexus.classworlds.launcher.Launcher.launchEnhanced (Launcher.java:282)
    at org.codehaus.plexus.classworlds.launcher.Launcher.launch (Launcher.java:225)
    at org.codehaus.plexus.classworlds.launcher.Launcher.mainWithExitCode (Launcher.java:406)
    at org.codehaus.plexus.classworlds.launcher.Launcher.main (Launcher.java:347)
Caused by: org.apache.maven.plugin.MojoFailureException: 1 build failed. See console output above for details.
    at org.apache.maven.plugins.invoker.InvokerSession.handleFailures (InvokerSession.java:260)
    at org.apache.maven.plugins.invoker.VerifyMojo.execute (VerifyMojo.java:137)
    at org.apache.maven.plugin.DefaultBuildPluginManager.executeMojo (DefaultBuildPluginManager.java:137)
    at org.apache.maven.lifecycle.internal.MojoExecutor.execute (MojoExecutor.java:210)
    at org.apache.maven.lifecycle.internal.MojoExecutor.execute (MojoExecutor.java:156)
    at org.apache.maven.lifecycle.internal.MojoExecutor.execute (MojoExecutor.java:148)
    at org.apache.maven.lifecycle.internal.LifecycleModuleBuilder.buildProject (LifecycleModuleBuilder.java:117)
    at org.apache.maven.lifecycle.internal.LifecycleModuleBuilder.buildProject (LifecycleModuleBuilder.java:81)
    at org.apache.maven.lifecycle.internal.builder.singlethreaded.SingleThreadedBuilder.build (SingleThreadedBuilder.java:56)
    at org.apache.maven.lifecycle.internal.LifecycleStarter.execute (LifecycleStarter.java:128)
    at org.apache.maven.DefaultMaven.doExecute (DefaultMaven.java:305)
    at org.apache.maven.DefaultMaven.doExecute (DefaultMaven.java:192)
    at org.apache.maven.DefaultMaven.execute (DefaultMaven.java:105)
    at org.apache.maven.cli.MavenCli.execute (MavenCli.java:956)
    at org.apache.maven.cli.MavenCli.doMain (MavenCli.java:288)
    at org.apache.maven.cli.MavenCli.main (MavenCli.java:192)
    at jdk.internal.reflect.NativeMethodAccessorImpl.invoke0 (Native Method)
    at jdk.internal.reflect.NativeMethodAccessorImpl.invoke (NativeMethodAccessorImpl.java:62)
    at jdk.internal.reflect.DelegatingMethodAccessorImpl.invoke (DelegatingMethodAccessorImpl.java:43)
    at java.lang.reflect.Method.invoke (Method.java:567)
    at org.codehaus.plexus.classworlds.launcher.Launcher.launchEnhanced (Launcher.java:282)
    at org.codehaus.plexus.classworlds.launcher.Launcher.launch (Launcher.java:225)
    at org.codehaus.plexus.classworlds.launcher.Launcher.mainWithExitCode (Launcher.java:406)
    at org.codehaus.plexus.classworlds.launcher.Launcher.main (Launcher.java:347)
[ERROR]
[ERROR] Re-run Maven using the -X switch to enable full debug logging.
[ERROR]
[ERROR] For more information about the errors and possible solutions, please read the following articles:
[ERROR] [Help 1] http://cwiki.apache.org/confluence/display/MAVEN/MojoFailureException
[Pipeline] }
[Pipeline] // dir
[Pipeline] }
[withMaven] junitPublisher - Archive test results for Maven artifact org.apache.maven.plugins:maven-source-plugin:maven-plugin:3.2.2-SNAPSHOT generated by maven-surefire-plugin:test (default-test): windows-jdk13-m3.6.x_build\target\surefire-reports\*.xml
Recording test results
[withMaven] junitPublisher - Archive test results for Maven artifact org.apache.maven.plugins:maven-source-plugin:maven-plugin:3.2.2-SNAPSHOT generated by maven-surefire-plugin:test (default-test): windows-jdk11-m3.6.x_build\target\surefire-reports\*.xml
Recording test results
[withMaven] openTasksPublisher - Scan Tasks for Maven artifact org.apache.maven.plugins:maven-source-plugin:maven-plugin:3.2.2-SNAPSHOT in source directory windows-jdk11-m3.6.x_build\src\main\java
[withMaven] openTasksPublisher - Scan Tasks for Maven artifact org.apache.maven.plugins:maven-source-plugin:maven-plugin:3.2.2-SNAPSHOT in source directory windows-jdk13-m3.6.x_build\src\main\java
[TASKS] Scanning folder 'f:\jenkins\jenkins-slave\workspace\n-box_maven-source-plugin_master@2@2' for files matching the pattern 'windows-jdk13-m3.6.x_build\src\main\java\**\*' - excludes: null
[TASKS] Found 7 files to scan for tasks
[TASKS] Found 0 open tasks.
Skipping warnings blame since pipelines do not have an SCM link.%n
[TASKS] Scanning folder 'f:\jenkins\jenkins-slave\workspace\n-box_maven-source-plugin_master@3' for files matching the pattern 'windows-jdk11-m3.6.x_build\src\main\java\**\*' - excludes: null
[TASKS] Found 7 files to scan for tasks
[TASKS] Found 0 open tasks.
Skipping warnings blame since pipelines do not have an SCM link.%n
[TASKS] Computing warning deltas based on reference build #38[TASKS] Computing warning deltas based on reference build #38

[withMaven] invokerPublisher - Archive invoker results for Maven artifact MavenArtifact{org.apache.maven.plugins:maven-source-plugin:maven-plugin:3.2.2-SNAPSHOT(version: 3.2.2-SNAPSHOT, snapshot:false) } generated by PluginInvocation{org.apache.maven.plugins:maven-invoker-plugin:3.1.0@integration-test  integration-test}: windows-jdk11-m3.6.x_build\target\invoker-reports\*.xml
[withMaven] invokerPublisher - Archive invoker results for Maven artifact MavenArtifact{org.apache.maven.plugins:maven-source-plugin:maven-plugin:3.2.2-SNAPSHOT(version: 3.2.2-SNAPSHOT, snapshot:false) } generated by PluginInvocation{org.apache.maven.plugins:maven-invoker-plugin:3.1.0@integration-test  integration-test}: windows-jdk13-m3.6.x_build\target\invoker-reports\*.xml
[withMaven] Publishers: Generated Artifacts Publisher: 890 ms, Junit Publisher: 2005 ms, Open Task Scanner Publisher: 645 ms, Invoker Publisher: 5543 ms
[withMaven] Publishers: Generated Artifacts Publisher: 813 ms, Junit Publisher: 2065 ms, Open Task Scanner Publisher: 585 ms, Invoker Publisher: 5543 ms
[Pipeline] // withMaven
[Pipeline] // withMaven
[Pipeline] cleanWs
[Pipeline] cleanWs
[WS-CLEANUP] Deleting project workspace...
[WS-CLEANUP] Deferred wipeout is used...
[WS-CLEANUP] Deleting project workspace...
[WS-CLEANUP] Deferred wipeout is used...
[WS-CLEANUP] done
[Pipeline] cleanWs
[WS-CLEANUP] done
[WS-CLEANUP] Deleting project workspace...
[WS-CLEANUP] Deferred wipeout is used...
[Pipeline] cleanWs
[WS-CLEANUP] done
[WS-CLEANUP] Deleting project workspace...
[WS-CLEANUP] Deferred wipeout is used...
[Pipeline] }
[WS-CLEANUP] done
[Pipeline] // stage
[Pipeline] }
[Pipeline] }
[Pipeline] // ws
[Pipeline] // stage
[Pipeline] }
[Pipeline] }
[Pipeline] // node
[Pipeline] // ws
[Pipeline] }
Failed in branch windows-jdk11-m3.6.x_build
[Pipeline] }
[Pipeline] // node
[Pipeline] }
Failed in branch windows-jdk13-m3.6.x_build
[Pipeline] // parallel
[Pipeline] stage
[Pipeline] { (Notifications)
[Pipeline] echo
Build result: FAILURE
[Pipeline] jiraIssueSelector
[Pipeline] echo
The authors of changes [rfscholte].
[Pipeline] echo
Sending email ...
[Pipeline] emailext
Reply | Threaded
Open this post in threaded view
|

Build succeeded in Jenkins: Maven TLP » maven-source-plugin » master #44

Apache Jenkins Server-2
See https://builds.apache.org/job/maven-box/job/maven-source-plugin/job/master/44/

Changes:

* [MSOURCES-126] delete non-reproducible generated META-INF/NOTICE

All tests passed