Build failed in Jenkins: Maven TLP » maven-site-plugin » master #74

classic Classic list List threaded Threaded
3 messages Options
Reply | Threaded
Open this post in threaded view
|

Build failed in Jenkins: Maven TLP » maven-site-plugin » master #74

Apache Jenkins Server-2
See https://builds.apache.org/job/maven-box/job/maven-site-plugin/job/master/74/

Changes:

* More verbose info about build exceptions
* Verbose info about failure - add bit more
* Revert: no access to currntBuild.rawBuild

All tests passed

Build log:
[...truncated 7441 lines...]
[TASKS] Computing warning deltas based on reference build #73
[withMaven] Publishers: Generated Artifacts Publisher: 605 ms, Junit Publisher: 256 ms, Open Task Scanner Publisher: 312 ms, Pipeline Graph Publisher: 1 ms
[Pipeline] // withMaven
[Pipeline] cleanWs
[WS-CLEANUP] Deleting project workspace...
[WS-CLEANUP] Deferred wipeout is used...
[WS-CLEANUP] done
[Pipeline] }
[Pipeline] // stage
[Pipeline] }
[Pipeline] // ws
[Pipeline] }
[Pipeline] // node
[Pipeline] }
[INFO] run post-build script verify.bsh
[INFO]           template-skin\pom.xml ............................ SUCCESS (17.6 s)
[INFO] Building: validate\pom.xml
[INFO] run post-build script verify.bsh
[INFO]           MSITE-627\pom.xml ................................ SUCCESS (18.3 s)
[INFO] Building: MSITE-644\pom.xml
[INFO]           MSITE-644\pom.xml ................................ SUCCESS (3.5 s)
[INFO] Building: MSITE-658\pom.xml
[INFO]           validate\pom.xml ................................. SUCCESS (7.7 s)
[INFO]
[INFO] --- maven-checkstyle-plugin:3.0.0:check (checkstyle-check) @ maven-site-plugin ---
[INFO] run post-build script verify.groovy
[INFO]           site-sd-top-parent-no-site\pom.xml ............... SUCCESS (13.3 s)
[INFO] Building: site-sd-top-parent-same-site\pom.xml
[INFO]
[INFO] --- maven-invoker-plugin:3.1.0:verify (integration-test) @ maven-site-plugin ---
[INFO] -------------------------------------------------
[INFO] Build Summary:
[INFO]   Passed: 55, Failed: 0, Errors: 0, Skipped: 0
[INFO] -------------------------------------------------
[INFO] ------------------------------------------------------------------------
[INFO] BUILD SUCCESS
[INFO] ------------------------------------------------------------------------
[INFO] Total time: 15:38 min
[INFO] Finished at: 2019-01-31T11:20:29+00:00
[INFO] Final Memory: 63M/1160M
[INFO] ------------------------------------------------------------------------
[INFO] [jenkins-event-spy] Generated F:\jenkins\jenkins-slave\workspace\ven-box_maven-site-plugin_master@3@2@tmp\withMaven9b48b7a0\maven-spy-20190131-110450-3626423742810020918865.log
Picked up JAVA_TOOL_OPTIONS: -Dmaven.ext.class.path="f:\jenkins\jenkins-slave\workspace\ven-box_maven-site-plugin_master@3@2@tmp\withMaven9b48b7a0\pipeline-maven-spy.jar" -Dorg.jenkinsci.plugins.pipeline.maven.reportsFolder="f:\jenkins\jenkins-slave\workspace\ven-box_maven-site-plugin_master@3@2@tmp\withMaven9b48b7a0"
[Pipeline] }
[Pipeline] // dir
[Pipeline] }
[withMaven] artifactsPublisher - Archive artifact windows-jdk8-m3.3.x_build\pom.xml under org\apache\maven\plugins\maven-site-plugin\3.8-SNAPSHOT\maven-site-plugin-3.8-SNAPSHOT.pom
[withMaven] artifactsPublisher - Archive artifact windows-jdk8-m3.3.x_build\target\maven-site-plugin-3.8-SNAPSHOT.jar under org\apache\maven\plugins\maven-site-plugin\3.8-SNAPSHOT\maven-site-plugin-3.8-SNAPSHOT.jar
[withMaven] junitPublisher - Archive test results for Maven artifact org.apache.maven.plugins:maven-site-plugin:maven-plugin:3.8-SNAPSHOT generated by maven-surefire-plugin:test (default-test): windows-jdk8-m3.3.x_build\target\surefire-reports\*.xml
Recording test results
[withMaven] openTasksPublisher - Scan Tasks for Maven artifact org.apache.maven.plugins:maven-site-plugin:maven-plugin:3.8-SNAPSHOT in source directory windows-jdk8-m3.3.x_build\src\main\java
[TASKS] Scanning folder 'f:\jenkins\jenkins-slave\workspace\ven-box_maven-site-plugin_master@3@2' for files matching the pattern 'windows-jdk8-m3.3.x_build\src\main\java\**\*' - excludes: null
[TASKS] Found 21 files to scan for tasks
[TASKS] Found 8 open tasks.
Skipping warnings blame since pipelines do not have an SCM link.%n
[TASKS] Computing warning deltas based on reference build #73
[withMaven] Publishers: Generated Artifacts Publisher: 148 ms, Junit Publisher: 156 ms, Open Task Scanner Publisher: 186 ms, Pipeline Graph Publisher: 1 ms
[Pipeline] // withMaven
[Pipeline] cleanWs
[WS-CLEANUP] Deleting project workspace...
[WS-CLEANUP] Deferred wipeout is used...
[WS-CLEANUP] done
[Pipeline] }
[Pipeline] // stage
[Pipeline] }
[Pipeline] // ws
[Pipeline] }
[Pipeline] // node
[Pipeline] }
[INFO] run post-build script verify.bsh
[INFO]           MSITE-658\pom.xml ................................ SUCCESS (7.7 s)
[INFO] Building: MSITE-665\pom.xml
[INFO] run post-build script verify.groovy
[INFO]           site-sd-top-parent-same-site\pom.xml ............. SUCCESS (11.6 s)
[INFO] Building: site-skip\pom.xml
[INFO]           MSITE-665\pom.xml ................................ SUCCESS (10.6 s)
[INFO] Building: MSITE-705-debug\pom.xml
[INFO] run post-build script verify.groovy
[INFO]           MSITE-705-debug\pom.xml .......................... SUCCESS (5.6 s)
[INFO] Building: MSITE-705-no-debug\pom.xml
[INFO] run post-build script verify.bsh
[INFO]           site-skip\pom.xml ................................ SUCCESS (11.9 s)
[INFO] Building: surefire-report\pom.xml
[INFO] run post-build script verify.groovy
[INFO]           MSITE-705-no-debug\pom.xml ....................... SUCCESS (5.2 s)
[INFO] Building: MSITE-723\pom.xml
[INFO] run post-build script verify.groovy
[INFO]           MSITE-723\pom.xml ................................ SUCCESS (6.8 s)
[INFO] Building: new-configuration\pom.xml
[INFO] run post-build script verify.groovy
[INFO]           surefire-report\pom.xml .......................... SUCCESS (13.5 s)
[INFO] Building: template-skin\pom.xml
[INFO] run post-build script verify.groovy
[INFO]           new-configuration\pom.xml ........................ SUCCESS (5.4 s)
[INFO] Building: no-version\pom.xml
[INFO] run post-build script verify.groovy
[INFO]           no-version\pom.xml ............................... SUCCESS (6.3 s)
[INFO] Building: report-changes-generation\pom.xml
[INFO] run post-build script verify.bsh
[INFO]           template-skin\pom.xml ............................ SUCCESS (16.4 s)
[INFO] Building: validate\pom.xml
[INFO] run post-build script verify.bsh
[INFO]           report-changes-generation\pom.xml ................ SUCCESS (6.8 s)
[INFO] Building: reportConfig\pom.xml
[INFO] run post-build script verify.groovy
[INFO]           reportConfig\pom.xml ............................. SUCCESS (4.8 s)
[INFO] Building: resources\pom.xml
[INFO]           validate\pom.xml ................................. SUCCESS (8.2 s)
[INFO]
[INFO] --- maven-checkstyle-plugin:3.0.0:check (checkstyle-check) @ maven-site-plugin ---
[INFO] run post-build script verify.groovy
[INFO]           resources\pom.xml ................................ SUCCESS (3.6 s)
[INFO] Building: site-attach-descriptor\pom.xml
[INFO]
[INFO] --- maven-invoker-plugin:3.1.0:verify (integration-test) @ maven-site-plugin ---
[INFO] -------------------------------------------------
[INFO] Build Summary:
[INFO]   Passed: 55, Failed: 0, Errors: 0, Skipped: 0
[INFO] -------------------------------------------------
[INFO] ------------------------------------------------------------------------
[INFO] BUILD SUCCESS
[INFO] ------------------------------------------------------------------------
[INFO] Total time: 16:31 min
[INFO] Finished at: 2019-01-31T03:21:31-08:00
[INFO] Final Memory: 63M/1004M
[INFO] ------------------------------------------------------------------------
[INFO] [jenkins-event-spy] Generated F:\jenkins\jenkins-slave\workspace\ven-box_maven-site-plugin_master@2@tmp\withMavenc04cdd21\maven-spy-20190131-030459-522352444398307909782.log
Picked up JAVA_TOOL_OPTIONS: -Dmaven.ext.class.path="f:\jenkins\jenkins-slave\workspace\ven-box_maven-site-plugin_master@2@tmp\withMavenc04cdd21\pipeline-maven-spy.jar" -Dorg.jenkinsci.plugins.pipeline.maven.reportsFolder="f:\jenkins\jenkins-slave\workspace\ven-box_maven-site-plugin_master@2@tmp\withMavenc04cdd21"
[Pipeline] }
[INFO] run post-build script verify.bsh
[INFO]           site-attach-descriptor\pom.xml ................... SUCCESS (4.1 s)
[INFO] Building: site-deploy\pom.xml
[Pipeline] // dir
[Pipeline] }
[withMaven] artifactsPublisher - Archive artifact windows-jdk8-m3.5.x_build\pom.xml under org\apache\maven\plugins\maven-site-plugin\3.8-SNAPSHOT\maven-site-plugin-3.8-SNAPSHOT.pom
[withMaven] artifactsPublisher - Archive artifact windows-jdk8-m3.5.x_build\target\maven-site-plugin-3.8-SNAPSHOT.jar under org\apache\maven\plugins\maven-site-plugin\3.8-SNAPSHOT\maven-site-plugin-3.8-SNAPSHOT.jar
[withMaven] junitPublisher - Archive test results for Maven artifact org.apache.maven.plugins:maven-site-plugin:maven-plugin:3.8-SNAPSHOT generated by maven-surefire-plugin:test (default-test): windows-jdk8-m3.5.x_build\target\surefire-reports\*.xml
Recording test results
[withMaven] openTasksPublisher - Scan Tasks for Maven artifact org.apache.maven.plugins:maven-site-plugin:maven-plugin:3.8-SNAPSHOT in source directory windows-jdk8-m3.5.x_build\src\main\java
[TASKS] Scanning folder 'f:\jenkins\jenkins-slave\workspace\ven-box_maven-site-plugin_master@2' for files matching the pattern 'windows-jdk8-m3.5.x_build\src\main\java\**\*' - excludes: null
[TASKS] Found 21 files to scan for tasks
[TASKS] Found 8 open tasks.
Skipping warnings blame since pipelines do not have an SCM link.%n
[TASKS] Computing warning deltas based on reference build #73
[withMaven] Publishers: Generated Artifacts Publisher: 154 ms, Junit Publisher: 174 ms, Open Task Scanner Publisher: 259 ms, Dependencies Fingerprint Publisher: 1 ms, Pipeline Graph Publisher: 1 ms
[Pipeline] // withMaven
[Pipeline] cleanWs
[WS-CLEANUP] Deleting project workspace...
[WS-CLEANUP] Deferred wipeout is used...
[WS-CLEANUP] done
[Pipeline] }
[Pipeline] // stage
[Pipeline] }
[Pipeline] // ws
[Pipeline] }
[Pipeline] // node
[Pipeline] }
[INFO] run post-build script verify.bsh
[INFO]           site-deploy\pom.xml .............................. SUCCESS (4.0 s)
[INFO] Building: site-inheritance\pom.xml
[INFO] run post-build script verify.bsh
[INFO]           site-inheritance\pom.xml ......................... SUCCESS (8.1 s)
[INFO] Building: site-jar\pom.xml
[INFO] run post-build script verify.bsh
[INFO]           site-jar\pom.xml ................................. SUCCESS (4.5 s)
[INFO] Building: site-sd\pom.xml
[INFO] run post-build script verify.groovy
[INFO]           site-sd\pom.xml .................................. SUCCESS (6.0 s)
[INFO] Building: site-sd-2\pom.xml
[INFO] run post-build script verify.groovy
[INFO]           site-sd-2\pom.xml ................................ SUCCESS (10.6 s)
[INFO] Building: site-sd-lang\pom.xml
[INFO] run post-build script verify.bsh
[INFO]           site-sd-lang\pom.xml ............................. SUCCESS (7.9 s)
[INFO] Building: site-sd-stagingSiteURL\pom.xml
[INFO] run post-build script verify.groovy
[INFO]           site-sd-stagingSiteURL\pom.xml ................... SUCCESS (5.2 s)
[INFO] Building: site-sd-submodule\pom.xml
[INFO] run post-build script verify.groovy
[INFO]           site-sd-submodule\pom.xml ........................ SUCCESS (6.7 s)
[INFO] Building: site-sd-top-parent-different-site\pom.xml
[INFO] run post-build script verify.groovy
[INFO]           site-sd-top-parent-different-site\pom.xml ........ SUCCESS (6.3 s)
[INFO] Building: site-sd-top-parent-no-site\pom.xml
[INFO] run post-build script verify.groovy
[INFO]           site-sd-top-parent-no-site\pom.xml ............... SUCCESS (7.0 s)
[INFO] Building: site-sd-top-parent-same-site\pom.xml
[INFO] run post-build script verify.groovy
[INFO]           site-sd-top-parent-same-site\pom.xml ............. SUCCESS (5.7 s)
[INFO] Building: site-skip\pom.xml
[INFO] run post-build script verify.bsh
[INFO]           site-skip\pom.xml ................................ SUCCESS (6.1 s)
[INFO] Building: surefire-report\pom.xml
[INFO] run post-build script verify.groovy
[INFO]           surefire-report\pom.xml .......................... SUCCESS (7.0 s)
[INFO] Building: template-skin\pom.xml
[INFO] run post-build script verify.bsh
[INFO]           template-skin\pom.xml ............................ SUCCESS (7.6 s)
[INFO] Building: validate\pom.xml
[INFO]           validate\pom.xml ................................. SUCCESS (4.5 s)
[INFO]
[INFO] --- maven-checkstyle-plugin:3.0.0:check (checkstyle-check) @ maven-site-plugin ---
[INFO]
[INFO] --- maven-invoker-plugin:3.1.0:verify (integration-test) @ maven-site-plugin ---
[INFO] -------------------------------------------------
[INFO] Build Summary:
[INFO]   Passed: 55, Failed: 0, Errors: 0, Skipped: 0
[INFO] -------------------------------------------------
[INFO] ------------------------------------------------------------------------
[INFO] BUILD SUCCESS
[INFO] ------------------------------------------------------------------------
[INFO] Total time: 08:40 min
[INFO] Finished at: 2019-01-31T11:23:10Z
[INFO] Final Memory: 49M/174M
[INFO] ------------------------------------------------------------------------
[INFO] [jenkins-event-spy] Generated F:\jenkins\jenkins-slave\workspace\ven-box_maven-site-plugin_master@2@tmp\withMaven2cb6d69e\maven-spy-20190131-111429-24412182785212409273312.log
[Pipeline] }
[Pipeline] // dir
[Pipeline] }
[withMaven] artifactsPublisher - Archive artifact windows-jdk11-m3.5.x_build\pom.xml under org\apache\maven\plugins\maven-site-plugin\3.8-SNAPSHOT\maven-site-plugin-3.8-SNAPSHOT.pom
[withMaven] artifactsPublisher - Archive artifact windows-jdk11-m3.5.x_build\target\maven-site-plugin-3.8-SNAPSHOT.jar under org\apache\maven\plugins\maven-site-plugin\3.8-SNAPSHOT\maven-site-plugin-3.8-SNAPSHOT.jar
[withMaven] junitPublisher - Archive test results for Maven artifact org.apache.maven.plugins:maven-site-plugin:maven-plugin:3.8-SNAPSHOT generated by maven-surefire-plugin:test (default-test): windows-jdk11-m3.5.x_build\target\surefire-reports\*.xml
Recording test results
[withMaven] openTasksPublisher - Scan Tasks for Maven artifact org.apache.maven.plugins:maven-site-plugin:maven-plugin:3.8-SNAPSHOT in source directory windows-jdk11-m3.5.x_build\src\main\java
[TASKS] Scanning folder 'f:\jenkins\jenkins-slave\workspace\ven-box_maven-site-plugin_master@2' for files matching the pattern 'windows-jdk11-m3.5.x_build\src\main\java\**\*' - excludes: null
[TASKS] Found 21 files to scan for tasks
[TASKS] Found 8 open tasks.
Skipping warnings blame since pipelines do not have an SCM link.%n
[TASKS] Computing warning deltas based on reference build #73
[withMaven] Publishers: Generated Artifacts Publisher: 661 ms, Junit Publisher: 1200 ms, Open Task Scanner Publisher: 867 ms, Dependencies Fingerprint Publisher: 1 ms, Pipeline Graph Publisher: 83 ms
[Pipeline] // withMaven
[Pipeline] cleanWs
[WS-CLEANUP] Deleting project workspace...
[WS-CLEANUP] Deferred wipeout is used...
[WS-CLEANUP] done
[Pipeline] }
[Pipeline] // stage
[Pipeline] }
[Pipeline] // ws
[Pipeline] }
[Pipeline] // node
[Pipeline] }
[Pipeline] // parallel
[Pipeline] stage
[Pipeline] { (Notifications)
[Pipeline] echo
Build result: FAILURE
[Pipeline] jiraIssueSelector
[Pipeline] emailext
Reply | Threaded
Open this post in threaded view
|

Build failed in Jenkins: Maven TLP » maven-site-plugin » master #75

Apache Jenkins Server-2
See https://builds.apache.org/job/maven-box/job/maven-site-plugin/job/master/75/

Changes:

* JDK 12 is now in the Release Candidate Phase
* [INFRA-17514] Jenkins invoker-plugin updated by INFRA

All tests passed

Build log:
[...truncated 7071 lines...]
[INFO] Building: site-inheritance\pom.xml
[INFO] run post-build script verify.bsh
[INFO]           template-skin\pom.xml ............................ SUCCESS (14.2 s)
[INFO] Building: validate\pom.xml
[INFO] run post-build script verify.bsh
[INFO]           template-skin\pom.xml ............................ SUCCESS (15.2 s)
[INFO] Building: validate\pom.xml
[INFO]           validate\pom.xml ................................. SUCCESS (7.3 s)
[INFO]
[INFO] --- maven-checkstyle-plugin:3.0.0:check (checkstyle-check) @ maven-site-plugin ---
[INFO] run post-build script verify.groovy
[INFO]           site-sd-2\pom.xml ................................ SUCCESS (15.4 s)
[INFO] Building: site-sd-lang\pom.xml
[INFO]
[INFO] --- maven-invoker-plugin:3.1.0:verify (integration-test) @ maven-site-plugin ---
[INFO] -------------------------------------------------
[INFO] Build Summary:
[INFO]   Passed: 55, Failed: 0, Errors: 0, Skipped: 0
[INFO] -------------------------------------------------
[INFO] ------------------------------------------------------------------------
[INFO] BUILD SUCCESS
[INFO] ------------------------------------------------------------------------
[INFO] Total time: 14:03 min
[INFO] Finished at: 2019-02-11T23:13:36-08:00
[INFO] Final Memory: 65M/1165M
[INFO] ------------------------------------------------------------------------
[INFO] [jenkins-event-spy] Generated F:\jenkins\jenkins-slave\workspace\ven-box_maven-site-plugin_master@2@tmp\withMaven82591bdd\maven-spy-20190211-225932-1613895436265631689120.log
Picked up JAVA_TOOL_OPTIONS: -Dmaven.ext.class.path="f:\jenkins\jenkins-slave\workspace\ven-box_maven-site-plugin_master@2@tmp\withMaven82591bdd\pipeline-maven-spy.jar" -Dorg.jenkinsci.plugins.pipeline.maven.reportsFolder="f:\jenkins\jenkins-slave\workspace\ven-box_maven-site-plugin_master@2@tmp\withMaven82591bdd"
[Pipeline] }
[Pipeline] // dir
[Pipeline] }
[withMaven] artifactsPublisher - Archive artifact windows-jdk8-m3.5.x_build\pom.xml under org\apache\maven\plugins\maven-site-plugin\3.8-SNAPSHOT\maven-site-plugin-3.8-SNAPSHOT.pom
[INFO]           validate\pom.xml ................................. SUCCESS (8.0 s)
[INFO]
[withMaven] artifactsPublisher - Archive artifact windows-jdk8-m3.5.x_build\target\maven-site-plugin-3.8-SNAPSHOT.jar under org\apache\maven\plugins\maven-site-plugin\3.8-SNAPSHOT\maven-site-plugin-3.8-SNAPSHOT.jar[INFO] --- maven-checkstyle-plugin:3.0.0:check (checkstyle-check) @ maven-site-plugin ---

[withMaven] junitPublisher - Archive test results for Maven artifact org.apache.maven.plugins:maven-site-plugin:maven-plugin:3.8-SNAPSHOT generated by maven-surefire-plugin:test (default-test): windows-jdk8-m3.5.x_build\target\surefire-reports\*.xml
Recording test results
[withMaven] openTasksPublisher - Scan Tasks for Maven artifact org.apache.maven.plugins:maven-site-plugin:maven-plugin:3.8-SNAPSHOT in source directory windows-jdk8-m3.5.x_build\src\main\java
[TASKS] Scanning folder 'f:\jenkins\jenkins-slave\workspace\ven-box_maven-site-plugin_master@2' for files matching the pattern 'windows-jdk8-m3.5.x_build\src\main\java\**\*' - excludes: null
[TASKS] Found 21 files to scan for tasks
[TASKS] Found 8 open tasks.
Skipping warnings blame since pipelines do not have an SCM link.%n
[TASKS] Computing warning deltas based on reference build #73
[withMaven] invokerPublisher - Archive invoker results for Maven artifact MavenArtifact{org.apache.maven.plugins:maven-site-plugin:maven-plugin:3.8-SNAPSHOT(version: 3.8-SNAPSHOT, snapshot:false) } generated by PluginInvocation{org.apache.maven.plugins:maven-invoker-plugin:3.1.0@integration-test  integration-test}: windows-jdk8-m3.5.x_build\target\invoker-reports\*.xml
[INFO]
[INFO] --- maven-invoker-plugin:3.1.0:verify (integration-test) @ maven-site-plugin ---
[INFO] -------------------------------------------------
[INFO] Build Summary:
[INFO]   Passed: 55, Failed: 0, Errors: 0, Skipped: 0
[INFO] -------------------------------------------------
[INFO] ------------------------------------------------------------------------
[INFO] BUILD SUCCESS
[INFO] ------------------------------------------------------------------------
[INFO] Total time: 14:13 min
[INFO] Finished at: 2019-02-12T07:13:39Z
[INFO] Final Memory: 49M/170M
[INFO] ------------------------------------------------------------------------
[INFO] [jenkins-event-spy] Generated F:\jenkins\jenkins-slave\workspace\ven-box_maven-site-plugin_master@2@tmp\withMaven50a14639\maven-spy-20190212-065925-83512244452604526646865.log
[Pipeline] }
[Pipeline] // dir
[Pipeline] }
[withMaven] artifactsPublisher - Archive artifact windows-jdk11-m3.5.x_build\pom.xml under org\apache\maven\plugins\maven-site-plugin\3.8-SNAPSHOT\maven-site-plugin-3.8-SNAPSHOT.pom
[withMaven] artifactsPublisher - Archive artifact windows-jdk11-m3.5.x_build\target\maven-site-plugin-3.8-SNAPSHOT.jar under org\apache\maven\plugins\maven-site-plugin\3.8-SNAPSHOT\maven-site-plugin-3.8-SNAPSHOT.jar
[withMaven] junitPublisher - Archive test results for Maven artifact org.apache.maven.plugins:maven-site-plugin:maven-plugin:3.8-SNAPSHOT generated by maven-surefire-plugin:test (default-test): windows-jdk11-m3.5.x_build\target\surefire-reports\*.xml
Recording test results
[withMaven] openTasksPublisher - Scan Tasks for Maven artifact org.apache.maven.plugins:maven-site-plugin:maven-plugin:3.8-SNAPSHOT in source directory windows-jdk11-m3.5.x_build\src\main\java
[TASKS] Scanning folder 'f:\jenkins\jenkins-slave\workspace\ven-box_maven-site-plugin_master@2' for files matching the pattern 'windows-jdk11-m3.5.x_build\src\main\java\**\*' - excludes: null
[TASKS] Found 21 files to scan for tasks
[TASKS] Found 8 open tasks.
Skipping warnings blame since pipelines do not have an SCM link.%n
[TASKS] Computing warning deltas based on reference build #73
[withMaven] invokerPublisher - Archive invoker results for Maven artifact MavenArtifact{org.apache.maven.plugins:maven-site-plugin:maven-plugin:3.8-SNAPSHOT(version: 3.8-SNAPSHOT, snapshot:false) } generated by PluginInvocation{org.apache.maven.plugins:maven-invoker-plugin:3.1.0@integration-test  integration-test}: windows-jdk11-m3.5.x_build\target\invoker-reports\*.xml
[INFO] run post-build script verify.bsh
[INFO]           site-inheritance\pom.xml ......................... SUCCESS (16.2 s)
[INFO] Building: site-jar\pom.xml
[INFO] run post-build script verify.bsh
[INFO]           site-jar\pom.xml ................................. SUCCESS (9.6 s)
[INFO] Building: site-sd\pom.xml
[INFO] run post-build script verify.bsh
[INFO]           site-sd-lang\pom.xml ............................. SUCCESS (13.6 s)
[INFO] Building: site-sd-stagingSiteURL\pom.xml
[INFO] run post-build script verify.groovy
[INFO]           site-sd-stagingSiteURL\pom.xml ................... SUCCESS (7.7 s)
[INFO] Building: site-sd-submodule\pom.xml
[INFO] run post-build script verify.groovy
[INFO]           site-sd\pom.xml .................................. SUCCESS (13.6 s)
[INFO] Building: site-sd-2\pom.xml
[INFO] run post-build script verify.groovy
[INFO]           site-sd-submodule\pom.xml ........................ SUCCESS (12.1 s)
[INFO] Building: site-sd-top-parent-different-site\pom.xml
[withMaven] Publishers: Generated Artifacts Publisher: 233 ms, Junit Publisher: 236 ms, Open Task Scanner Publisher: 297 ms, Invoker Publisher: 36831 ms, Pipeline Graph Publisher: 3 ms
[Pipeline] // withMaven
[Pipeline] cleanWs
[WS-CLEANUP] Deleting project workspace...
[WS-CLEANUP] Deferred wipeout is used...
[WS-CLEANUP] done
[Pipeline] }
[Pipeline] // stage
[Pipeline] }
[Pipeline] // ws
[Pipeline] }
[Pipeline] // node
[Pipeline] }
[withMaven] Publishers: Generated Artifacts Publisher: 177 ms, Junit Publisher: 171 ms, Open Task Scanner Publisher: 228 ms, Invoker Publisher: 38019 ms, Pipeline Graph Publisher: 1 ms
[Pipeline] // withMaven
[Pipeline] cleanWs
[WS-CLEANUP] Deleting project workspace...
[WS-CLEANUP] Deferred wipeout is used...
[WS-CLEANUP] done
[Pipeline] }
[Pipeline] // stage
[Pipeline] }
[Pipeline] // ws
[Pipeline] }
[Pipeline] // node
[Pipeline] }
[INFO] run post-build script verify.groovy
[INFO]           site-sd-top-parent-different-site\pom.xml ........ SUCCESS (10.6 s)
[INFO] Building: site-sd-top-parent-no-site\pom.xml
[INFO] run post-build script verify.groovy
[INFO]           site-sd-2\pom.xml ................................ SUCCESS (17.5 s)
[INFO] Building: site-sd-lang\pom.xml
[INFO] run post-build script verify.groovy
[INFO]           site-sd-top-parent-no-site\pom.xml ............... SUCCESS (13.1 s)
[INFO] Building: site-sd-top-parent-same-site\pom.xml
[INFO] run post-build script verify.bsh
[INFO]           site-sd-lang\pom.xml ............................. SUCCESS (15.3 s)
[INFO] Building: site-sd-stagingSiteURL\pom.xml
[INFO] run post-build script verify.groovy
[INFO]           site-sd-top-parent-same-site\pom.xml ............. SUCCESS (11.2 s)
[INFO] Building: site-skip\pom.xml
[INFO] run post-build script verify.groovy
[INFO]           site-sd-stagingSiteURL\pom.xml ................... SUCCESS (10.0 s)
[INFO] Building: site-sd-submodule\pom.xml
[INFO] run post-build script verify.bsh
[INFO]           site-skip\pom.xml ................................ SUCCESS (11.2 s)
[INFO] Building: surefire-report\pom.xml
[INFO] run post-build script verify.groovy
[INFO]           site-sd-submodule\pom.xml ........................ SUCCESS (13.2 s)
[INFO] Building: site-sd-top-parent-different-site\pom.xml
[INFO] run post-build script verify.groovy
[INFO]           surefire-report\pom.xml .......................... SUCCESS (12.6 s)
[INFO] Building: template-skin\pom.xml
[INFO] run post-build script verify.groovy
[INFO]           site-sd-top-parent-different-site\pom.xml ........ SUCCESS (11.2 s)
[INFO] Building: site-sd-top-parent-no-site\pom.xml
[INFO] run post-build script verify.bsh
[INFO]           template-skin\pom.xml ............................ SUCCESS (15.9 s)
[INFO] Building: validate\pom.xml
[INFO] run post-build script verify.groovy
[INFO]           site-sd-top-parent-no-site\pom.xml ............... SUCCESS (14.6 s)
[INFO] Building: site-sd-top-parent-same-site\pom.xml
[INFO]           validate\pom.xml ................................. SUCCESS (8.5 s)
[INFO]
[INFO] --- maven-checkstyle-plugin:3.0.0:check (checkstyle-check) @ maven-site-plugin ---
[INFO]
[INFO] --- maven-invoker-plugin:3.1.0:verify (integration-test) @ maven-site-plugin ---
[INFO] -------------------------------------------------
[INFO] Build Summary:
[INFO]   Passed: 55, Failed: 0, Errors: 0, Skipped: 0
[INFO] -------------------------------------------------
[INFO] ------------------------------------------------------------------------
[INFO] BUILD SUCCESS
[INFO] ------------------------------------------------------------------------
[INFO] Total time: 16:04.407s
[INFO] Finished at: Mon Feb 11 23:15:38 PST 2019
[INFO] Final Memory: 56M/890M
[INFO] ------------------------------------------------------------------------
Picked up JAVA_TOOL_OPTIONS: -Dmaven.ext.class.path="f:\jenkins\jenkins-slave\workspace\ven-box_maven-site-plugin_master@3@tmp\withMaven6f226fd5\pipeline-maven-spy.jar" -Dorg.jenkinsci.plugins.pipeline.maven.reportsFolder="f:\jenkins\jenkins-slave\workspace\ven-box_maven-site-plugin_master@3@tmp\withMaven6f226fd5"
[Pipeline] }
[Pipeline] // dir
[Pipeline] }
[Pipeline] // withMaven
[Pipeline] cleanWs
[WS-CLEANUP] Deleting project workspace...
[WS-CLEANUP] Deferred wipeout is used...
[WS-CLEANUP] done
[Pipeline] }
[Pipeline] // stage
[Pipeline] }
[Pipeline] // ws
[Pipeline] }
[Pipeline] // node
[Pipeline] }
[INFO] run post-build script verify.groovy
[INFO]           site-sd-top-parent-same-site\pom.xml ............. SUCCESS (13.2 s)
[INFO] Building: site-skip\pom.xml
[INFO] run post-build script verify.bsh
[INFO]           site-skip\pom.xml ................................ SUCCESS (10.9 s)
[INFO] Building: surefire-report\pom.xml
[INFO] run post-build script verify.groovy
[INFO]           surefire-report\pom.xml .......................... SUCCESS (11.2 s)
[INFO] Building: template-skin\pom.xml
[INFO] run post-build script verify.bsh
[INFO]           template-skin\pom.xml ............................ SUCCESS (13.3 s)
[INFO] Building: validate\pom.xml
[INFO]           validate\pom.xml ................................. SUCCESS (6.2 s)
[INFO]
[INFO] --- maven-checkstyle-plugin:3.0.0:check (checkstyle-check) @ maven-site-plugin ---
[INFO]
[INFO] --- maven-invoker-plugin:3.1.0:verify (integration-test) @ maven-site-plugin ---
[INFO] -------------------------------------------------
[INFO] Build Summary:
[INFO]   Passed: 55, Failed: 0, Errors: 0, Skipped: 0
[INFO] -------------------------------------------------
[INFO] ------------------------------------------------------------------------
[INFO] BUILD SUCCESS
[INFO] ------------------------------------------------------------------------
[INFO] Total time: 16:46 min
[INFO] Finished at: 2019-02-11T23:16:23-08:00
[INFO] Final Memory: 64M/1150M
[INFO] ------------------------------------------------------------------------
[INFO] [jenkins-event-spy] Generated F:\jenkins\jenkins-slave\workspace\ven-box_maven-site-plugin_master@2@2@tmp\withMaven2f24ca24\maven-spy-20190211-225935-7031410061215512425117.log
Picked up JAVA_TOOL_OPTIONS: -Dmaven.ext.class.path="f:\jenkins\jenkins-slave\workspace\ven-box_maven-site-plugin_master@2@2@tmp\withMaven2f24ca24\pipeline-maven-spy.jar" -Dorg.jenkinsci.plugins.pipeline.maven.reportsFolder="f:\jenkins\jenkins-slave\workspace\ven-box_maven-site-plugin_master@2@2@tmp\withMaven2f24ca24"
[Pipeline] }
[Pipeline] // dir
[Pipeline] }
[withMaven] artifactsPublisher - Archive artifact windows-jdk8-m3.2.x_build\pom.xml under org\apache\maven\plugins\maven-site-plugin\3.8-SNAPSHOT\maven-site-plugin-3.8-SNAPSHOT.pom
[withMaven] artifactsPublisher - Archive artifact windows-jdk8-m3.2.x_build\target\maven-site-plugin-3.8-SNAPSHOT.jar under org\apache\maven\plugins\maven-site-plugin\3.8-SNAPSHOT\maven-site-plugin-3.8-SNAPSHOT.jar
[withMaven] junitPublisher - Archive test results for Maven artifact org.apache.maven.plugins:maven-site-plugin:maven-plugin:3.8-SNAPSHOT generated by maven-surefire-plugin:test (default-test): windows-jdk8-m3.2.x_build\target\surefire-reports\*.xml
Recording test results
[withMaven] openTasksPublisher - Scan Tasks for Maven artifact org.apache.maven.plugins:maven-site-plugin:maven-plugin:3.8-SNAPSHOT in source directory windows-jdk8-m3.2.x_build\src\main\java
[TASKS] Scanning folder 'f:\jenkins\jenkins-slave\workspace\ven-box_maven-site-plugin_master@2@2' for files matching the pattern 'windows-jdk8-m3.2.x_build\src\main\java\**\*' - excludes: null
[TASKS] Found 21 files to scan for tasks
[TASKS] Found 8 open tasks.
Skipping warnings blame since pipelines do not have an SCM link.%n
[TASKS] Computing warning deltas based on reference build #73
[withMaven] invokerPublisher - Archive invoker results for Maven artifact MavenArtifact{org.apache.maven.plugins:maven-site-plugin:maven-plugin:3.8-SNAPSHOT(version: 3.8-SNAPSHOT, snapshot:false) } generated by PluginInvocation{org.apache.maven.plugins:maven-invoker-plugin:3.1.0@integration-test  integration-test}: windows-jdk8-m3.2.x_build\target\invoker-reports\*.xml
[withMaven] Publishers: Generated Artifacts Publisher: 163 ms, Junit Publisher: 208 ms, Open Task Scanner Publisher: 222 ms, Dependencies Fingerprint Publisher: 1 ms, Invoker Publisher: 36874 ms, Pipeline Graph Publisher: 2 ms
[Pipeline] // withMaven
[Pipeline] cleanWs
[WS-CLEANUP] Deleting project workspace...
[WS-CLEANUP] Deferred wipeout is used...
[WS-CLEANUP] done
[Pipeline] }
[Pipeline] // stage
[Pipeline] }
[Pipeline] // ws
[Pipeline] }
[Pipeline] // node
[Pipeline] }
[Pipeline] // parallel
[Pipeline] stage
[Pipeline] { (Notifications)
[Pipeline] echo
Build result: FAILURE
[Pipeline] jiraIssueSelector
[Pipeline] emailext
Reply | Threaded
Open this post in threaded view
|

Build failed in Jenkins: Maven TLP » maven-site-plugin » master #76

Apache Jenkins Server-2
See https://builds.apache.org/job/maven-box/job/maven-site-plugin/job/master/76/

No changes.

All tests passed

Build log:
[...truncated 7208 lines...]
[Pipeline] // dir
[Pipeline] }
[withMaven] artifactsPublisher - Archive artifact windows-jdk8-m3.2.x_build\pom.xml under org\apache\maven\plugins\maven-site-plugin\3.8-SNAPSHOT\maven-site-plugin-3.8-SNAPSHOT.pom
[withMaven] artifactsPublisher - Archive artifact windows-jdk8-m3.2.x_build\target\maven-site-plugin-3.8-SNAPSHOT.jar under org\apache\maven\plugins\maven-site-plugin\3.8-SNAPSHOT\maven-site-plugin-3.8-SNAPSHOT.jar
[withMaven] junitPublisher - Archive test results for Maven artifact org.apache.maven.plugins:maven-site-plugin:maven-plugin:3.8-SNAPSHOT generated by maven-surefire-plugin:test (default-test): windows-jdk8-m3.2.x_build\target\surefire-reports\*.xml
Recording test results
[withMaven] openTasksPublisher - Scan Tasks for Maven artifact org.apache.maven.plugins:maven-site-plugin:maven-plugin:3.8-SNAPSHOT in source directory windows-jdk8-m3.2.x_build\src\main\java
[TASKS] Scanning folder 'f:\jenkins\jenkins-slave\workspace\ven-box_maven-site-plugin_master@2' for files matching the pattern 'windows-jdk8-m3.2.x_build\src\main\java\**\*' - excludes: null
[TASKS] Found 21 files to scan for tasks
[TASKS] Found 8 open tasks.
Skipping warnings blame since pipelines do not have an SCM link.%n
[TASKS] Computing warning deltas based on reference build #73
[withMaven] invokerPublisher - Archive invoker results for Maven artifact MavenArtifact{org.apache.maven.plugins:maven-site-plugin:maven-plugin:3.8-SNAPSHOT(version: 3.8-SNAPSHOT, snapshot:false) } generated by PluginInvocation{org.apache.maven.plugins:maven-invoker-plugin:3.1.0@integration-test  integration-test}: windows-jdk8-m3.2.x_build\target\invoker-reports\*.xml
[INFO] run post-build script verify.groovy
[INFO]           site-sd-top-parent-different-site\pom.xml ........ SUCCESS (10.2 s)
[INFO] Building: site-sd-top-parent-no-site\pom.xml
[INFO] run post-build script verify.groovy
[INFO]           site-sd\pom.xml .................................. SUCCESS (14.5 s)
[INFO] Building: site-sd-2\pom.xml
[INFO] run post-build script verify.groovy
[INFO]           site-sd-top-parent-no-site\pom.xml ............... SUCCESS (12.3 s)
[INFO] Building: site-sd-top-parent-same-site\pom.xml
[INFO] run post-build script verify.groovy
[INFO]           site-sd-2\pom.xml ................................ SUCCESS (18.8 s)
[INFO] Building: site-sd-lang\pom.xml
[withMaven] Publishers: Generated Artifacts Publisher: 286 ms, Junit Publisher: 331 ms, Open Task Scanner Publisher: 255 ms, Invoker Publisher: 29355 ms, Pipeline Graph Publisher: 1 ms
[Pipeline] // withMaven
[Pipeline] cleanWs
[WS-CLEANUP] Deleting project workspace...
[WS-CLEANUP] Deferred wipeout is used...
[WS-CLEANUP] done
[Pipeline] }
[Pipeline] // stage
[Pipeline] }
[Pipeline] // ws
[Pipeline] }
[Pipeline] // node
[Pipeline] }
[INFO] run post-build script verify.groovy
[INFO]           site-sd-top-parent-same-site\pom.xml ............. SUCCESS (11.8 s)
[INFO] Building: site-skip\pom.xml
[INFO] run post-build script verify.groovy
[INFO]           site-sd-2\pom.xml ................................ SUCCESS (22.3 s)
[INFO] Building: site-sd-lang\pom.xml
[INFO] run post-build script verify.bsh
[INFO]           site-sd-lang\pom.xml ............................. SUCCESS (18.5 s)
[INFO] Building: site-sd-stagingSiteURL\pom.xml
[withMaven] Publishers: Generated Artifacts Publisher: 233 ms, Junit Publisher: 170 ms, Open Task Scanner Publisher: 195 ms, Invoker Publisher: 33106 ms, Pipeline Graph Publisher: 1 ms
[Pipeline] // withMaven
[Pipeline] cleanWs
[WS-CLEANUP] Deleting project workspace...
[WS-CLEANUP] Deferred wipeout is used...
[WS-CLEANUP] done
[Pipeline] }
[Pipeline] // stage
[Pipeline] }
[Pipeline] // ws
[Pipeline] }
[Pipeline] // node
[Pipeline] }
[INFO] run post-build script verify.bsh
[INFO]           site-skip\pom.xml ................................ SUCCESS (11.9 s)
[INFO] Building: surefire-report\pom.xml
[INFO] run post-build script verify.groovy
[INFO]           site-sd-stagingSiteURL\pom.xml ................... SUCCESS (11.8 s)
[INFO] Building: site-sd-submodule\pom.xml
[INFO] run post-build script verify.bsh
[INFO]           site-sd-lang\pom.xml ............................. SUCCESS (17.8 s)
[INFO] Building: site-sd-stagingSiteURL\pom.xml
[INFO] run post-build script verify.groovy
[INFO]           surefire-report\pom.xml .......................... SUCCESS (13.0 s)
[INFO] Building: template-skin\pom.xml
[INFO] run post-build script verify.groovy
[INFO]           site-sd-stagingSiteURL\pom.xml ................... SUCCESS (11.1 s)
[INFO] Building: site-sd-submodule\pom.xml
[INFO] run post-build script verify.groovy
[INFO]           site-sd-submodule\pom.xml ........................ SUCCESS (14.9 s)
[INFO] Building: site-sd-top-parent-different-site\pom.xml
[INFO] run post-build script verify.bsh
[INFO]           template-skin\pom.xml ............................ SUCCESS (15.0 s)
[INFO] Building: validate\pom.xml
[INFO] run post-build script verify.groovy
[INFO]           site-sd-top-parent-different-site\pom.xml ........ SUCCESS (13.4 s)
[INFO] Building: site-sd-top-parent-no-site\pom.xml
[INFO] run post-build script verify.groovy
[INFO]           site-sd-submodule\pom.xml ........................ SUCCESS (14.8 s)
[INFO] Building: site-sd-top-parent-different-site\pom.xml
[INFO]           validate\pom.xml ................................. SUCCESS (7.7 s)
[INFO]
[INFO] --- maven-checkstyle-plugin:3.0.0:check (checkstyle-check) @ maven-site-plugin ---
[INFO]
[INFO] --- maven-invoker-plugin:3.1.0:verify (integration-test) @ maven-site-plugin ---
[INFO] -------------------------------------------------
[INFO] Build Summary:
[INFO]   Passed: 55, Failed: 0, Errors: 0, Skipped: 0
[INFO] -------------------------------------------------
[INFO] ------------------------------------------------------------------------
[INFO] BUILD SUCCESS
[INFO] ------------------------------------------------------------------------
[INFO] Total time: 14:43.253s
[INFO] Finished at: Wed Feb 13 03:19:10 PST 2019
[INFO] Final Memory: 64M/958M
[INFO] ------------------------------------------------------------------------
Picked up JAVA_TOOL_OPTIONS: -Dmaven.ext.class.path="f:\jenkins\jenkins-slave\workspace\ven-box_maven-site-plugin_master@2@tmp\withMaven0b6e0c95\pipeline-maven-spy.jar" -Dorg.jenkinsci.plugins.pipeline.maven.reportsFolder="f:\jenkins\jenkins-slave\workspace\ven-box_maven-site-plugin_master@2@tmp\withMaven0b6e0c95"
[Pipeline] }
[Pipeline] // dir
[Pipeline] }
[Pipeline] // withMaven
[Pipeline] cleanWs
[WS-CLEANUP] Deleting project workspace...
[WS-CLEANUP] Deferred wipeout is used...
[WS-CLEANUP] done
[Pipeline] }
[Pipeline] // stage
[Pipeline] }
[Pipeline] // ws
[Pipeline] }
[Pipeline] // node
[Pipeline] }
[INFO] run post-build script verify.groovy
[INFO]           site-sd-top-parent-different-site\pom.xml ........ SUCCESS (14.4 s)
[INFO] Building: site-sd-top-parent-no-site\pom.xml
[INFO] run post-build script verify.groovy
[INFO]           site-sd-top-parent-no-site\pom.xml ............... SUCCESS (14.9 s)
[INFO] Building: site-sd-top-parent-same-site\pom.xml
[INFO] run post-build script verify.groovy
[INFO]           site-sd-top-parent-same-site\pom.xml ............. SUCCESS (13.9 s)
[INFO] Building: site-skip\pom.xml
[INFO] run post-build script verify.groovy
[INFO]           site-sd-top-parent-no-site\pom.xml ............... SUCCESS (16.1 s)
[INFO] Building: site-sd-top-parent-same-site\pom.xml
[INFO] run post-build script verify.bsh
[INFO]           site-skip\pom.xml ................................ SUCCESS (13.1 s)
[INFO] Building: surefire-report\pom.xml
[INFO] run post-build script verify.groovy
[INFO]           site-sd-top-parent-same-site\pom.xml ............. SUCCESS (13.3 s)
[INFO] Building: site-skip\pom.xml
[INFO] run post-build script verify.bsh
[INFO]           site-skip\pom.xml ................................ SUCCESS (13.4 s)
[INFO] Building: surefire-report\pom.xml
[INFO] run post-build script verify.groovy
[INFO]           surefire-report\pom.xml .......................... SUCCESS (14.0 s)
[INFO] Building: template-skin\pom.xml
[INFO] run post-build script verify.groovy
[INFO]           surefire-report\pom.xml .......................... SUCCESS (15.6 s)
[INFO] Building: template-skin\pom.xml
[INFO] run post-build script verify.bsh
[INFO]           template-skin\pom.xml ............................ SUCCESS (17.0 s)
[INFO] Building: validate\pom.xml
[INFO]           validate\pom.xml ................................. SUCCESS (10.2 s)
[INFO]
[INFO] --- maven-checkstyle-plugin:3.0.0:check (checkstyle-check) @ maven-site-plugin ---
[INFO]
[INFO] --- maven-invoker-plugin:3.1.0:verify (integration-test) @ maven-site-plugin ---
[INFO] -------------------------------------------------
[INFO] Build Summary:
[INFO]   Passed: 55, Failed: 0, Errors: 0, Skipped: 0
[INFO] -------------------------------------------------
[INFO] ------------------------------------------------------------------------
[INFO] BUILD SUCCESS
[INFO] ------------------------------------------------------------------------
[INFO] Total time: 16:18 min
[INFO] Finished at: 2019-02-13T11:20:34+00:00
[INFO] Final Memory: 67M/1137M
[INFO] ------------------------------------------------------------------------
[INFO] [jenkins-event-spy] Generated F:\jenkins\jenkins-slave\workspace\ven-box_maven-site-plugin_master@3@tmp\withMavenb5820321\maven-spy-20190213-110415-8778823824763608756366.log
Picked up JAVA_TOOL_OPTIONS: -Dmaven.ext.class.path="f:\jenkins\jenkins-slave\workspace\ven-box_maven-site-plugin_master@3@tmp\withMavenb5820321\pipeline-maven-spy.jar" -Dorg.jenkinsci.plugins.pipeline.maven.reportsFolder="f:\jenkins\jenkins-slave\workspace\ven-box_maven-site-plugin_master@3@tmp\withMavenb5820321"
[Pipeline] }
[Pipeline] // dir
[Pipeline] }
[withMaven] artifactsPublisher - Archive artifact windows-jdk8-m3.3.x_build\pom.xml under org\apache\maven\plugins\maven-site-plugin\3.8-SNAPSHOT\maven-site-plugin-3.8-SNAPSHOT.pom
[withMaven] artifactsPublisher - Archive artifact windows-jdk8-m3.3.x_build\target\maven-site-plugin-3.8-SNAPSHOT.jar under org\apache\maven\plugins\maven-site-plugin\3.8-SNAPSHOT\maven-site-plugin-3.8-SNAPSHOT.jar
[withMaven] junitPublisher - Archive test results for Maven artifact org.apache.maven.plugins:maven-site-plugin:maven-plugin:3.8-SNAPSHOT generated by maven-surefire-plugin:test (default-test): windows-jdk8-m3.3.x_build\target\surefire-reports\*.xml
Recording test results
[withMaven] openTasksPublisher - Scan Tasks for Maven artifact org.apache.maven.plugins:maven-site-plugin:maven-plugin:3.8-SNAPSHOT in source directory windows-jdk8-m3.3.x_build\src\main\java
[TASKS] Scanning folder 'f:\jenkins\jenkins-slave\workspace\ven-box_maven-site-plugin_master@3' for files matching the pattern 'windows-jdk8-m3.3.x_build\src\main\java\**\*' - excludes: null
[TASKS] Found 21 files to scan for tasks
[TASKS] Found 8 open tasks.
Skipping warnings blame since pipelines do not have an SCM link.%n
[TASKS] Computing warning deltas based on reference build #73
[withMaven] invokerPublisher - Archive invoker results for Maven artifact MavenArtifact{org.apache.maven.plugins:maven-site-plugin:maven-plugin:3.8-SNAPSHOT(version: 3.8-SNAPSHOT, snapshot:false) } generated by PluginInvocation{org.apache.maven.plugins:maven-invoker-plugin:3.1.0@integration-test  integration-test}: windows-jdk8-m3.3.x_build\target\invoker-reports\*.xml
[INFO] run post-build script verify.bsh
[INFO]           template-skin\pom.xml ............................ SUCCESS (17.6 s)
[INFO] Building: validate\pom.xml
[INFO]           validate\pom.xml ................................. SUCCESS (7.1 s)
[INFO]
[INFO] --- maven-checkstyle-plugin:3.0.0:check (checkstyle-check) @ maven-site-plugin ---
[INFO]
[INFO] --- maven-invoker-plugin:3.1.0:verify (integration-test) @ maven-site-plugin ---
[INFO] -------------------------------------------------
[INFO] Build Summary:
[INFO]   Passed: 55, Failed: 0, Errors: 0, Skipped: 0
[INFO] -------------------------------------------------
[INFO] ------------------------------------------------------------------------
[INFO] BUILD SUCCESS
[INFO] ------------------------------------------------------------------------
[INFO] Total time: 16:31 min
[INFO] Finished at: 2019-02-13T11:20:47Z
[INFO] Final Memory: 64M/1136M
[INFO] ------------------------------------------------------------------------
[INFO] [jenkins-event-spy] Generated F:\jenkins\jenkins-slave\workspace\ven-box_maven-site-plugin_master@2@2@tmp\withMaven1c62891a\maven-spy-20190213-110415-8404869675923466747928.log
Picked up JAVA_TOOL_OPTIONS: -Dmaven.ext.class.path="f:\jenkins\jenkins-slave\workspace\ven-box_maven-site-plugin_master@2@2@tmp\withMaven1c62891a\pipeline-maven-spy.jar" -Dorg.jenkinsci.plugins.pipeline.maven.reportsFolder="f:\jenkins\jenkins-slave\workspace\ven-box_maven-site-plugin_master@2@2@tmp\withMaven1c62891a"
[Pipeline] }
[Pipeline] // dir
[Pipeline] }
[withMaven] artifactsPublisher - Archive artifact windows-jdk8-m3.5.x_build\pom.xml under org\apache\maven\plugins\maven-site-plugin\3.8-SNAPSHOT\maven-site-plugin-3.8-SNAPSHOT.pom
[withMaven] artifactsPublisher - Archive artifact windows-jdk8-m3.5.x_build\target\maven-site-plugin-3.8-SNAPSHOT.jar under org\apache\maven\plugins\maven-site-plugin\3.8-SNAPSHOT\maven-site-plugin-3.8-SNAPSHOT.jar
[withMaven] junitPublisher - Archive test results for Maven artifact org.apache.maven.plugins:maven-site-plugin:maven-plugin:3.8-SNAPSHOT generated by maven-surefire-plugin:test (default-test): windows-jdk8-m3.5.x_build\target\surefire-reports\*.xml
Recording test results
[withMaven] openTasksPublisher - Scan Tasks for Maven artifact org.apache.maven.plugins:maven-site-plugin:maven-plugin:3.8-SNAPSHOT in source directory windows-jdk8-m3.5.x_build\src\main\java
[TASKS] Scanning folder 'f:\jenkins\jenkins-slave\workspace\ven-box_maven-site-plugin_master@2@2' for files matching the pattern 'windows-jdk8-m3.5.x_build\src\main\java\**\*' - excludes: null
[TASKS] Found 21 files to scan for tasks
[TASKS] Found 8 open tasks.
Skipping warnings blame since pipelines do not have an SCM link.%n
[TASKS] Computing warning deltas based on reference build #73
[withMaven] invokerPublisher - Archive invoker results for Maven artifact MavenArtifact{org.apache.maven.plugins:maven-site-plugin:maven-plugin:3.8-SNAPSHOT(version: 3.8-SNAPSHOT, snapshot:false) } generated by PluginInvocation{org.apache.maven.plugins:maven-invoker-plugin:3.1.0@integration-test  integration-test}: windows-jdk8-m3.5.x_build\target\invoker-reports\*.xml
[withMaven] Publishers: Generated Artifacts Publisher: 204 ms, Junit Publisher: 192 ms, Open Task Scanner Publisher: 291 ms, Dependencies Fingerprint Publisher: 1 ms, Invoker Publisher: 32791 ms, Pipeline Graph Publisher: 2 ms
[Pipeline] // withMaven
[Pipeline] cleanWs
[WS-CLEANUP] Deleting project workspace...
[WS-CLEANUP] Deferred wipeout is used...
[WS-CLEANUP] done
[Pipeline] }
[Pipeline] // stage
[Pipeline] }
[Pipeline] // ws
[Pipeline] }
[Pipeline] // node
[Pipeline] }
[withMaven] Publishers: Generated Artifacts Publisher: 138 ms, Junit Publisher: 173 ms, Open Task Scanner Publisher: 186 ms, Invoker Publisher: 32599 ms, Pipeline Graph Publisher: 1 ms
[Pipeline] // withMaven
[Pipeline] cleanWs
[WS-CLEANUP] Deleting project workspace...
[WS-CLEANUP] Deferred wipeout is used...
[WS-CLEANUP] done
[Pipeline] }
[Pipeline] // stage
[Pipeline] }
[Pipeline] // ws
[Pipeline] }
[Pipeline] // node
[Pipeline] }
[Pipeline] // parallel
[Pipeline] stage
[Pipeline] { (Notifications)
[Pipeline] echo
Build result: FAILURE
[Pipeline] jiraIssueSelector
[Pipeline] emailext