Build failed in Jenkins: Maven TLP » maven-site-plugin » master #57

classic Classic list List threaded Threaded
3 messages Options
Reply | Threaded
Open this post in threaded view
|

Build failed in Jenkins: Maven TLP » maven-site-plugin » master #57

Apache Jenkins Server-2
See https://builds.apache.org/job/maven-box/job/maven-site-plugin/job/master/57/

Changes:

* add Maven 3.1.1
* [MSITE-853] prepare ITs to check DOXIA-597 and DOXIA-571 fixes

All tests passed

Build log:
[...truncated 11579 lines...]
[INFO]           site-skip/pom.xml ................................ SUCCESS (6.8 s)
[INFO] Building: MSITE-506/pom.xml
[INFO] artifact junit.junit:3.8.2: checking for updates from central
[INFO]           MSITE-506/pom.xml ................................ SUCCESS (11.4 s)
[INFO] Building: MSITE-548/pom.xml
[INFO]           MSITE-506/pom.xml ................................ SUCCESS (17.1 s)
[INFO] Building: site-sd-top-parent-no-site/pom.xml
[INFO] run post-build script verify.bsh
[INFO]           MSITE-548/pom.xml ................................ SUCCESS (7.8 s)
[INFO] Building: MSITE-512/pom.xml
[INFO] run post-build script verify.groovy
[INFO]           site-sd-top-parent-no-site/pom.xml ............... SUCCESS (11.3 s)
[INFO] Building: MSITE-507/pom.xml
[INFO] run post-build script verify.groovy
[INFO]           MSITE-512/pom.xml ................................ SUCCESS (8.0 s)
[INFO] Building: reportConfig/pom.xml
[INFO] run post-build script verify.groovy
[INFO]           MSITE-507/pom.xml ................................ SUCCESS (8.5 s)
[INFO] Building: MSITE-159/pom.xml
[INFO] run post-build script verify.groovy
[INFO]           reportConfig/pom.xml ............................. SUCCESS (5.2 s)
[INFO] Building: MSITE-582/pom.xml
[INFO] run post-build script verify.groovy
[INFO]           MSITE-582/pom.xml ................................ SUCCESS (5.2 s)
[INFO] Building: site-attach-descriptor/pom.xml
[INFO] run post-build script verify.bsh
[INFO]           MSITE-159/pom.xml ................................ SUCCESS (7.6 s)
[INFO] Building: site-sd-top-parent-same-site/pom.xml
[INFO] run post-build script verify.bsh
[INFO]           site-attach-descriptor/pom.xml ................... SUCCESS (5.6 s)
[INFO] Building: MSITE-159/pom.xml
[INFO] run post-build script verify.bsh
[INFO]           MSITE-159/pom.xml ................................ SUCCESS (5.3 s)
[INFO] Building: MSITE-644/pom.xml
[INFO] run post-build script verify.groovy
[INFO]           site-sd-top-parent-same-site/pom.xml ............. SUCCESS (9.6 s)
[INFO] Building: MSITE-705-no-debug/pom.xml
[INFO]           MSITE-644/pom.xml ................................ SUCCESS (4.2 s)
[INFO] Building: MSITE-604/pom.xml
[INFO] run post-build script verify.groovy
[INFO]           MSITE-705-no-debug/pom.xml ....................... SUCCESS (8.1 s)
[INFO] Building: inheritance-interpolation/pom.xml
[INFO] run post-build script verify.groovy
[INFO]           MSITE-604/pom.xml ................................ SUCCESS (5.6 s)
[INFO] Building: doxia-formats/pom.xml
[INFO] run post-build script verify.groovy
[INFO]           doxia-formats/pom.xml ............................ SUCCESS (8.6 s)
[INFO] Building: MSITE-458/pom.xml
[INFO] run post-build script verify.groovy
[INFO]           inheritance-interpolation/pom.xml ................ SUCCESS (13.2 s)
[INFO] Building: report-changes-generation/pom.xml
[INFO] run post-build script verify.bsh
[INFO]           report-changes-generation/pom.xml ................ SUCCESS (7.5 s)
[INFO] Building: MSITE-582/pom.xml
[INFO] snapshot org.example:second:0.0.1-SNAPSHOT: checking for updates from Nexus
[INFO] artifact org.example.second:0.0.1-SNAPSHOT: checking for updates from central
[INFO] run post-build script verify.bsh
[INFO]           MSITE-458/pom.xml ................................ SUCCESS (12.0 s)
[INFO] Building: site-deploy/pom.xml
[INFO] run post-build script verify.bsh
[INFO]           site-deploy/pom.xml .............................. SUCCESS (6.0 s)
[INFO] Building: site-sd-top-parent-no-site/pom.xml
[INFO] run post-build script verify.groovy
[INFO]           MSITE-582/pom.xml ................................ SUCCESS (7.3 s)
[INFO] Building: full-reporting/pom.xml
[INFO] run post-build script verify.groovy
[INFO]           site-sd-top-parent-no-site/pom.xml ............... SUCCESS (8.4 s)
[INFO] Building: MSITE-456/pom.xml
[INFO] run post-build script verify.bsh
[INFO]           MSITE-456/pom.xml ................................ SUCCESS (5.2 s)
[INFO] Building: full-reporting/pom.xml
[INFO] artifact org.apache.maven.plugins:maven-jxr-plugin: checking for updates from central
[INFO] artifact org.apache.maven.plugins:maven-surefire-report-plugin: checking for updates from central
[INFO] artifact org.codehaus.mojo:findbugs-maven-plugin: checking for updates from central
[INFO] artifact org.codehaus.mojo:taglist-maven-plugin: checking for updates from central
[INFO] artifact org.apache.maven.plugins:maven-jxr-plugin: checking for updates from central
[INFO] artifact org.apache.maven.plugins:maven-surefire-report-plugin: checking for updates from central
[INFO] artifact org.codehaus.mojo:findbugs-maven-plugin: checking for updates from central
[INFO] artifact org.codehaus.mojo:taglist-maven-plugin: checking for updates from central
[INFO] run post-build script verify.groovy
[INFO]           full-reporting/pom.xml ........................... SUCCESS (47.5 s)
[INFO] Building: site-inheritance/pom.xml
[INFO] run post-build script verify.groovy
[INFO]           full-reporting/pom.xml ........................... SUCCESS (35.4 s)
[INFO] Building: MSITE-484/pom.xml
[INFO] run post-build script verify.groovy
[INFO]           MSITE-484/pom.xml ................................ SUCCESS (8.5 s)
[INFO] Building: failure/pom.xml
[INFO] run post-build script verify.bsh
[INFO]           site-inheritance/pom.xml ......................... SUCCESS (12.3 s)
[INFO] Building: MSITE-658/pom.xml
[INFO] run post-build script verify.bsh
[INFO]           MSITE-658/pom.xml ................................ SUCCESS (8.0 s)
[INFO] Building: resources/pom.xml
[INFO] run post-build script verify.groovy
[INFO]           resources/pom.xml ................................ SUCCESS (6.7 s)
[INFO] Building: MSITE-665/pom.xml
[INFO]           failure/pom.xml .................................. SUCCESS (20.7 s)
[INFO] Building: inheritedReports/pom.xml
[INFO] run post-build script verify.bsh
[INFO]           inheritedReports/pom.xml ......................... SUCCESS (5.4 s)
[INFO] Building: site-sd-stagingSiteURL/pom.xml
[INFO] run post-build script verify.groovy
[INFO]           site-sd-stagingSiteURL/pom.xml ................... SUCCESS (5.7 s)
[INFO] Building: new-configuration/pom.xml
[INFO]           MSITE-665/pom.xml ................................ SUCCESS (14.6 s)
[INFO] Building: site-skip/pom.xml
[INFO] run post-build script verify.groovy
[INFO]           new-configuration/pom.xml ........................ SUCCESS (6.9 s)
[INFO] Building: MSITE-658/pom.xml
[INFO] run post-build script verify.bsh
[INFO]           site-skip/pom.xml ................................ SUCCESS (10.1 s)
[INFO] Building: new-configuration/pom.xml
[INFO] run post-build script verify.bsh
[INFO]           MSITE-658/pom.xml ................................ SUCCESS (5.5 s)
[INFO] Building: inheritance-interpolation/pom.xml
[INFO] snapshot org.apache.maven.plugins.site.its.inheritance-interpolation:repo-parent:1.0-SNAPSHOT: checking for updates from Nexus
[INFO] run post-build script verify.groovy
[INFO]           new-configuration/pom.xml ........................ SUCCESS (9.0 s)
[INFO] Building: surefire-report/pom.xml
[INFO] artifact org.apache.maven.plugins.site.its.inheritance-interpolation.repo-parent:1.0-SNAPSHOT: checking for updates from central
[INFO] run post-build script verify.groovy
[INFO]           inheritance-interpolation/pom.xml ................ SUCCESS (9.7 s)
[INFO]
[INFO] --- mrm-maven-plugin:1.2.0:stop (default) @ maven-site-plugin ---
[INFO] Stopping Mock Repository Manager on http://localhost:38745
[INFO] Stopped SocketConnector@0.0.0.0:38745
[INFO] Mock Repository Manager http://localhost:38745 is stopped.
[INFO]
[INFO] --- maven-checkstyle-plugin:3.0.0:check (checkstyle-check) @ maven-site-plugin ---
[INFO]
[INFO] --- maven-invoker-plugin:3.1.0:verify (integration-test) @ maven-site-plugin ---
[INFO] -------------------------------------------------
[INFO] Build Summary:
[INFO]   Passed: 56, Failed: 0, Errors: 0, Skipped: 0
[INFO] -------------------------------------------------
[INFO] ------------------------------------------------------------------------
[INFO] BUILD SUCCESS
[INFO] ------------------------------------------------------------------------
[INFO] Total time:  08:51 min
[INFO] Finished at: 2020-02-14T22:55:48Z
[INFO] ------------------------------------------------------------------------
[INFO] [jenkins-event-spy] Generated /home/jenkins/jenkins-slave/workspace/ven-box_maven-site-plugin_master@2@tmp/withMaven436089a0/maven-spy-20200214-224657-5426747774961032150597.log
[Pipeline] }
[Pipeline] // dir
[Pipeline] }
[withMaven] artifactsPublisher - Archive artifact linux-jdk12-m3.6.x_build/pom.xml under org/apache/maven/plugins/maven-site-plugin/3.9.0-SNAPSHOT/maven-site-plugin-3.9.0-SNAPSHOT.pom
[withMaven] artifactsPublisher - Archive artifact linux-jdk12-m3.6.x_build/target/maven-site-plugin-3.9.0-SNAPSHOT.jar under org/apache/maven/plugins/maven-site-plugin/3.9.0-SNAPSHOT/maven-site-plugin-3.9.0-SNAPSHOT.jar
[withMaven] junitPublisher - Archive test results for Maven artifact org.apache.maven.plugins:maven-site-plugin:maven-plugin:3.9.0-SNAPSHOT generated by maven-surefire-plugin:test (default-test): linux-jdk12-m3.6.x_build/target/surefire-reports/*.xml
Recording test results
[INFO] run post-build script verify.groovy
[INFO]           surefire-report/pom.xml .......................... SUCCESS (9.6 s)
[INFO] Building: inheritedMenus/pom.xml
[withMaven] openTasksPublisher - Scan Tasks for Maven artifact org.apache.maven.plugins:maven-site-plugin:maven-plugin:3.9.0-SNAPSHOT in source directory linux-jdk12-m3.6.x_build/src/main/java
[TASKS] Scanning folder '/home/jenkins/jenkins-slave/workspace/ven-box_maven-site-plugin_master@2' for files matching the pattern 'linux-jdk12-m3.6.x_build/src/main/java/**/*' - excludes: null
[TASKS] Found 21 files to scan for tasks
[TASKS] Found 8 open tasks.
Skipping warnings blame since pipelines do not have an SCM link.%n
[TASKS] Computing warning deltas based on reference build #56
[withMaven] invokerPublisher - Archive invoker results for Maven artifact MavenArtifact{org.apache.maven.plugins:maven-site-plugin:maven-plugin:3.9.0-SNAPSHOT(version: 3.9.0-SNAPSHOT, snapshot:false) } generated by PluginInvocation{org.apache.maven.plugins:maven-invoker-plugin:3.1.0@integration-test  integration-test}: linux-jdk12-m3.6.x_build/target/invoker-reports/*.xml
[INFO] run post-build script verify.bsh
[INFO]           inheritedMenus/pom.xml ........................... SUCCESS (8.3 s)
[INFO] Building: default-reports/pom.xml
[INFO] run post-build script verify.groovy
[INFO]           default-reports/pom.xml .......................... SUCCESS (8.6 s)
[INFO] Building: site-sd-stagingSiteURL/pom.xml
[INFO] run post-build script verify.groovy
[INFO]           site-sd-stagingSiteURL/pom.xml ................... SUCCESS (7.6 s)
[INFO] Building: MSITE-609/pom.xml
[INFO] run post-build script verify.bsh
[INFO]           MSITE-609/pom.xml ................................ SUCCESS (7.6 s)
[INFO] Building: site-sd/pom.xml
[INFO] run post-build script verify.groovy
[INFO]           site-sd/pom.xml .................................. SUCCESS (11.1 s)
[INFO] Building: site-deploy/pom.xml
[INFO] run post-build script verify.bsh
[INFO]           site-deploy/pom.xml .............................. SUCCESS (7.7 s)
[INFO]
[INFO] --- mrm-maven-plugin:1.2.0:stop (default) @ maven-site-plugin ---
[INFO] Stopping Mock Repository Manager on http://localhost:36611
[INFO] Stopped SocketConnector@0.0.0.0:36611
[INFO] Mock Repository Manager http://localhost:36611 is stopped.
[INFO]
[INFO] --- maven-checkstyle-plugin:3.0.0:check (checkstyle-check) @ maven-site-plugin ---
[INFO]
[INFO] --- maven-invoker-plugin:3.1.0:verify (integration-test) @ maven-site-plugin ---
[INFO] -------------------------------------------------
[INFO] Build Summary:
[INFO]   Passed: 56, Failed: 0, Errors: 0, Skipped: 0
[INFO] -------------------------------------------------
[INFO] ------------------------------------------------------------------------
[INFO] BUILD SUCCESS
[INFO] ------------------------------------------------------------------------
[INFO] Total time:  11:18 min
[INFO] Finished at: 2020-02-14T22:56:46Z
[INFO] ------------------------------------------------------------------------
[INFO] [jenkins-event-spy] Generated /home/jenkins/jenkins-slave/workspace/ven-box_maven-site-plugin_master@2@tmp/withMavenef8d7990/maven-spy-20200214-224528-15813333069643336819361.log
[Pipeline] }
[Pipeline] // dir
[Pipeline] }
[withMaven] artifactsPublisher - Archive artifact linux-jdk11-m3.6.x_build/pom.xml under org/apache/maven/plugins/maven-site-plugin/3.9.0-SNAPSHOT/maven-site-plugin-3.9.0-SNAPSHOT.pom
[withMaven] artifactsPublisher - Archive artifact linux-jdk11-m3.6.x_build/target/maven-site-plugin-3.9.0-SNAPSHOT.jar under org/apache/maven/plugins/maven-site-plugin/3.9.0-SNAPSHOT/maven-site-plugin-3.9.0-SNAPSHOT.jar
[withMaven] junitPublisher - Archive test results for Maven artifact org.apache.maven.plugins:maven-site-plugin:maven-plugin:3.9.0-SNAPSHOT generated by maven-surefire-plugin:test (default-test): linux-jdk11-m3.6.x_build/target/surefire-reports/*.xml
Recording test results
[withMaven] openTasksPublisher - Scan Tasks for Maven artifact org.apache.maven.plugins:maven-site-plugin:maven-plugin:3.9.0-SNAPSHOT in source directory linux-jdk11-m3.6.x_build/src/main/java
[TASKS] Scanning folder '/home/jenkins/jenkins-slave/workspace/ven-box_maven-site-plugin_master@2' for files matching the pattern 'linux-jdk11-m3.6.x_build/src/main/java/**/*' - excludes: null
[TASKS] Found 21 files to scan for tasks
[TASKS] Found 8 open tasks.
Skipping warnings blame since pipelines do not have an SCM link.%n
[TASKS] Computing warning deltas based on reference build #56
[withMaven] invokerPublisher - Archive invoker results for Maven artifact MavenArtifact{org.apache.maven.plugins:maven-site-plugin:maven-plugin:3.9.0-SNAPSHOT(version: 3.9.0-SNAPSHOT, snapshot:false) } generated by PluginInvocation{org.apache.maven.plugins:maven-invoker-plugin:3.1.0@integration-test  integration-test}: linux-jdk11-m3.6.x_build/target/invoker-reports/*.xml
[withMaven] Publishers: Generated Artifacts Publisher: 1165 ms, Junit Publisher: 1652 ms, Open Task Scanner Publisher: 1533 ms, Invoker Publisher: 66796 ms, Pipeline Graph Publisher: 1 ms
[Pipeline] // withMaven
[Pipeline] cleanWs
[WS-CLEANUP] Deleting project workspace...
[WS-CLEANUP] Deferred wipeout is used...
[WS-CLEANUP] done
[Pipeline] }
[Pipeline] // stage
[Pipeline] }
[Pipeline] // ws
[Pipeline] }
[Pipeline] // node
[Pipeline] }
[withMaven] Publishers: Generated Artifacts Publisher: 2203 ms, Junit Publisher: 1696 ms, Open Task Scanner Publisher: 1520 ms, Invoker Publisher: 80202 ms, Pipeline Graph Publisher: 1 ms
[Pipeline] // withMaven
[Pipeline] cleanWs
[WS-CLEANUP] Deleting project workspace...
[WS-CLEANUP] Deferred wipeout is used...
[WS-CLEANUP] done
[Pipeline] }
[Pipeline] // stage
[Pipeline] }
[Pipeline] // ws
[Pipeline] }
[Pipeline] // node
[Pipeline] }
[Pipeline] // parallel
[Pipeline] stage
[Pipeline] { (Notifications)
[Pipeline] echo
Build result: FAILURE
[Pipeline] jiraIssueSelector
[Pipeline] jiraComment
[Pipeline] echo
The authors of changes [tibordigana, hboutemy].
[Pipeline] echo
Sending email ...
[Pipeline] emailext
Reply | Threaded
Open this post in threaded view
|

Build failed in Jenkins: Maven TLP » maven-site-plugin » master #58

Apache Jenkins Server-2
See https://builds.apache.org/job/maven-box/job/maven-site-plugin/job/master/58/

Changes:

* [MSITE-855] make build Reproducible

All tests passed

Build log:
[...truncated 10125 lines...]
[INFO] Building: full-reporting/pom.xml
[INFO] run post-build script verify.groovy
[INFO]           MSITE-705-no-debug/pom.xml ....................... SUCCESS (5.9 s)
[INFO] Building: MSITE-354/pom.xml
[INFO] run post-build script verify.bsh
[INFO]           MSITE-354/pom.xml ................................ SUCCESS (5.3 s)
[INFO] Building: inheritedMenus/pom.xml
[INFO] run post-build script verify.bsh
[INFO]           inheritedMenus/pom.xml ........................... SUCCESS (5.7 s)
[INFO] Building: MSITE-566/pom.xml
[INFO] run post-build script verify.bsh
[INFO]           MSITE-566/pom.xml ................................ SUCCESS (4.3 s)
[INFO] Building: MSITE-723/pom.xml
[INFO] run post-build script verify.groovy
[INFO]           MSITE-723/pom.xml ................................ SUCCESS (5.6 s)
[INFO] Building: site-sd-2/pom.xml
[INFO] run post-build script verify.groovy
[INFO]           site-sd-2/pom.xml ................................ SUCCESS (9.8 s)
[INFO] Building: it-plugin-test/pom.xml
[INFO]           it-plugin-test/pom.xml ........................... SUCCESS (6.1 s)
[INFO] Building: MSITE-265/pom.xml
[INFO] run post-build script verify.groovy
[INFO]           full-reporting/pom.xml ........................... SUCCESS (42.2 s)
[INFO] Building: site-inheritance/pom.xml
[INFO] run post-build script verify.bsh
[INFO]           MSITE-265/pom.xml ................................ SUCCESS (6.6 s)
[INFO] Building: empty-report-set/pom.xml
[INFO] run post-build script verify.bsh
[INFO]           empty-report-set/pom.xml ......................... SUCCESS (4.2 s)
[INFO] Building: MSITE-484/pom.xml
[INFO] run post-build script verify.bsh
[INFO]           site-inheritance/pom.xml ......................... SUCCESS (12.2 s)
[INFO] Building: MSITE-658/pom.xml
[INFO] run post-build script verify.groovy
[INFO]           MSITE-484/pom.xml ................................ SUCCESS (8.8 s)
[INFO] Building: MSITE-506/pom.xml
[INFO] run post-build script verify.bsh
[INFO]           MSITE-658/pom.xml ................................ SUCCESS (7.9 s)
[INFO] Building: resources/pom.xml
[INFO] run post-build script verify.groovy
[INFO]           resources/pom.xml ................................ SUCCESS (6.6 s)
[INFO] Building: MSITE-665/pom.xml
[INFO]           MSITE-506/pom.xml ................................ SUCCESS (11.6 s)
[INFO] Building: MSITE-504/pom.xml
[INFO]           MSITE-504/pom.xml ................................ SUCCESS (11.0 s)
[INFO] Building: MSITE-658/pom.xml
[INFO]           MSITE-665/pom.xml ................................ SUCCESS (14.1 s)
[INFO] Building: site-skip/pom.xml
[INFO] run post-build script verify.bsh
[INFO]           MSITE-658/pom.xml ................................ SUCCESS (5.4 s)
[INFO] Building: MSITE-456/pom.xml
[INFO] run post-build script verify.bsh
[INFO]           MSITE-456/pom.xml ................................ SUCCESS (4.6 s)
[INFO] Building: MSITE-604/pom.xml
[INFO] run post-build script verify.bsh
[INFO]           site-skip/pom.xml ................................ SUCCESS (9.8 s)
[INFO] Building: new-configuration/pom.xml
[INFO] run post-build script verify.groovy
[INFO]           MSITE-604/pom.xml ................................ SUCCESS (4.8 s)
[INFO] Building: site-jar/pom.xml
[INFO] run post-build script verify.bsh
[INFO]           site-jar/pom.xml ................................. SUCCESS (5.2 s)
[INFO] Building: MSITE-665/pom.xml
[INFO] run post-build script verify.groovy
[INFO]           new-configuration/pom.xml ........................ SUCCESS (8.7 s)
[INFO] Building: surefire-report/pom.xml
[INFO]           MSITE-665/pom.xml ................................ SUCCESS (9.5 s)
[INFO] Building: inheritedReports/pom.xml
[INFO] run post-build script verify.groovy
[INFO]           surefire-report/pom.xml .......................... SUCCESS (9.5 s)
[INFO] Building: inheritedMenus/pom.xml
[INFO] run post-build script verify.bsh
[INFO]           inheritedReports/pom.xml ......................... SUCCESS (5.3 s)
[INFO] Building: template-skin/pom.xml
[INFO] run post-build script verify.bsh
[INFO]           inheritedMenus/pom.xml ........................... SUCCESS (7.9 s)
[INFO] Building: default-reports/pom.xml
[INFO] run post-build script verify.bsh
[INFO]           template-skin/pom.xml ............................ SUCCESS (9.5 s)
[INFO] Building: site-sd/pom.xml
[INFO] run post-build script verify.groovy
[INFO]           default-reports/pom.xml .......................... SUCCESS (8.8 s)
[INFO] Building: site-sd-stagingSiteURL/pom.xml
[INFO] run post-build script verify.groovy
[INFO]           site-sd/pom.xml .................................. SUCCESS (7.1 s)
[INFO] Building: site-sd-lang/pom.xml
[INFO] run post-build script verify.groovy
[INFO]           site-sd-stagingSiteURL/pom.xml ................... SUCCESS (7.5 s)
[INFO] Building: MSITE-609/pom.xml
[INFO] run post-build script verify.bsh
[INFO]           site-sd-lang/pom.xml ............................. SUCCESS (7.5 s)
[INFO] Building: MSITE-705-debug/pom.xml
[INFO] run post-build script verify.bsh
[INFO]           MSITE-609/pom.xml ................................ SUCCESS (7.6 s)
[INFO] Building: site-sd/pom.xml
[INFO] run post-build script verify.groovy
[INFO]           MSITE-705-debug/pom.xml .......................... SUCCESS (5.7 s)
[INFO] Building: site-inheritance/pom.xml
[INFO] run post-build script verify.bsh
[INFO]           site-inheritance/pom.xml ......................... SUCCESS (8.1 s)
[INFO] Building: new-configuration/pom.xml
[INFO] run post-build script verify.groovy
[INFO]           site-sd/pom.xml .................................. SUCCESS (10.7 s)
[INFO] Building: site-deploy/pom.xml
[INFO] run post-build script verify.groovy
[INFO]           new-configuration/pom.xml ........................ SUCCESS (6.3 s)
[INFO] Building: site-sd-top-parent-same-site/pom.xml
[INFO] run post-build script verify.bsh
[INFO]           site-deploy/pom.xml .............................. SUCCESS (7.4 s)
[INFO]
[INFO] --- mrm-maven-plugin:1.2.0:stop (default) @ maven-site-plugin ---
[INFO] Stopping Mock Repository Manager on http://localhost:35005
[INFO] Stopped SocketConnector@0.0.0.0:35005
[INFO] Mock Repository Manager http://localhost:35005 is stopped.
[INFO]
[INFO] --- maven-checkstyle-plugin:3.0.0:check (checkstyle-check) @ maven-site-plugin ---
[INFO]
[INFO] --- maven-invoker-plugin:3.2.1:verify (integration-test) @ maven-site-plugin ---
[INFO] -------------------------------------------------
[INFO] Build Summary:
[INFO]   Passed: 56, Failed: 0, Errors: 0, Skipped: 0
[INFO] -------------------------------------------------
[INFO] ------------------------------------------------------------------------
[INFO] BUILD SUCCESS
[INFO] ------------------------------------------------------------------------
[INFO] Total time:  11:02 min
[INFO] Finished at: 2020-02-14T23:09:31Z
[INFO] ------------------------------------------------------------------------
[INFO] [jenkins-event-spy] Generated /home/jenkins/jenkins-slave/workspace/ven-box_maven-site-plugin_master@2@tmp/withMaven5f90ed4d/maven-spy-20200214-225828-51416300800944853616938.log
[Pipeline] }
[Pipeline] // dir
[Pipeline] }
[INFO] run post-build script verify.groovy
[INFO]           site-sd-top-parent-same-site/pom.xml ............. SUCCESS (6.5 s)
[INFO] Building: validate/pom.xml
[withMaven] artifactsPublisher - Archive artifact linux-jdk11-m3.6.x_build/pom.xml under org/apache/maven/plugins/maven-site-plugin/3.9.0-SNAPSHOT/maven-site-plugin-3.9.0-SNAPSHOT.pom
[withMaven] artifactsPublisher - Archive artifact linux-jdk11-m3.6.x_build/target/maven-site-plugin-3.9.0-SNAPSHOT.jar under org/apache/maven/plugins/maven-site-plugin/3.9.0-SNAPSHOT/maven-site-plugin-3.9.0-SNAPSHOT.jar
[withMaven] junitPublisher - Archive test results for Maven artifact org.apache.maven.plugins:maven-site-plugin:maven-plugin:3.9.0-SNAPSHOT generated by maven-surefire-plugin:test (default-test): linux-jdk11-m3.6.x_build/target/surefire-reports/*.xml
Recording test results
[withMaven] openTasksPublisher - Scan Tasks for Maven artifact org.apache.maven.plugins:maven-site-plugin:maven-plugin:3.9.0-SNAPSHOT in source directory linux-jdk11-m3.6.x_build/src/main/java
[INFO] run post-build script verify.groovy
[INFO]           validate/pom.xml ................................. SUCCESS (5.5 s)
[INFO] Building: inheritance-interpolation/pom.xml
[TASKS] Scanning folder '/home/jenkins/jenkins-slave/workspace/ven-box_maven-site-plugin_master@2' for files matching the pattern 'linux-jdk11-m3.6.x_build/src/main/java/**/*' - excludes: null
[TASKS] Found 21 files to scan for tasks
[TASKS] Found 8 open tasks.
Skipping warnings blame since pipelines do not have an SCM link.%n
[TASKS] Computing warning deltas based on reference build #56
[withMaven] invokerPublisher - Archive invoker results for Maven artifact MavenArtifact{org.apache.maven.plugins:maven-site-plugin:maven-plugin:3.9.0-SNAPSHOT(version: 3.9.0-SNAPSHOT, snapshot:false) } generated by PluginInvocation{org.apache.maven.plugins:maven-invoker-plugin:3.2.1@integration-test  integration-test}: linux-jdk11-m3.6.x_build/target/invoker-reports/*.xml
[INFO] run post-build script verify.groovy
[INFO]           inheritance-interpolation/pom.xml ................ SUCCESS (8.9 s)
[INFO] Building: surefire-report/pom.xml
[INFO] run post-build script verify.groovy
[INFO]           surefire-report/pom.xml .......................... SUCCESS (6.3 s)
[INFO] Building: MSITE-512/pom.xml
[INFO] run post-build script verify.groovy
[INFO]           MSITE-512/pom.xml ................................ SUCCESS (7.2 s)
[INFO] Building: failure/pom.xml
[INFO]           failure/pom.xml .................................. SUCCESS (20.1 s)
[INFO] Building: site-deploy/pom.xml
[INFO] run post-build script verify.bsh
[INFO]           site-deploy/pom.xml .............................. SUCCESS (5.1 s)
[INFO] Building: MSITE-507/pom.xml
[INFO] run post-build script verify.groovy
[INFO]           MSITE-507/pom.xml ................................ SUCCESS (5.6 s)
[INFO] Building: no-version/pom.xml
[INFO] run post-build script verify.groovy
[INFO]           no-version/pom.xml ............................... SUCCESS (6.2 s)
[INFO] Building: effective-site/pom.xml
[INFO] run post-build script verify.groovy
[INFO]           effective-site/pom.xml ........................... SUCCESS (4.6 s)
[INFO] Building: MSITE-159/pom.xml
[INFO] run post-build script verify.bsh
[INFO]           MSITE-159/pom.xml ................................ SUCCESS (5.1 s)
[INFO] Building: reportConfig/pom.xml
[INFO] run post-build script verify.groovy
[INFO]           reportConfig/pom.xml ............................. SUCCESS (5.4 s)
[INFO]
[INFO] --- mrm-maven-plugin:1.2.0:stop (default) @ maven-site-plugin ---
[INFO] Stopping Mock Repository Manager on http://localhost:46839
[INFO] Stopped SocketConnector@0.0.0.0:46839
[INFO] Mock Repository Manager http://localhost:46839 is stopped.
[INFO]
[INFO] --- maven-checkstyle-plugin:3.0.0:check (checkstyle-check) @ maven-site-plugin ---
[INFO]
[INFO] --- maven-invoker-plugin:3.2.1:verify (integration-test) @ maven-site-plugin ---
[INFO] -------------------------------------------------
[INFO] Build Summary:
[INFO]   Passed: 56, Failed: 0, Errors: 0, Skipped: 0
[INFO] -------------------------------------------------
[INFO] ------------------------------------------------------------------------
[INFO] BUILD SUCCESS
[INFO] ------------------------------------------------------------------------
[INFO] Total time:  07:57 min
[INFO] Finished at: 2020-02-14T23:10:54Z
[INFO] ------------------------------------------------------------------------
[INFO] [jenkins-event-spy] Generated /home/jenkins/jenkins-slave/workspace/ven-box_maven-site-plugin_master@2@tmp/withMaven05818627/maven-spy-20200214-230256-90016785828407705921634.log
[Pipeline] }
[Pipeline] // dir
[Pipeline] }
[withMaven] artifactsPublisher - Archive artifact linux-jdk12-m3.6.x_build/pom.xml under org/apache/maven/plugins/maven-site-plugin/3.9.0-SNAPSHOT/maven-site-plugin-3.9.0-SNAPSHOT.pom
[withMaven] artifactsPublisher - Archive artifact linux-jdk12-m3.6.x_build/target/maven-site-plugin-3.9.0-SNAPSHOT.jar under org/apache/maven/plugins/maven-site-plugin/3.9.0-SNAPSHOT/maven-site-plugin-3.9.0-SNAPSHOT.jar
[withMaven] junitPublisher - Archive test results for Maven artifact org.apache.maven.plugins:maven-site-plugin:maven-plugin:3.9.0-SNAPSHOT generated by maven-surefire-plugin:test (default-test): linux-jdk12-m3.6.x_build/target/surefire-reports/*.xml
Recording test results
[withMaven] Publishers: Generated Artifacts Publisher: 2162 ms, Junit Publisher: 1648 ms, Open Task Scanner Publisher: 1833 ms, Invoker Publisher: 79324 ms, Pipeline Graph Publisher: 32 ms
[withMaven] openTasksPublisher - Scan Tasks for Maven artifact org.apache.maven.plugins:maven-site-plugin:maven-plugin:3.9.0-SNAPSHOT in source directory linux-jdk12-m3.6.x_build/src/main/java
[TASKS] Scanning folder '/home/jenkins/jenkins-slave/workspace/ven-box_maven-site-plugin_master@2' for files matching the pattern 'linux-jdk12-m3.6.x_build/src/main/java/**/*' - excludes: null
[TASKS] Found 21 files to scan for tasks
[TASKS] Found 8 open tasks.
Skipping warnings blame since pipelines do not have an SCM link.%n
[TASKS] Computing warning deltas based on reference build #56
[Pipeline] // withMaven
[Pipeline] cleanWs
[WS-CLEANUP] Deleting project workspace...
[WS-CLEANUP] Deferred wipeout is used...
[WS-CLEANUP] done
[Pipeline] }
[Pipeline] // stage
[Pipeline] }
[Pipeline] // ws
[Pipeline] }
[Pipeline] // node
[Pipeline] }
[withMaven] invokerPublisher - Archive invoker results for Maven artifact MavenArtifact{org.apache.maven.plugins:maven-site-plugin:maven-plugin:3.9.0-SNAPSHOT(version: 3.9.0-SNAPSHOT, snapshot:false) } generated by PluginInvocation{org.apache.maven.plugins:maven-invoker-plugin:3.2.1@integration-test  integration-test}: linux-jdk12-m3.6.x_build/target/invoker-reports/*.xml
[withMaven] Publishers: Generated Artifacts Publisher: 1259 ms, Junit Publisher: 1670 ms, Open Task Scanner Publisher: 1462 ms, Invoker Publisher: 69955 ms, Pipeline Graph Publisher: 28 ms
[Pipeline] // withMaven
[Pipeline] cleanWs
[WS-CLEANUP] Deleting project workspace...
[WS-CLEANUP] Deferred wipeout is used...
[WS-CLEANUP] done
[Pipeline] }
[Pipeline] // stage
[Pipeline] }
[Pipeline] // ws
[Pipeline] }
[Pipeline] // node
[Pipeline] }
[Pipeline] // parallel
[Pipeline] stage
[Pipeline] { (Notifications)
[Pipeline] echo
Build result: FAILURE
[Pipeline] jiraIssueSelector
[Pipeline] jiraComment
[Pipeline] echo
The authors of changes [hboutemy].
[Pipeline] echo
Sending email ...
[Pipeline] emailext
Reply | Threaded
Open this post in threaded view
|

Build failed in Jenkins: Maven TLP » maven-site-plugin » master #59

Apache Jenkins Server-2
See https://builds.apache.org/job/maven-box/job/maven-site-plugin/job/master/59/

Changes:

* [MSITE-853] upgrade Doxia to 1.9.1

All tests passed

Build log:
[...truncated 12789 lines...]
[INFO] run post-build script verify.bsh
[INFO]           site-skip\pom.xml ................................ SUCCESS (7.9 s)
[INFO] Building: surefire-report\pom.xml
[INFO] run post-build script verify.groovy
[INFO]           default-reports-excluded/pom.xml ................. SUCCESS (6.5 s)
[INFO] Building: no-version/pom.xml
[INFO] run post-build script verify.groovy
[INFO]           site-sd-top-parent-same-site\pom.xml ............. SUCCESS (8.0 s)
[INFO] Building: site-skip\pom.xml
[INFO] run post-build script verify.bsh
[INFO]           site-sd-lang/pom.xml ............................. SUCCESS (12.0 s)
[INFO] Building: new-configuration/pom.xml
[INFO] run post-build script verify.groovy
[INFO]           surefire-report\pom.xml .......................... SUCCESS (8.2 s)
[INFO] Building: template-skin\pom.xml
[INFO] run post-build script verify.groovy
[INFO]           no-version/pom.xml ............................... SUCCESS (9.7 s)
[INFO]
[INFO] --- mrm-maven-plugin:1.2.0:stop (default) @ maven-site-plugin ---
[INFO] Stopping Mock Repository Manager on http://localhost:37085
[INFO] Stopped SocketConnector@0.0.0.0:37085
[INFO] Mock Repository Manager http://localhost:37085 is stopped.
[INFO]
[INFO] --- maven-checkstyle-plugin:3.0.0:check (checkstyle-check) @ maven-site-plugin ---
[INFO]
[INFO] --- maven-invoker-plugin:3.2.1:verify (integration-test) @ maven-site-plugin ---
[INFO] -------------------------------------------------
[INFO] Build Summary:
[INFO]   Passed: 56, Failed: 0, Errors: 0, Skipped: 0
[INFO] -------------------------------------------------
[INFO] ------------------------------------------------------------------------
[INFO] BUILD SUCCESS
[INFO] ------------------------------------------------------------------------
[INFO] Total time:  12:07 min
[INFO] Finished at: 2020-02-18T22:51:47Z
[INFO] ------------------------------------------------------------------------
[INFO] [jenkins-event-spy] Generated /home/jenkins/jenkins-slave/workspace/ven-box_maven-site-plugin_master@3@tmp/withMavena5924e45/maven-spy-20200218-223940-78477131929722881089.log
[Pipeline] }
[Pipeline] // dir
[Pipeline] }
[INFO] run post-build script verify.bsh
[INFO]           site-skip\pom.xml ................................ SUCCESS (9.0 s)
[INFO] Building: surefire-report\pom.xml
[INFO] run post-build script verify.groovy
[INFO]           new-configuration/pom.xml ........................ SUCCESS (9.7 s)
[INFO] Building: MSITE-644/pom.xml
[withMaven] artifactsPublisher - Archive artifact linux-jdk11-m3.6.x_build/pom.xml under org/apache/maven/plugins/maven-site-plugin/3.9.0-SNAPSHOT/maven-site-plugin-3.9.0-SNAPSHOT.pom
[withMaven] artifactsPublisher - Archive artifact linux-jdk11-m3.6.x_build/target/maven-site-plugin-3.9.0-SNAPSHOT.jar under org/apache/maven/plugins/maven-site-plugin/3.9.0-SNAPSHOT/maven-site-plugin-3.9.0-SNAPSHOT.jar
[withMaven] junitPublisher - Archive test results for Maven artifact org.apache.maven.plugins:maven-site-plugin:maven-plugin:3.9.0-SNAPSHOT generated by maven-surefire-plugin:test (default-test): linux-jdk11-m3.6.x_build/target/surefire-reports/*.xml
Recording test results
[withMaven] openTasksPublisher - Scan Tasks for Maven artifact org.apache.maven.plugins:maven-site-plugin:maven-plugin:3.9.0-SNAPSHOT in source directory linux-jdk11-m3.6.x_build/src/main/java
[TASKS] Scanning folder '/home/jenkins/jenkins-slave/workspace/ven-box_maven-site-plugin_master@3' for files matching the pattern 'linux-jdk11-m3.6.x_build/src/main/java/**/*' - excludes: null
[TASKS] Found 21 files to scan for tasks
[TASKS] Found 8 open tasks.
Skipping warnings blame since pipelines do not have an SCM link.%n
[TASKS] Computing warning deltas based on reference build #56
[withMaven] invokerPublisher - Archive invoker results for Maven artifact MavenArtifact{org.apache.maven.plugins:maven-site-plugin:maven-plugin:3.9.0-SNAPSHOT(version: 3.9.0-SNAPSHOT, snapshot:false) } generated by PluginInvocation{org.apache.maven.plugins:maven-invoker-plugin:3.2.1@integration-test  integration-test}: linux-jdk11-m3.6.x_build/target/invoker-reports/*.xml
[INFO]           MSITE-644/pom.xml ................................ SUCCESS (6.3 s)
[INFO] Building: default-reports-excluded/pom.xml
[INFO] snapshot org.apache.maven.plugins.site.its:template-skin:1.0-SNAPSHOT: checking for updates from apache-snapshots
[INFO] snapshot org.apache.maven.plugins.site.its:template-skin:1.0-SNAPSHOT: checking for updates from Nexus
[INFO] artifact org.apache.maven.plugins.site.its.template-skin:1.0-SNAPSHOT: checking for updates from central
[INFO] run post-build script verify.bsh
[INFO]           template-skin\pom.xml ............................ SUCCESS (12.5 s)
[INFO] Building: validate\pom.xml
[INFO] run post-build script verify.groovy
[INFO]           surefire-report\pom.xml .......................... SUCCESS (8.5 s)
[INFO] Building: template-skin\pom.xml
[INFO] run post-build script verify.groovy
[INFO]           default-reports-excluded/pom.xml ................. SUCCESS (6.2 s)
[INFO] Building: no-version/pom.xml
[INFO] run post-build script verify.groovy
[INFO]           validate\pom.xml ................................. SUCCESS (6.0 s)
[INFO]
[INFO] --- mrm-maven-plugin:1.2.0:stop (default) @ maven-site-plugin ---
[INFO] Stopping Mock Repository Manager on http://localhost:56174
[INFO] Stopped SocketConnector@0.0.0.0:56174
[INFO] Mock Repository Manager http://localhost:56174 is stopped.
[INFO]
[INFO] --- maven-checkstyle-plugin:3.0.0:check (checkstyle-check) @ maven-site-plugin ---
[INFO]
[INFO] --- maven-invoker-plugin:3.2.1:verify (integration-test) @ maven-site-plugin ---
[INFO] -------------------------------------------------
[INFO] Build Summary:
[INFO]   Passed: 56, Failed: 0, Errors: 0, Skipped: 0
[INFO] -------------------------------------------------
[INFO] ------------------------------------------------------------------------
[INFO] BUILD SUCCESS
[INFO] ------------------------------------------------------------------------
[INFO] Total time:  12:11 min
[INFO] Finished at: 2020-02-18T14:52:02-08:00
[INFO] ------------------------------------------------------------------------
[INFO] [jenkins-event-spy] Generated F:\jenkins\jenkins-slave\workspace\ven-box_maven-site-plugin_master@2@tmp\withMaven832e3192\maven-spy-20200218-143950-43113129728178724166241.log
[Pipeline] }
[Pipeline] // dir
[Pipeline] }
[withMaven] artifactsPublisher - Archive artifact windows-jdk12-m3.6.x_build\pom.xml under org\apache\maven\plugins\maven-site-plugin\3.9.0-SNAPSHOT\maven-site-plugin-3.9.0-SNAPSHOT.pom
[withMaven] artifactsPublisher - Archive artifact windows-jdk12-m3.6.x_build\target\maven-site-plugin-3.9.0-SNAPSHOT.jar under org\apache\maven\plugins\maven-site-plugin\3.9.0-SNAPSHOT\maven-site-plugin-3.9.0-SNAPSHOT.jar
[withMaven] junitPublisher - Archive test results for Maven artifact org.apache.maven.plugins:maven-site-plugin:maven-plugin:3.9.0-SNAPSHOT generated by maven-surefire-plugin:test (default-test): windows-jdk12-m3.6.x_build\target\surefire-reports\*.xml
Recording test results
[withMaven] openTasksPublisher - Scan Tasks for Maven artifact org.apache.maven.plugins:maven-site-plugin:maven-plugin:3.9.0-SNAPSHOT in source directory windows-jdk12-m3.6.x_build\src\main\java
[TASKS] Scanning folder 'f:\jenkins\jenkins-slave\workspace\ven-box_maven-site-plugin_master@2' for files matching the pattern 'windows-jdk12-m3.6.x_build\src\main\java\**\*' - excludes: null
[TASKS] Found 21 files to scan for tasks
[TASKS] Found 8 open tasks.
Skipping warnings blame since pipelines do not have an SCM link.%n
[TASKS] Computing warning deltas based on reference build #56
[withMaven] invokerPublisher - Archive invoker results for Maven artifact MavenArtifact{org.apache.maven.plugins:maven-site-plugin:maven-plugin:3.9.0-SNAPSHOT(version: 3.9.0-SNAPSHOT, snapshot:false) } generated by PluginInvocation{org.apache.maven.plugins:maven-invoker-plugin:3.2.1@integration-test  integration-test}: windows-jdk12-m3.6.x_build\target\invoker-reports\*.xml
[INFO] snapshot org.apache.maven.plugins.site.its:template-skin:1.0-SNAPSHOT: checking for updates from apache-snapshots
[INFO] snapshot org.apache.maven.plugins.site.its:template-skin:1.0-SNAPSHOT: checking for updates from Nexus
[INFO] artifact org.apache.maven.plugins.site.its.template-skin:1.0-SNAPSHOT: checking for updates from central
[INFO] run post-build script verify.bsh
[INFO]           template-skin\pom.xml ............................ SUCCESS (12.7 s)
[INFO] Building: validate\pom.xml
[INFO] run post-build script verify.groovy
[INFO]           no-version/pom.xml ............................... SUCCESS (10.0 s)
[INFO]
[INFO] --- mrm-maven-plugin:1.2.0:stop (default) @ maven-site-plugin ---
[INFO] Stopping Mock Repository Manager on http://localhost:37745
[INFO] Stopped SocketConnector@0.0.0.0:37745
[INFO] Mock Repository Manager http://localhost:37745 is stopped.
[INFO]
[INFO] --- maven-checkstyle-plugin:3.0.0:check (checkstyle-check) @ maven-site-plugin ---
[INFO]
[INFO] --- maven-invoker-plugin:3.2.1:verify (integration-test) @ maven-site-plugin ---
[INFO] -------------------------------------------------
[INFO] Build Summary:
[INFO]   Passed: 56, Failed: 0, Errors: 0, Skipped: 0
[INFO] -------------------------------------------------
[INFO] ------------------------------------------------------------------------
[INFO] BUILD SUCCESS
[INFO] ------------------------------------------------------------------------
[INFO] Total time:  12:31 min
[INFO] Finished at: 2020-02-18T22:52:13Z
[INFO] ------------------------------------------------------------------------
[INFO] [jenkins-event-spy] Generated /home/jenkins/jenkins-slave/workspace/ven-box_maven-site-plugin_master@2@2@tmp/withMaven15be397c/maven-spy-20200218-223942-331476933020433758775.log
[Pipeline] }
[Pipeline] // dir
[Pipeline] }
[withMaven] artifactsPublisher - Archive artifact linux-jdk12-m3.6.x_build/pom.xml under org/apache/maven/plugins/maven-site-plugin/3.9.0-SNAPSHOT/maven-site-plugin-3.9.0-SNAPSHOT.pom
[withMaven] artifactsPublisher - Archive artifact linux-jdk12-m3.6.x_build/target/maven-site-plugin-3.9.0-SNAPSHOT.jar under org/apache/maven/plugins/maven-site-plugin/3.9.0-SNAPSHOT/maven-site-plugin-3.9.0-SNAPSHOT.jar
[withMaven] junitPublisher - Archive test results for Maven artifact org.apache.maven.plugins:maven-site-plugin:maven-plugin:3.9.0-SNAPSHOT generated by maven-surefire-plugin:test (default-test): linux-jdk12-m3.6.x_build/target/surefire-reports/*.xml
Recording test results
[INFO] run post-build script verify.groovy
[INFO]           validate\pom.xml ................................. SUCCESS (5.8 s)
[INFO]
[INFO] --- mrm-maven-plugin:1.2.0:stop (default) @ maven-site-plugin ---
[INFO] Stopping Mock Repository Manager on http://localhost:49711
[INFO] Stopped SocketConnector@0.0.0.0:49711
[INFO] Mock Repository Manager http://localhost:49711 is stopped.
[INFO]
[INFO] --- maven-checkstyle-plugin:3.0.0:check (checkstyle-check) @ maven-site-plugin ---
[INFO]
[INFO] --- maven-invoker-plugin:3.2.1:verify (integration-test) @ maven-site-plugin ---
[INFO] -------------------------------------------------
[INFO] Build Summary:
[INFO]   Passed: 56, Failed: 0, Errors: 0, Skipped: 0
[INFO] -------------------------------------------------
[INFO] ------------------------------------------------------------------------
[INFO] BUILD SUCCESS
[INFO] ------------------------------------------------------------------------
[INFO] Total time:  12:26 min
[INFO] Finished at: 2020-02-18T14:52:16-08:00
[INFO] ------------------------------------------------------------------------
[INFO] [jenkins-event-spy] Generated F:\jenkins\jenkins-slave\workspace\ven-box_maven-site-plugin_master@2@2@tmp\withMaven0662ebab\maven-spy-20200218-143949-6038121313798294757756.log
[Pipeline] }
[Pipeline] // dir
[Pipeline] }
[withMaven] artifactsPublisher - Archive artifact windows-jdk11-m3.6.x_build\pom.xml under org\apache\maven\plugins\maven-site-plugin\3.9.0-SNAPSHOT\maven-site-plugin-3.9.0-SNAPSHOT.pom
[withMaven] artifactsPublisher - Archive artifact windows-jdk11-m3.6.x_build\target\maven-site-plugin-3.9.0-SNAPSHOT.jar under org\apache\maven\plugins\maven-site-plugin\3.9.0-SNAPSHOT\maven-site-plugin-3.9.0-SNAPSHOT.jar
[withMaven] junitPublisher - Archive test results for Maven artifact org.apache.maven.plugins:maven-site-plugin:maven-plugin:3.9.0-SNAPSHOT generated by maven-surefire-plugin:test (default-test): windows-jdk11-m3.6.x_build\target\surefire-reports\*.xml
Recording test results
[withMaven] openTasksPublisher - Scan Tasks for Maven artifact org.apache.maven.plugins:maven-site-plugin:maven-plugin:3.9.0-SNAPSHOT in source directory windows-jdk11-m3.6.x_build\src\main\java
[TASKS] Scanning folder 'f:\jenkins\jenkins-slave\workspace\ven-box_maven-site-plugin_master@2@2' for files matching the pattern 'windows-jdk11-m3.6.x_build\src\main\java\**\*' - excludes: null
[TASKS] Found 21 files to scan for tasks
[TASKS] Found 8 open tasks.
Skipping warnings blame since pipelines do not have an SCM link.%n
[TASKS] Computing warning deltas based on reference build #56
[withMaven] invokerPublisher - Archive invoker results for Maven artifact MavenArtifact{org.apache.maven.plugins:maven-site-plugin:maven-plugin:3.9.0-SNAPSHOT(version: 3.9.0-SNAPSHOT, snapshot:false) } generated by PluginInvocation{org.apache.maven.plugins:maven-invoker-plugin:3.2.1@integration-test  integration-test}: windows-jdk11-m3.6.x_build\target\invoker-reports\*.xml
[withMaven] openTasksPublisher - Scan Tasks for Maven artifact org.apache.maven.plugins:maven-site-plugin:maven-plugin:3.9.0-SNAPSHOT in source directory linux-jdk12-m3.6.x_build/src/main/java
[TASKS] Scanning folder '/home/jenkins/jenkins-slave/workspace/ven-box_maven-site-plugin_master@2@2' for files matching the pattern 'linux-jdk12-m3.6.x_build/src/main/java/**/*' - excludes: null
[TASKS] Found 21 files to scan for tasks
[TASKS] Found 8 open tasks.
Skipping warnings blame since pipelines do not have an SCM link.%n
[TASKS] Computing warning deltas based on reference build #56
[withMaven] invokerPublisher - Archive invoker results for Maven artifact MavenArtifact{org.apache.maven.plugins:maven-site-plugin:maven-plugin:3.9.0-SNAPSHOT(version: 3.9.0-SNAPSHOT, snapshot:false) } generated by PluginInvocation{org.apache.maven.plugins:maven-invoker-plugin:3.2.1@integration-test  integration-test}: linux-jdk12-m3.6.x_build/target/invoker-reports/*.xml
[withMaven] Publishers: Generated Artifacts Publisher: 102 ms, Junit Publisher: 82 ms, Open Task Scanner Publisher: 148 ms, Invoker Publisher: 33748 ms, Pipeline Graph Publisher: 1 ms
[Pipeline] // withMaven
[Pipeline] cleanWs
[WS-CLEANUP] Deleting project workspace...
[WS-CLEANUP] Deferred wipeout is used...
[WS-CLEANUP] done
[Pipeline] }
[Pipeline] // stage
[Pipeline] }
[Pipeline] // ws
[Pipeline] }
[Pipeline] // node
[Pipeline] }
[withMaven] Publishers: Generated Artifacts Publisher: 103 ms, Junit Publisher: 85 ms, Open Task Scanner Publisher: 155 ms, Invoker Publisher: 36228 ms, Pipeline Graph Publisher: 33 ms
[Pipeline] // withMaven
[Pipeline] cleanWs
[WS-CLEANUP] Deleting project workspace...
[WS-CLEANUP] Deferred wipeout is used...
[WS-CLEANUP] done
[Pipeline] }
[Pipeline] // stage
[Pipeline] }
[Pipeline] // ws
[Pipeline] }
[Pipeline] // node
[Pipeline] }
[withMaven] Publishers: Generated Artifacts Publisher: 1270 ms, Junit Publisher: 1913 ms, Open Task Scanner Publisher: 1512 ms, Invoker Publisher: 68161 ms, Pipeline Graph Publisher: 1 ms
[Pipeline] // withMaven
[Pipeline] cleanWs
[WS-CLEANUP] Deleting project workspace...
[WS-CLEANUP] Deferred wipeout is used...
[WS-CLEANUP] done
[Pipeline] }
[Pipeline] // stage
[Pipeline] }
[Pipeline] // ws
[Pipeline] }
[Pipeline] // node
[Pipeline] }
[withMaven] Publishers: Generated Artifacts Publisher: 1183 ms, Junit Publisher: 1722 ms, Open Task Scanner Publisher: 1471 ms, Invoker Publisher: 72151 ms, Pipeline Graph Publisher: 2 ms
[Pipeline] // withMaven
[Pipeline] cleanWs
[WS-CLEANUP] Deleting project workspace...
[WS-CLEANUP] Deferred wipeout is used...
[WS-CLEANUP] done
[Pipeline] }
[Pipeline] // stage
[Pipeline] }
[Pipeline] // ws
[Pipeline] }
[Pipeline] // node
[Pipeline] }
[Pipeline] // parallel
[Pipeline] stage
[Pipeline] { (Notifications)
[Pipeline] echo
Build result: FAILURE
[Pipeline] jiraIssueSelector
[Pipeline] jiraComment
[Pipeline] echo
The authors of changes [hboutemy].
[Pipeline] echo
Sending email ...
[Pipeline] emailext