Build failed in Jenkins: Maven TLP » maven-site-plugin » master #43

classic Classic list List threaded Threaded
6 messages Options
Reply | Threaded
Open this post in threaded view
|

Build failed in Jenkins: Maven TLP » maven-site-plugin » master #43

Apache Jenkins Server-2
See https://builds.apache.org/job/maven-box/job/maven-site-plugin/job/master/43/

Changes:

* echo NODE_NAME
* MSITE-851 make output jars reproducible like m-source-p

All tests passed

Build log:
[...truncated 13727 lines...]
Downloaded: http://repo.maven.apache.org/maven2/org/codehaus/plexus/plexus-utils/1.5.9/plexus-utils-1.5.9.pom (6 KB at 303.9 KB/sec)
Downloading: http://repo.maven.apache.org/maven2/org/apache/maven/reporting/maven-reporting-impl/2.0.4.3/maven-reporting-impl-2.0.4.3.pom
Downloaded: http://repo.maven.apache.org/maven2/org/apache/maven/reporting/maven-reporting-impl/2.0.4.3/maven-reporting-impl-2.0.4.3.pom (5 KB at 137.8 KB/sec)
Downloading: http://repo.maven.apache.org/maven2/org/apache/maven/reporting/maven-reporting-impl/2.0.4.3/maven-reporting-impl-2.0.4.3.jar
Downloading: http://repo.maven.apache.org/maven2/org/codehaus/plexus/plexus-utils/1.5.9/plexus-utils-1.5.9.jar
Downloaded: http://repo.maven.apache.org/maven2/org/apache/maven/reporting/maven-reporting-impl/2.0.4.3/maven-reporting-impl-2.0.4.3.jar (21 KB at 1118.5 KB/sec)
Downloaded: http://repo.maven.apache.org/maven2/org/codehaus/plexus/plexus-utils/1.5.9/plexus-utils-1.5.9.jar (263 KB at 6241.3 KB/sec)
[INFO] run post-build script verify.groovy
[INFO]           surefire-report/pom.xml .......................... SUCCESS (12.2 s)
[INFO] Building: MSITE-658/pom.xml
[INFO] run post-build script verify.groovy
[INFO]           site-sd-2\pom.xml ................................ SUCCESS (15.0 s)
[INFO] Building: site-sd-lang\pom.xml
[INFO] run post-build script verify.bsh
[INFO]           MSITE-658/pom.xml ................................ SUCCESS (10.1 s)
[INFO] Building: it-plugin-test/pom.xml
[INFO] run post-build script verify.bsh
[INFO]           site-sd-lang\pom.xml ............................. SUCCESS (11.2 s)
[INFO] Building: site-sd-stagingSiteURL\pom.xml
[INFO] run post-build script verify.groovy
[INFO]           site-sd-stagingSiteURL\pom.xml ................... SUCCESS (7.1 s)
[INFO] Building: site-sd-submodule\pom.xml
[INFO]           it-plugin-test/pom.xml ........................... SUCCESS (11.2 s)
[INFO] Building: default-reports/pom.xml
[INFO] run post-build script verify.groovy
[INFO]           site-sd-submodule\pom.xml ........................ SUCCESS (9.4 s)
[INFO] Building: site-sd-top-parent-different-site\pom.xml
[INFO] run post-build script verify.groovy
[INFO]           default-reports/pom.xml .......................... SUCCESS (11.6 s)
[INFO]
[INFO] --- mrm-maven-plugin:1.2.0:stop (default) @ maven-site-plugin ---
[INFO] Stopping Mock Repository Manager on http://localhost:33251
Nov 02, 2019 5:26:36 PM org.mortbay.log.Slf4jLog info
INFO: Stopped SocketConnector@0.0.0.0:33251
[INFO] Mock Repository Manager http://localhost:33251 is stopped.
[INFO]
[INFO] --- maven-checkstyle-plugin:3.0.0:check (checkstyle-check) @ maven-site-plugin ---
[INFO]
[INFO] --- maven-invoker-plugin:3.1.0:verify (integration-test) @ maven-site-plugin ---
[INFO] -------------------------------------------------
[INFO] Build Summary:
[INFO]   Passed: 53, Failed: 3, Errors: 0, Skipped: 0
[INFO] -------------------------------------------------
[ERROR] The following builds failed:
[ERROR] *  MSITE-512/pom.xml
[ERROR] *  site-jar/pom.xml
[ERROR] *  full-reporting/pom.xml
[INFO] -------------------------------------------------
[INFO] ------------------------------------------------------------------------
[INFO] BUILD FAILURE
[INFO] ------------------------------------------------------------------------
[INFO] Total time: 13:49.975s
[INFO] Finished at: Sat Nov 02 17:26:41 UTC 2019
[INFO] Final Memory: 56M/1399M
[INFO] ------------------------------------------------------------------------
[ERROR] Failed to execute goal org.apache.maven.plugins:maven-invoker-plugin:3.1.0:verify (integration-test) on project maven-site-plugin: 3 builds failed. See console output above for details. -> [Help 1]
org.apache.maven.lifecycle.LifecycleExecutionException: Failed to execute goal org.apache.maven.plugins:maven-invoker-plugin:3.1.0:verify (integration-test) on project maven-site-plugin: 3 builds failed. See console output above for details.
        at org.apache.maven.lifecycle.internal.MojoExecutor.execute(MojoExecutor.java:213)
        at org.apache.maven.lifecycle.internal.MojoExecutor.execute(MojoExecutor.java:153)
        at org.apache.maven.lifecycle.internal.MojoExecutor.execute(MojoExecutor.java:145)
        at org.apache.maven.lifecycle.internal.LifecycleModuleBuilder.buildProject(LifecycleModuleBuilder.java:84)
        at org.apache.maven.lifecycle.internal.LifecycleModuleBuilder.buildProject(LifecycleModuleBuilder.java:59)
        at org.apache.maven.lifecycle.internal.LifecycleStarter.singleThreadedBuild(LifecycleStarter.java:183)
        at org.apache.maven.lifecycle.internal.LifecycleStarter.execute(LifecycleStarter.java:161)
        at org.apache.maven.DefaultMaven.doExecute(DefaultMaven.java:320)
        at org.apache.maven.DefaultMaven.execute(DefaultMaven.java:156)
        at org.apache.maven.cli.MavenCli.execute(MavenCli.java:537)
        at org.apache.maven.cli.MavenCli.doMain(MavenCli.java:196)
        at org.apache.maven.cli.MavenCli.main(MavenCli.java:141)
        at sun.reflect.NativeMethodAccessorImpl.invoke0(Native Method)
        at sun.reflect.NativeMethodAccessorImpl.invoke(NativeMethodAccessorImpl.java:57)
        at sun.reflect.DelegatingMethodAccessorImpl.invoke(DelegatingMethodAccessorImpl.java:43)
        at java.lang.reflect.Method.invoke(Method.java:606)
        at org.codehaus.plexus.classworlds.launcher.Launcher.launchEnhanced(Launcher.java:290)
        at org.codehaus.plexus.classworlds.launcher.Launcher.launch(Launcher.java:230)
        at org.codehaus.plexus.classworlds.launcher.Launcher.mainWithExitCode(Launcher.java:409)
        at org.codehaus.plexus.classworlds.launcher.Launcher.main(Launcher.java:352)
Caused by: org.apache.maven.plugin.MojoFailureException: 3 builds failed. See console output above for details.
        at org.apache.maven.plugins.invoker.InvokerSession.handleFailures(InvokerSession.java:260)
        at org.apache.maven.plugins.invoker.VerifyMojo.execute(VerifyMojo.java:137)
        at org.apache.maven.plugin.DefaultBuildPluginManager.executeMojo(DefaultBuildPluginManager.java:101)
        at org.apache.maven.lifecycle.internal.MojoExecutor.execute(MojoExecutor.java:209)
        ... 19 more
[ERROR]
[ERROR] Re-run Maven using the -X switch to enable full debug logging.
[ERROR]
[ERROR] For more information about the errors and possible solutions, please read the following articles:
[ERROR] [Help 1] http://cwiki.apache.org/confluence/display/MAVEN/MojoFailureException
[Pipeline] }
[Pipeline] // dir
[Pipeline] }
[Pipeline] // withMaven
[Pipeline] cleanWs
[WS-CLEANUP] Deleting project workspace...
[WS-CLEANUP] Deferred wipeout is used...
[WS-CLEANUP] done
[Pipeline] cleanWs
[WS-CLEANUP] Deleting project workspace...
[WS-CLEANUP] Deferred wipeout is used...
[WS-CLEANUP] done
[Pipeline] }
[Pipeline] // stage
[Pipeline] }
[Pipeline] // ws
[Pipeline] }
[Pipeline] // node
[Pipeline] }
Failed in branch linux-jdk7-m3.0.x_build
[INFO] run post-build script verify.groovy
[INFO]           site-sd-top-parent-different-site\pom.xml ........ SUCCESS (9.7 s)
[INFO] Building: site-sd-top-parent-no-site\pom.xml
[INFO] run post-build script verify.groovy
[INFO]           site-sd-top-parent-no-site\pom.xml ............... SUCCESS (11.3 s)
[INFO] Building: site-sd-top-parent-same-site\pom.xml
[INFO] run post-build script verify.groovy
[INFO]           site-sd-top-parent-same-site\pom.xml ............. SUCCESS (9.2 s)
[INFO] Building: site-skip\pom.xml
[INFO] run post-build script verify.bsh
[INFO]           site-skip\pom.xml ................................ SUCCESS (9.6 s)
[INFO] Building: surefire-report\pom.xml
[INFO] run post-build script verify.groovy
[INFO]           surefire-report\pom.xml .......................... SUCCESS (9.7 s)
[INFO] Building: template-skin\pom.xml
[INFO] snapshot org.apache.maven.plugins.site.its:template-skin:1.0-SNAPSHOT: checking for updates from apache-snapshots
[INFO] snapshot org.apache.maven.plugins.site.its:template-skin:1.0-SNAPSHOT: checking for updates from Nexus
[INFO] artifact org.apache.maven.plugins.site.its.template-skin:1.0-SNAPSHOT: checking for updates from central
[INFO] run post-build script verify.bsh
[INFO]           template-skin\pom.xml ............................ SUCCESS (13.0 s)
[INFO] Building: validate\pom.xml
[INFO] run post-build script verify.groovy
[INFO]           validate\pom.xml ................................. SUCCESS (22.9 s)
[INFO]
[INFO] --- mrm-maven-plugin:1.2.0:stop (default) @ maven-site-plugin ---
[INFO] Stopping Mock Repository Manager on http://localhost:63661
[INFO] Stopped SocketConnector@0.0.0.0:63661
[INFO] Mock Repository Manager http://localhost:63661 is stopped.
[INFO]
[INFO] --- maven-checkstyle-plugin:3.0.0:check (checkstyle-check) @ maven-site-plugin ---
[INFO]
[INFO] --- maven-invoker-plugin:3.1.0:verify (integration-test) @ maven-site-plugin ---
[INFO] -------------------------------------------------
[INFO] Build Summary:
[INFO]   Passed: 55, Failed: 1, Errors: 0, Skipped: 0
[INFO] -------------------------------------------------
[ERROR] The following builds failed:
[ERROR] *  site-jar\pom.xml
[INFO] -------------------------------------------------
[INFO] ------------------------------------------------------------------------
[INFO] BUILD FAILURE
[INFO] ------------------------------------------------------------------------
[INFO] Total time:  15:07 min
[INFO] Finished at: 2019-11-02T10:28:03-07:00
[INFO] ------------------------------------------------------------------------
[INFO] [jenkins-event-spy] Generated F:\jenkins\jenkins-slave\workspace\ven-box_maven-site-plugin_master@2@tmp\withMaven6a77a39e\maven-spy-20191102-101255-5957105789720878872725.log
[ERROR] Failed to execute goal org.apache.maven.plugins:maven-invoker-plugin:3.1.0:verify (integration-test) on project maven-site-plugin: 1 build failed. See console output above for details. -> [Help 1]
org.apache.maven.lifecycle.LifecycleExecutionException: Failed to execute goal org.apache.maven.plugins:maven-invoker-plugin:3.1.0:verify (integration-test) on project maven-site-plugin: 1 build failed. See console output above for details.
    at org.apache.maven.lifecycle.internal.MojoExecutor.execute (MojoExecutor.java:215)
    at org.apache.maven.lifecycle.internal.MojoExecutor.execute (MojoExecutor.java:156)
    at org.apache.maven.lifecycle.internal.MojoExecutor.execute (MojoExecutor.java:148)
    at org.apache.maven.lifecycle.internal.LifecycleModuleBuilder.buildProject (LifecycleModuleBuilder.java:117)
    at org.apache.maven.lifecycle.internal.LifecycleModuleBuilder.buildProject (LifecycleModuleBuilder.java:81)
    at org.apache.maven.lifecycle.internal.builder.singlethreaded.SingleThreadedBuilder.build (SingleThreadedBuilder.java:56)
    at org.apache.maven.lifecycle.internal.LifecycleStarter.execute (LifecycleStarter.java:128)
    at org.apache.maven.DefaultMaven.doExecute (DefaultMaven.java:305)
    at org.apache.maven.DefaultMaven.doExecute (DefaultMaven.java:192)
    at org.apache.maven.DefaultMaven.execute (DefaultMaven.java:105)
    at org.apache.maven.cli.MavenCli.execute (MavenCli.java:956)
    at org.apache.maven.cli.MavenCli.doMain (MavenCli.java:288)
    at org.apache.maven.cli.MavenCli.main (MavenCli.java:192)
    at jdk.internal.reflect.NativeMethodAccessorImpl.invoke0 (Native Method)
    at jdk.internal.reflect.NativeMethodAccessorImpl.invoke (NativeMethodAccessorImpl.java:62)
    at jdk.internal.reflect.DelegatingMethodAccessorImpl.invoke (DelegatingMethodAccessorImpl.java:43)
    at java.lang.reflect.Method.invoke (Method.java:566)
    at org.codehaus.plexus.classworlds.launcher.Launcher.launchEnhanced (Launcher.java:282)
    at org.codehaus.plexus.classworlds.launcher.Launcher.launch (Launcher.java:225)
    at org.codehaus.plexus.classworlds.launcher.Launcher.mainWithExitCode (Launcher.java:406)
    at org.codehaus.plexus.classworlds.launcher.Launcher.main (Launcher.java:347)
Caused by: org.apache.maven.plugin.MojoFailureException: 1 build failed. See console output above for details.
    at org.apache.maven.plugins.invoker.InvokerSession.handleFailures (InvokerSession.java:260)
    at org.apache.maven.plugins.invoker.VerifyMojo.execute (VerifyMojo.java:137)
    at org.apache.maven.plugin.DefaultBuildPluginManager.executeMojo (DefaultBuildPluginManager.java:137)
    at org.apache.maven.lifecycle.internal.MojoExecutor.execute (MojoExecutor.java:210)
    at org.apache.maven.lifecycle.internal.MojoExecutor.execute (MojoExecutor.java:156)
    at org.apache.maven.lifecycle.internal.MojoExecutor.execute (MojoExecutor.java:148)
    at org.apache.maven.lifecycle.internal.LifecycleModuleBuilder.buildProject (LifecycleModuleBuilder.java:117)
    at org.apache.maven.lifecycle.internal.LifecycleModuleBuilder.buildProject (LifecycleModuleBuilder.java:81)
    at org.apache.maven.lifecycle.internal.builder.singlethreaded.SingleThreadedBuilder.build (SingleThreadedBuilder.java:56)
    at org.apache.maven.lifecycle.internal.LifecycleStarter.execute (LifecycleStarter.java:128)
    at org.apache.maven.DefaultMaven.doExecute (DefaultMaven.java:305)
    at org.apache.maven.DefaultMaven.doExecute (DefaultMaven.java:192)
    at org.apache.maven.DefaultMaven.execute (DefaultMaven.java:105)
    at org.apache.maven.cli.MavenCli.execute (MavenCli.java:956)
    at org.apache.maven.cli.MavenCli.doMain (MavenCli.java:288)
    at org.apache.maven.cli.MavenCli.main (MavenCli.java:192)
    at jdk.internal.reflect.NativeMethodAccessorImpl.invoke0 (Native Method)
    at jdk.internal.reflect.NativeMethodAccessorImpl.invoke (NativeMethodAccessorImpl.java:62)
    at jdk.internal.reflect.DelegatingMethodAccessorImpl.invoke (DelegatingMethodAccessorImpl.java:43)
    at java.lang.reflect.Method.invoke (Method.java:566)
    at org.codehaus.plexus.classworlds.launcher.Launcher.launchEnhanced (Launcher.java:282)
    at org.codehaus.plexus.classworlds.launcher.Launcher.launch (Launcher.java:225)
    at org.codehaus.plexus.classworlds.launcher.Launcher.mainWithExitCode (Launcher.java:406)
    at org.codehaus.plexus.classworlds.launcher.Launcher.main (Launcher.java:347)
[ERROR]
[ERROR] Re-run Maven using the -X switch to enable full debug logging.
[ERROR]
[ERROR] For more information about the errors and possible solutions, please read the following articles:
[ERROR] [Help 1] http://cwiki.apache.org/confluence/display/MAVEN/MojoFailureException
[Pipeline] }
[Pipeline] // dir
[Pipeline] }
[withMaven] junitPublisher - Archive test results for Maven artifact org.apache.maven.plugins:maven-site-plugin:maven-plugin:3.9.0-SNAPSHOT generated by maven-surefire-plugin:test (default-test): windows-jdk11-m3.6.x_build\target\surefire-reports\*.xml
Recording test results
[withMaven] openTasksPublisher - Scan Tasks for Maven artifact org.apache.maven.plugins:maven-site-plugin:maven-plugin:3.9.0-SNAPSHOT in source directory windows-jdk11-m3.6.x_build\src\main\java
[TASKS] Scanning folder 'f:\jenkins\jenkins-slave\workspace\ven-box_maven-site-plugin_master@2' for files matching the pattern 'windows-jdk11-m3.6.x_build\src\main\java\**\*' - excludes: null
[TASKS] Found 21 files to scan for tasks
[TASKS] Found 8 open tasks.
Skipping warnings blame since pipelines do not have an SCM link.%n
[TASKS] Computing warning deltas based on reference build #42
[withMaven] invokerPublisher - Archive invoker results for Maven artifact MavenArtifact{org.apache.maven.plugins:maven-site-plugin:maven-plugin:3.9.0-SNAPSHOT(version: 3.9.0-SNAPSHOT, snapshot:false) } generated by PluginInvocation{org.apache.maven.plugins:maven-invoker-plugin:3.1.0@integration-test  integration-test}: windows-jdk11-m3.6.x_build\target\invoker-reports\*.xml
[withMaven] Publishers: Generated Artifacts Publisher: 13 ms, Junit Publisher: 86 ms, Open Task Scanner Publisher: 139 ms, Dependencies Fingerprint Publisher: 1 ms, Invoker Publisher: 41552 ms, Pipeline Graph Publisher: 1 ms
[Pipeline] // withMaven
[Pipeline] cleanWs
[WS-CLEANUP] Deleting project workspace...
[WS-CLEANUP] Deferred wipeout is used...
[WS-CLEANUP] done
[Pipeline] cleanWs
[WS-CLEANUP] Deleting project workspace...
[WS-CLEANUP] Deferred wipeout is used...
[WS-CLEANUP] done
[Pipeline] }
[Pipeline] // stage
[Pipeline] }
[Pipeline] // ws
[Pipeline] }
[Pipeline] // node
[Pipeline] }
Failed in branch windows-jdk11-m3.6.x_build
[Pipeline] // parallel
[Pipeline] stage
[Pipeline] { (Notifications)
[Pipeline] echo
Build result: FAILURE
[Pipeline] jiraIssueSelector
[Pipeline] jiraComment
[Pipeline] echo
The authors of changes [hboutemy].
[Pipeline] echo
Sending email ...
[Pipeline] emailext
Reply | Threaded
Open this post in threaded view
|

Build failed in Jenkins: Maven TLP » maven-site-plugin » master #44

Apache Jenkins Server-2
See https://builds.apache.org/job/maven-box/job/maven-site-plugin/job/master/44/

No changes.

All tests passed

Build log:
[...truncated 11655 lines...]
[INFO] -------------------------------------------------
[INFO] Build Summary:
[INFO]   Passed: 55, Failed: 1, Errors: 0, Skipped: 0
[INFO] -------------------------------------------------
[ERROR] The following builds failed:
[ERROR] *  site-jar\pom.xml
[INFO] -------------------------------------------------
[INFO] ------------------------------------------------------------------------
[INFO] BUILD FAILURE
[INFO] ------------------------------------------------------------------------
[INFO] Total time:  12:01 min
[INFO] Finished at: 2019-11-03T03:54:24-08:00
[INFO] ------------------------------------------------------------------------
[INFO] [jenkins-event-spy] Generated F:\jenkins\jenkins-slave\workspace\ven-box_maven-site-plugin_master@2@tmp\withMavene02518a0\maven-spy-20191103-034222-77910530866179057120660.log
[ERROR] Failed to execute goal org.apache.maven.plugins:maven-invoker-plugin:3.1.0:verify (integration-test) on project maven-site-plugin: 1 build failed. See console output above for details. -> [Help 1]
org.apache.maven.lifecycle.LifecycleExecutionException: Failed to execute goal org.apache.maven.plugins:maven-invoker-plugin:3.1.0:verify (integration-test) on project maven-site-plugin: 1 build failed. See console output above for details.
    at org.apache.maven.lifecycle.internal.MojoExecutor.execute (MojoExecutor.java:215)
    at org.apache.maven.lifecycle.internal.MojoExecutor.execute (MojoExecutor.java:156)
    at org.apache.maven.lifecycle.internal.MojoExecutor.execute (MojoExecutor.java:148)
    at org.apache.maven.lifecycle.internal.LifecycleModuleBuilder.buildProject (LifecycleModuleBuilder.java:117)
    at org.apache.maven.lifecycle.internal.LifecycleModuleBuilder.buildProject (LifecycleModuleBuilder.java:81)
    at org.apache.maven.lifecycle.internal.builder.singlethreaded.SingleThreadedBuilder.build (SingleThreadedBuilder.java:56)
    at org.apache.maven.lifecycle.internal.LifecycleStarter.execute (LifecycleStarter.java:128)
    at org.apache.maven.DefaultMaven.doExecute (DefaultMaven.java:305)
    at org.apache.maven.DefaultMaven.doExecute (DefaultMaven.java:192)
    at org.apache.maven.DefaultMaven.execute (DefaultMaven.java:105)
    at org.apache.maven.cli.MavenCli.execute (MavenCli.java:956)
    at org.apache.maven.cli.MavenCli.doMain (MavenCli.java:288)
    at org.apache.maven.cli.MavenCli.main (MavenCli.java:192)
    at jdk.internal.reflect.NativeMethodAccessorImpl.invoke0 (Native Method)
    at jdk.internal.reflect.NativeMethodAccessorImpl.invoke (NativeMethodAccessorImpl.java:62)
    at jdk.internal.reflect.DelegatingMethodAccessorImpl.invoke (DelegatingMethodAccessorImpl.java:43)
    at java.lang.reflect.Method.invoke (Method.java:566)
    at org.codehaus.plexus.classworlds.launcher.Launcher.launchEnhanced (Launcher.java:282)
    at org.codehaus.plexus.classworlds.launcher.Launcher.launch (Launcher.java:225)
    at org.codehaus.plexus.classworlds.launcher.Launcher.mainWithExitCode (Launcher.java:406)
    at org.codehaus.plexus.classworlds.launcher.Launcher.main (Launcher.java:347)
Caused by: org.apache.maven.plugin.MojoFailureException: 1 build failed. See console output above for details.
    at org.apache.maven.plugins.invoker.InvokerSession.handleFailures (InvokerSession.java:260)
    at org.apache.maven.plugins.invoker.VerifyMojo.execute (VerifyMojo.java:137)
    at org.apache.maven.plugin.DefaultBuildPluginManager.executeMojo (DefaultBuildPluginManager.java:137)
    at org.apache.maven.lifecycle.internal.MojoExecutor.execute (MojoExecutor.java:210)
    at org.apache.maven.lifecycle.internal.MojoExecutor.execute (MojoExecutor.java:156)
    at org.apache.maven.lifecycle.internal.MojoExecutor.execute (MojoExecutor.java:148)
    at org.apache.maven.lifecycle.internal.LifecycleModuleBuilder.buildProject (LifecycleModuleBuilder.java:117)
    at org.apache.maven.lifecycle.internal.LifecycleModuleBuilder.buildProject (LifecycleModuleBuilder.java:81)
    at org.apache.maven.lifecycle.internal.builder.singlethreaded.SingleThreadedBuilder.build (SingleThreadedBuilder.java:56)
    at org.apache.maven.lifecycle.internal.LifecycleStarter.execute (LifecycleStarter.java:128)
    at org.apache.maven.DefaultMaven.doExecute (DefaultMaven.java:305)
    at org.apache.maven.DefaultMaven.doExecute (DefaultMaven.java:192)
    at org.apache.maven.DefaultMaven.execute (DefaultMaven.java:105)
    at org.apache.maven.cli.MavenCli.execute (MavenCli.java:956)
    at org.apache.maven.cli.MavenCli.doMain (MavenCli.java:288)
    at org.apache.maven.cli.MavenCli.main (MavenCli.java:192)
    at jdk.internal.reflect.NativeMethodAccessorImpl.invoke0 (Native Method)
    at jdk.internal.reflect.NativeMethodAccessorImpl.invoke (NativeMethodAccessorImpl.java:62)
    at jdk.internal.reflect.DelegatingMethodAccessorImpl.invoke (DelegatingMethodAccessorImpl.java:43)
    at java.lang.reflect.Method.invoke (Method.java:566)
    at org.codehaus.plexus.classworlds.launcher.Launcher.launchEnhanced (Launcher.java:282)
    at org.codehaus.plexus.classworlds.launcher.Launcher.launch (Launcher.java:225)
    at org.codehaus.plexus.classworlds.launcher.Launcher.mainWithExitCode (Launcher.java:406)
    at org.codehaus.plexus.classworlds.launcher.Launcher.main (Launcher.java:347)
[ERROR]
[ERROR] Re-run Maven using the -X switch to enable full debug logging.
[ERROR]
[ERROR] For more information about the errors and possible solutions, please read the following articles:
[ERROR] [Help 1] http://cwiki.apache.org/confluence/display/MAVEN/MojoFailureException
[Pipeline] }
[Pipeline] // dir
[Pipeline] }
[withMaven] junitPublisher - Archive test results for Maven artifact org.apache.maven.plugins:maven-site-plugin:maven-plugin:3.9.0-SNAPSHOT generated by maven-surefire-plugin:test (default-test): windows-jdk11-m3.6.x_build\target\surefire-reports\*.xml
Recording test results
[withMaven] openTasksPublisher - Scan Tasks for Maven artifact org.apache.maven.plugins:maven-site-plugin:maven-plugin:3.9.0-SNAPSHOT in source directory windows-jdk11-m3.6.x_build\src\main\java
[TASKS] Scanning folder 'f:\jenkins\jenkins-slave\workspace\ven-box_maven-site-plugin_master@2' for files matching the pattern 'windows-jdk11-m3.6.x_build\src\main\java\**\*' - excludes: null
[TASKS] Found 21 files to scan for tasks
[TASKS] Found 8 open tasks.
Skipping warnings blame since pipelines do not have an SCM link.%n
[TASKS] Computing warning deltas based on reference build #42
[withMaven] invokerPublisher - Archive invoker results for Maven artifact MavenArtifact{org.apache.maven.plugins:maven-site-plugin:maven-plugin:3.9.0-SNAPSHOT(version: 3.9.0-SNAPSHOT, snapshot:false) } generated by PluginInvocation{org.apache.maven.plugins:maven-invoker-plugin:3.1.0@integration-test  integration-test}: windows-jdk11-m3.6.x_build\target\invoker-reports\*.xml
[INFO] run post-build script verify.groovy
[INFO]           site-sd\pom.xml .................................. SUCCESS (10.6 s)
[INFO] Building: site-sd-2\pom.xml
[INFO] run post-build script verify.groovy
[INFO]           site-sd-2\pom.xml ................................ SUCCESS (14.5 s)
[INFO] Building: site-sd-lang\pom.xml
[withMaven] Publishers: Generated Artifacts Publisher: 11 ms, Junit Publisher: 91 ms, Open Task Scanner Publisher: 113 ms, Dependencies Fingerprint Publisher: 1 ms, Invoker Publisher: 31767 ms, Pipeline Graph Publisher: 1 ms
[Pipeline] // withMaven
[Pipeline] cleanWs
[WS-CLEANUP] Deleting project workspace...
[WS-CLEANUP] Deferred wipeout is used...
[WS-CLEANUP] done
[Pipeline] cleanWs
[WS-CLEANUP] Deleting project workspace...
[WS-CLEANUP] Deferred wipeout is used...
[WS-CLEANUP] done
[Pipeline] }
[Pipeline] // stage
[Pipeline] }
[Pipeline] // ws
[Pipeline] }
[Pipeline] // node
[Pipeline] }
Failed in branch windows-jdk11-m3.6.x_build
[INFO] run post-build script verify.bsh
[INFO]           site-sd-lang\pom.xml ............................. SUCCESS (12.3 s)
[INFO] Building: site-sd-stagingSiteURL\pom.xml
[INFO] run post-build script verify.groovy
[INFO]           site-sd-stagingSiteURL\pom.xml ................... SUCCESS (7.8 s)
[INFO] Building: site-sd-submodule\pom.xml
[INFO] run post-build script verify.groovy
[INFO]           site-sd-submodule\pom.xml ........................ SUCCESS (9.8 s)
[INFO] Building: site-sd-top-parent-different-site\pom.xml
[INFO] run post-build script verify.groovy
[INFO]           site-sd-top-parent-different-site\pom.xml ........ SUCCESS (9.4 s)
[INFO] Building: site-sd-top-parent-no-site\pom.xml
[INFO] run post-build script verify.groovy
[INFO]           site-sd-top-parent-no-site\pom.xml ............... SUCCESS (10.4 s)
[INFO] Building: site-sd-top-parent-same-site\pom.xml
[INFO] run post-build script verify.groovy
[INFO]           site-sd-top-parent-same-site\pom.xml ............. SUCCESS (9.9 s)
[INFO] Building: site-skip\pom.xml
[INFO] run post-build script verify.bsh
[INFO]           site-skip\pom.xml ................................ SUCCESS (9.9 s)
[INFO] Building: surefire-report\pom.xml
[INFO] run post-build script verify.groovy
[INFO]           surefire-report\pom.xml .......................... SUCCESS (9.5 s)
[INFO] Building: template-skin\pom.xml
[INFO] run post-build script verify.bsh
[INFO]           template-skin\pom.xml ............................ SUCCESS (13.0 s)
[INFO] Building: validate\pom.xml
[INFO] run post-build script verify.groovy
[INFO]           validate\pom.xml ................................. SUCCESS (7.2 s)
[INFO]
[INFO] --- mrm-maven-plugin:1.2.0:stop (default) @ maven-site-plugin ---
[INFO] Stopping Mock Repository Manager on http://localhost:62148
[INFO] Stopped SocketConnector@0.0.0.0:62148
[INFO] Mock Repository Manager http://localhost:62148 is stopped.
[INFO]
[INFO] --- maven-checkstyle-plugin:3.0.0:check (checkstyle-check) @ maven-site-plugin ---
[INFO]
[INFO] --- maven-invoker-plugin:3.1.0:verify (integration-test) @ maven-site-plugin ---
[INFO] -------------------------------------------------
[INFO] Build Summary:
[INFO]   Passed: 55, Failed: 1, Errors: 0, Skipped: 0
[INFO] -------------------------------------------------
[ERROR] The following builds failed:
[ERROR] *  site-jar\pom.xml
[INFO] -------------------------------------------------
[INFO] ------------------------------------------------------------------------
[INFO] BUILD FAILURE
[INFO] ------------------------------------------------------------------------
[INFO] Total time:  12:45 min
[INFO] Finished at: 2019-11-03T03:56:26-08:00
[INFO] ------------------------------------------------------------------------
[INFO] [jenkins-event-spy] Generated F:\jenkins\jenkins-slave\workspace\ven-box_maven-site-plugin_master@2@tmp\withMavenbf94c6f6\maven-spy-20191103-034340-44911354279738013141078.log
[ERROR] Failed to execute goal org.apache.maven.plugins:maven-invoker-plugin:3.1.0:verify (integration-test) on project maven-site-plugin: 1 build failed. See console output above for details. -> [Help 1]
org.apache.maven.lifecycle.LifecycleExecutionException: Failed to execute goal org.apache.maven.plugins:maven-invoker-plugin:3.1.0:verify (integration-test) on project maven-site-plugin: 1 build failed. See console output above for details.
    at org.apache.maven.lifecycle.internal.MojoExecutor.execute (MojoExecutor.java:215)
    at org.apache.maven.lifecycle.internal.MojoExecutor.execute (MojoExecutor.java:156)
    at org.apache.maven.lifecycle.internal.MojoExecutor.execute (MojoExecutor.java:148)
    at org.apache.maven.lifecycle.internal.LifecycleModuleBuilder.buildProject (LifecycleModuleBuilder.java:117)
    at org.apache.maven.lifecycle.internal.LifecycleModuleBuilder.buildProject (LifecycleModuleBuilder.java:81)
    at org.apache.maven.lifecycle.internal.builder.singlethreaded.SingleThreadedBuilder.build (SingleThreadedBuilder.java:56)
    at org.apache.maven.lifecycle.internal.LifecycleStarter.execute (LifecycleStarter.java:128)
    at org.apache.maven.DefaultMaven.doExecute (DefaultMaven.java:305)
    at org.apache.maven.DefaultMaven.doExecute (DefaultMaven.java:192)
    at org.apache.maven.DefaultMaven.execute (DefaultMaven.java:105)
    at org.apache.maven.cli.MavenCli.execute (MavenCli.java:956)
    at org.apache.maven.cli.MavenCli.doMain (MavenCli.java:288)
    at org.apache.maven.cli.MavenCli.main (MavenCli.java:192)
    at jdk.internal.reflect.NativeMethodAccessorImpl.invoke0 (Native Method)
    at jdk.internal.reflect.NativeMethodAccessorImpl.invoke (NativeMethodAccessorImpl.java:62)
    at jdk.internal.reflect.DelegatingMethodAccessorImpl.invoke (DelegatingMethodAccessorImpl.java:43)
    at java.lang.reflect.Method.invoke (Method.java:567)
    at org.codehaus.plexus.classworlds.launcher.Launcher.launchEnhanced (Launcher.java:282)
    at org.codehaus.plexus.classworlds.launcher.Launcher.launch (Launcher.java:225)
    at org.codehaus.plexus.classworlds.launcher.Launcher.mainWithExitCode (Launcher.java:406)
    at org.codehaus.plexus.classworlds.launcher.Launcher.main (Launcher.java:347)
Caused by: org.apache.maven.plugin.MojoFailureException: 1 build failed. See console output above for details.
    at org.apache.maven.plugins.invoker.InvokerSession.handleFailures (InvokerSession.java:260)
    at org.apache.maven.plugins.invoker.VerifyMojo.execute (VerifyMojo.java:137)
    at org.apache.maven.plugin.DefaultBuildPluginManager.executeMojo (DefaultBuildPluginManager.java:137)
    at org.apache.maven.lifecycle.internal.MojoExecutor.execute (MojoExecutor.java:210)
    at org.apache.maven.lifecycle.internal.MojoExecutor.execute (MojoExecutor.java:156)
    at org.apache.maven.lifecycle.internal.MojoExecutor.execute (MojoExecutor.java:148)
    at org.apache.maven.lifecycle.internal.LifecycleModuleBuilder.buildProject (LifecycleModuleBuilder.java:117)
    at org.apache.maven.lifecycle.internal.LifecycleModuleBuilder.buildProject (LifecycleModuleBuilder.java:81)
    at org.apache.maven.lifecycle.internal.builder.singlethreaded.SingleThreadedBuilder.build (SingleThreadedBuilder.java:56)
    at org.apache.maven.lifecycle.internal.LifecycleStarter.execute (LifecycleStarter.java:128)
    at org.apache.maven.DefaultMaven.doExecute (DefaultMaven.java:305)
    at org.apache.maven.DefaultMaven.doExecute (DefaultMaven.java:192)
    at org.apache.maven.DefaultMaven.execute (DefaultMaven.java:105)
    at org.apache.maven.cli.MavenCli.execute (MavenCli.java:956)
    at org.apache.maven.cli.MavenCli.doMain (MavenCli.java:288)
    at org.apache.maven.cli.MavenCli.main (MavenCli.java:192)
    at jdk.internal.reflect.NativeMethodAccessorImpl.invoke0 (Native Method)
    at jdk.internal.reflect.NativeMethodAccessorImpl.invoke (NativeMethodAccessorImpl.java:62)
    at jdk.internal.reflect.DelegatingMethodAccessorImpl.invoke (DelegatingMethodAccessorImpl.java:43)
    at java.lang.reflect.Method.invoke (Method.java:567)
    at org.codehaus.plexus.classworlds.launcher.Launcher.launchEnhanced (Launcher.java:282)
    at org.codehaus.plexus.classworlds.launcher.Launcher.launch (Launcher.java:225)
    at org.codehaus.plexus.classworlds.launcher.Launcher.mainWithExitCode (Launcher.java:406)
    at org.codehaus.plexus.classworlds.launcher.Launcher.main (Launcher.java:347)
[ERROR]
[ERROR] Re-run Maven using the -X switch to enable full debug logging.
[ERROR]
[ERROR] For more information about the errors and possible solutions, please read the following articles:
[ERROR] [Help 1] http://cwiki.apache.org/confluence/display/MAVEN/MojoFailureException
[Pipeline] }
[Pipeline] // dir
[Pipeline] }
[withMaven] junitPublisher - Archive test results for Maven artifact org.apache.maven.plugins:maven-site-plugin:maven-plugin:3.9.0-SNAPSHOT generated by maven-surefire-plugin:test (default-test): windows-jdk12-m3.6.x_build\target\surefire-reports\*.xml
Recording test results
[withMaven] openTasksPublisher - Scan Tasks for Maven artifact org.apache.maven.plugins:maven-site-plugin:maven-plugin:3.9.0-SNAPSHOT in source directory windows-jdk12-m3.6.x_build\src\main\java
[TASKS] Scanning folder 'f:\jenkins\jenkins-slave\workspace\ven-box_maven-site-plugin_master@2' for files matching the pattern 'windows-jdk12-m3.6.x_build\src\main\java\**\*' - excludes: null
[TASKS] Found 21 files to scan for tasks
[TASKS] Found 8 open tasks.
Skipping warnings blame since pipelines do not have an SCM link.%n
[TASKS] Computing warning deltas based on reference build #42
[withMaven] invokerPublisher - Archive invoker results for Maven artifact MavenArtifact{org.apache.maven.plugins:maven-site-plugin:maven-plugin:3.9.0-SNAPSHOT(version: 3.9.0-SNAPSHOT, snapshot:false) } generated by PluginInvocation{org.apache.maven.plugins:maven-invoker-plugin:3.1.0@integration-test  integration-test}: windows-jdk12-m3.6.x_build\target\invoker-reports\*.xml
[withMaven] Publishers: Generated Artifacts Publisher: 11 ms, Junit Publisher: 79 ms, Open Task Scanner Publisher: 138 ms, Dependencies Fingerprint Publisher: 1 ms, Invoker Publisher: 38919 ms
[Pipeline] // withMaven
[Pipeline] cleanWs
[WS-CLEANUP] Deleting project workspace...
[WS-CLEANUP] Deferred wipeout is used...
[WS-CLEANUP] done
[Pipeline] cleanWs
[WS-CLEANUP] Deleting project workspace...
[WS-CLEANUP] Deferred wipeout is used...
[WS-CLEANUP] done
[Pipeline] }
[Pipeline] // stage
[Pipeline] }
[Pipeline] // ws
[Pipeline] }
[Pipeline] // node
[Pipeline] }
Failed in branch windows-jdk12-m3.6.x_build
[Pipeline] // parallel
[Pipeline] stage
[Pipeline] { (Notifications)
[Pipeline] echo
Build result: FAILURE
[Pipeline] jiraIssueSelector
[Pipeline] echo
The authors of changes [].
[Pipeline] echo
Sending email ...
[Pipeline] emailext
Reply | Threaded
Open this post in threaded view
|

Build failed in Jenkins: Maven TLP » maven-site-plugin » master #45

Apache Jenkins Server-2
See https://builds.apache.org/job/maven-box/job/maven-site-plugin/job/master/45/

Changes:

* upgraded Jetty

All tests passed

Build log:
[...truncated 12396 lines...]
[INFO] run post-build script verify.groovy
[INFO]           site-sd-top-parent-no-site\pom.xml ............... SUCCESS (11.3 s)
[INFO] Building: site-sd-top-parent-same-site\pom.xml
[INFO]           MSITE-665/pom.xml ................................ SUCCESS (18.4 s)
[INFO] Building: MSITE-723/pom.xml
[withMaven] Publishers: Generated Artifacts Publisher: 13 ms, Junit Publisher: 90 ms, Open Task Scanner Publisher: 146 ms, Dependencies Fingerprint Publisher: 1 ms, Invoker Publisher: 35349 ms
[Pipeline] // withMaven
[Pipeline] cleanWs
[WS-CLEANUP] Deleting project workspace...
[WS-CLEANUP] Deferred wipeout is used...
[WS-CLEANUP] done
[Pipeline] cleanWs
[WS-CLEANUP] Deleting project workspace...
[WS-CLEANUP] Deferred wipeout is used...
[WS-CLEANUP] done
[Pipeline] }
[Pipeline] // stage
[Pipeline] }
[Pipeline] // ws
[Pipeline] }
[Pipeline] // node
[Pipeline] }
Failed in branch windows-jdk11-m3.6.x_build
[INFO] run post-build script verify.groovy
[INFO]           site-sd-top-parent-same-site\pom.xml ............. SUCCESS (8.3 s)
[INFO] Building: site-skip\pom.xml
[INFO] run post-build script verify.groovy
[INFO]           MSITE-723/pom.xml ................................ SUCCESS (10.1 s)
[INFO] Building: surefire-report/pom.xml
[INFO] run post-build script verify.bsh
[INFO]           site-skip\pom.xml ................................ SUCCESS (8.5 s)
[INFO] Building: surefire-report\pom.xml
[INFO] run post-build script verify.groovy
[INFO]           surefire-report/pom.xml .......................... SUCCESS (12.3 s)
[INFO] Building: MSITE-658/pom.xml
[INFO] run post-build script verify.groovy
[INFO]           surefire-report\pom.xml .......................... SUCCESS (8.7 s)
[INFO] Building: template-skin\pom.xml
[INFO] run post-build script verify.bsh
[INFO]           MSITE-658/pom.xml ................................ SUCCESS (9.9 s)
[INFO] Building: it-plugin-test/pom.xml
[INFO] snapshot org.apache.maven.plugins.site.its:template-skin:1.0-SNAPSHOT: checking for updates from apache-snapshots
[INFO] snapshot org.apache.maven.plugins.site.its:template-skin:1.0-SNAPSHOT: checking for updates from Nexus
[INFO] artifact org.apache.maven.plugins.site.its.template-skin:1.0-SNAPSHOT: checking for updates from central
[INFO] run post-build script verify.bsh
[INFO]           template-skin\pom.xml ............................ SUCCESS (13.4 s)
[INFO] Building: validate\pom.xml
[INFO]           it-plugin-test/pom.xml ........................... SUCCESS (11.4 s)
[INFO] Building: default-reports/pom.xml
[INFO] run post-build script verify.groovy
[INFO]           validate\pom.xml ................................. SUCCESS (6.8 s)
[INFO]
[INFO] --- mrm-maven-plugin:1.2.0:stop (default) @ maven-site-plugin ---
[INFO] Stopping Mock Repository Manager on http://localhost:63614
[INFO] Stopped SocketConnector@0.0.0.0:63614
[INFO] Mock Repository Manager http://localhost:63614 is stopped.
[INFO]
[INFO] --- maven-checkstyle-plugin:3.0.0:check (checkstyle-check) @ maven-site-plugin ---
[INFO]
[INFO] --- maven-invoker-plugin:3.1.0:verify (integration-test) @ maven-site-plugin ---
[INFO] -------------------------------------------------
[INFO] Build Summary:
[INFO]   Passed: 55, Failed: 1, Errors: 0, Skipped: 0
[INFO] -------------------------------------------------
[ERROR] The following builds failed:
[ERROR] *  site-jar\pom.xml
[INFO] -------------------------------------------------
[INFO] ------------------------------------------------------------------------
[INFO] BUILD FAILURE
[INFO] ------------------------------------------------------------------------
[INFO] Total time:  13:35 min
[INFO] Finished at: 2019-11-09T06:58:11-08:00
[INFO] ------------------------------------------------------------------------
[INFO] [jenkins-event-spy] Generated F:\jenkins\jenkins-slave\workspace\ven-box_maven-site-plugin_master@2@tmp\withMaven2c81040b\maven-spy-20191109-064435-9863833066668625530038.log
[ERROR] Failed to execute goal org.apache.maven.plugins:maven-invoker-plugin:3.1.0:verify (integration-test) on project maven-site-plugin: 1 build failed. See console output above for details. -> [Help 1]
org.apache.maven.lifecycle.LifecycleExecutionException: Failed to execute goal org.apache.maven.plugins:maven-invoker-plugin:3.1.0:verify (integration-test) on project maven-site-plugin: 1 build failed. See console output above for details.
    at org.apache.maven.lifecycle.internal.MojoExecutor.execute (MojoExecutor.java:215)
    at org.apache.maven.lifecycle.internal.MojoExecutor.execute (MojoExecutor.java:156)
    at org.apache.maven.lifecycle.internal.MojoExecutor.execute (MojoExecutor.java:148)
    at org.apache.maven.lifecycle.internal.LifecycleModuleBuilder.buildProject (LifecycleModuleBuilder.java:117)
    at org.apache.maven.lifecycle.internal.LifecycleModuleBuilder.buildProject (LifecycleModuleBuilder.java:81)
    at org.apache.maven.lifecycle.internal.builder.singlethreaded.SingleThreadedBuilder.build (SingleThreadedBuilder.java:56)
    at org.apache.maven.lifecycle.internal.LifecycleStarter.execute (LifecycleStarter.java:128)
    at org.apache.maven.DefaultMaven.doExecute (DefaultMaven.java:305)
    at org.apache.maven.DefaultMaven.doExecute (DefaultMaven.java:192)
    at org.apache.maven.DefaultMaven.execute (DefaultMaven.java:105)
    at org.apache.maven.cli.MavenCli.execute (MavenCli.java:956)
    at org.apache.maven.cli.MavenCli.doMain (MavenCli.java:288)
    at org.apache.maven.cli.MavenCli.main (MavenCli.java:192)
    at jdk.internal.reflect.NativeMethodAccessorImpl.invoke0 (Native Method)
    at jdk.internal.reflect.NativeMethodAccessorImpl.invoke (NativeMethodAccessorImpl.java:62)
    at jdk.internal.reflect.DelegatingMethodAccessorImpl.invoke (DelegatingMethodAccessorImpl.java:43)
    at java.lang.reflect.Method.invoke (Method.java:567)
    at org.codehaus.plexus.classworlds.launcher.Launcher.launchEnhanced (Launcher.java:282)
    at org.codehaus.plexus.classworlds.launcher.Launcher.launch (Launcher.java:225)
    at org.codehaus.plexus.classworlds.launcher.Launcher.mainWithExitCode (Launcher.java:406)
    at org.codehaus.plexus.classworlds.launcher.Launcher.main (Launcher.java:347)
Caused by: org.apache.maven.plugin.MojoFailureException: 1 build failed. See console output above for details.
    at org.apache.maven.plugins.invoker.InvokerSession.handleFailures (InvokerSession.java:260)
    at org.apache.maven.plugins.invoker.VerifyMojo.execute (VerifyMojo.java:137)
    at org.apache.maven.plugin.DefaultBuildPluginManager.executeMojo (DefaultBuildPluginManager.java:137)
    at org.apache.maven.lifecycle.internal.MojoExecutor.execute (MojoExecutor.java:210)
    at org.apache.maven.lifecycle.internal.MojoExecutor.execute (MojoExecutor.java:156)
    at org.apache.maven.lifecycle.internal.MojoExecutor.execute (MojoExecutor.java:148)
    at org.apache.maven.lifecycle.internal.LifecycleModuleBuilder.buildProject (LifecycleModuleBuilder.java:117)
    at org.apache.maven.lifecycle.internal.LifecycleModuleBuilder.buildProject (LifecycleModuleBuilder.java:81)
    at org.apache.maven.lifecycle.internal.builder.singlethreaded.SingleThreadedBuilder.build (SingleThreadedBuilder.java:56)
    at org.apache.maven.lifecycle.internal.LifecycleStarter.execute (LifecycleStarter.java:128)
    at org.apache.maven.DefaultMaven.doExecute (DefaultMaven.java:305)
    at org.apache.maven.DefaultMaven.doExecute (DefaultMaven.java:192)
    at org.apache.maven.DefaultMaven.execute (DefaultMaven.java:105)
    at org.apache.maven.cli.MavenCli.execute (MavenCli.java:956)
    at org.apache.maven.cli.MavenCli.doMain (MavenCli.java:288)
    at org.apache.maven.cli.MavenCli.main (MavenCli.java:192)
    at jdk.internal.reflect.NativeMethodAccessorImpl.invoke0 (Native Method)
    at jdk.internal.reflect.NativeMethodAccessorImpl.invoke (NativeMethodAccessorImpl.java:62)
    at jdk.internal.reflect.DelegatingMethodAccessorImpl.invoke (DelegatingMethodAccessorImpl.java:43)
    at java.lang.reflect.Method.invoke (Method.java:567)
    at org.codehaus.plexus.classworlds.launcher.Launcher.launchEnhanced (Launcher.java:282)
    at org.codehaus.plexus.classworlds.launcher.Launcher.launch (Launcher.java:225)
    at org.codehaus.plexus.classworlds.launcher.Launcher.mainWithExitCode (Launcher.java:406)
    at org.codehaus.plexus.classworlds.launcher.Launcher.main (Launcher.java:347)
[ERROR]
[ERROR] Re-run Maven using the -X switch to enable full debug logging.
[ERROR]
[ERROR] For more information about the errors and possible solutions, please read the following articles:
[ERROR] [Help 1] http://cwiki.apache.org/confluence/display/MAVEN/MojoFailureException
[Pipeline] }
[Pipeline] // dir
[Pipeline] }
[withMaven] junitPublisher - Archive test results for Maven artifact org.apache.maven.plugins:maven-site-plugin:maven-plugin:3.9.0-SNAPSHOT generated by maven-surefire-plugin:test (default-test): windows-jdk12-m3.6.x_build\target\surefire-reports\*.xml
Recording test results
[withMaven] openTasksPublisher - Scan Tasks for Maven artifact org.apache.maven.plugins:maven-site-plugin:maven-plugin:3.9.0-SNAPSHOT in source directory windows-jdk12-m3.6.x_build\src\main\java
[TASKS] Scanning folder 'f:\jenkins\jenkins-slave\workspace\ven-box_maven-site-plugin_master@2' for files matching the pattern 'windows-jdk12-m3.6.x_build\src\main\java\**\*' - excludes: null
[TASKS] Found 21 files to scan for tasks
[TASKS] Found 8 open tasks.
Skipping warnings blame since pipelines do not have an SCM link.%n
[TASKS] Computing warning deltas based on reference build #42
[withMaven] invokerPublisher - Archive invoker results for Maven artifact MavenArtifact{org.apache.maven.plugins:maven-site-plugin:maven-plugin:3.9.0-SNAPSHOT(version: 3.9.0-SNAPSHOT, snapshot:false) } generated by PluginInvocation{org.apache.maven.plugins:maven-invoker-plugin:3.1.0@integration-test  integration-test}: windows-jdk12-m3.6.x_build\target\invoker-reports\*.xml
[INFO] run post-build script verify.groovy
[INFO]           default-reports/pom.xml .......................... SUCCESS (11.5 s)
[INFO]
[INFO] --- mrm-maven-plugin:1.2.0:stop (default) @ maven-site-plugin ---
[INFO] Stopping Mock Repository Manager on http://localhost:43127
Nov 09, 2019 2:58:17 PM org.mortbay.log.Slf4jLog info
INFO: Stopped SocketConnector@0.0.0.0:43127
[INFO] Mock Repository Manager http://localhost:43127 is stopped.
[INFO]
[INFO] --- maven-checkstyle-plugin:3.0.0:check (checkstyle-check) @ maven-site-plugin ---
[INFO]
[INFO] --- maven-invoker-plugin:3.1.0:verify (integration-test) @ maven-site-plugin ---
[INFO] -------------------------------------------------
[INFO] Build Summary:
[INFO]   Passed: 53, Failed: 3, Errors: 0, Skipped: 0
[INFO] -------------------------------------------------
[ERROR] The following builds failed:
[ERROR] *  MSITE-512/pom.xml
[ERROR] *  site-jar/pom.xml
[ERROR] *  full-reporting/pom.xml
[INFO] -------------------------------------------------
[INFO] ------------------------------------------------------------------------
[INFO] BUILD FAILURE
[INFO] ------------------------------------------------------------------------
[INFO] Total time: 13:47.418s
[INFO] Finished at: Sat Nov 09 14:58:22 UTC 2019
[INFO] Final Memory: 53M/1407M
[INFO] ------------------------------------------------------------------------
[ERROR] Failed to execute goal org.apache.maven.plugins:maven-invoker-plugin:3.1.0:verify (integration-test) on project maven-site-plugin: 3 builds failed. See console output above for details. -> [Help 1]
org.apache.maven.lifecycle.LifecycleExecutionException: Failed to execute goal org.apache.maven.plugins:maven-invoker-plugin:3.1.0:verify (integration-test) on project maven-site-plugin: 3 builds failed. See console output above for details.
        at org.apache.maven.lifecycle.internal.MojoExecutor.execute(MojoExecutor.java:213)
        at org.apache.maven.lifecycle.internal.MojoExecutor.execute(MojoExecutor.java:153)
        at org.apache.maven.lifecycle.internal.MojoExecutor.execute(MojoExecutor.java:145)
        at org.apache.maven.lifecycle.internal.LifecycleModuleBuilder.buildProject(LifecycleModuleBuilder.java:84)
        at org.apache.maven.lifecycle.internal.LifecycleModuleBuilder.buildProject(LifecycleModuleBuilder.java:59)
        at org.apache.maven.lifecycle.internal.LifecycleStarter.singleThreadedBuild(LifecycleStarter.java:183)
        at org.apache.maven.lifecycle.internal.LifecycleStarter.execute(LifecycleStarter.java:161)
        at org.apache.maven.DefaultMaven.doExecute(DefaultMaven.java:320)
        at org.apache.maven.DefaultMaven.execute(DefaultMaven.java:156)
        at org.apache.maven.cli.MavenCli.execute(MavenCli.java:537)
        at org.apache.maven.cli.MavenCli.doMain(MavenCli.java:196)
        at org.apache.maven.cli.MavenCli.main(MavenCli.java:141)
        at sun.reflect.NativeMethodAccessorImpl.invoke0(Native Method)
        at sun.reflect.NativeMethodAccessorImpl.invoke(NativeMethodAccessorImpl.java:57)
        at sun.reflect.DelegatingMethodAccessorImpl.invoke(DelegatingMethodAccessorImpl.java:43)
        at java.lang.reflect.Method.invoke(Method.java:606)
        at org.codehaus.plexus.classworlds.launcher.Launcher.launchEnhanced(Launcher.java:290)
        at org.codehaus.plexus.classworlds.launcher.Launcher.launch(Launcher.java:230)
        at org.codehaus.plexus.classworlds.launcher.Launcher.mainWithExitCode(Launcher.java:409)
        at org.codehaus.plexus.classworlds.launcher.Launcher.main(Launcher.java:352)
Caused by: org.apache.maven.plugin.MojoFailureException: 3 builds failed. See console output above for details.
        at org.apache.maven.plugins.invoker.InvokerSession.handleFailures(InvokerSession.java:260)
        at org.apache.maven.plugins.invoker.VerifyMojo.execute(VerifyMojo.java:137)
        at org.apache.maven.plugin.DefaultBuildPluginManager.executeMojo(DefaultBuildPluginManager.java:101)
        at org.apache.maven.lifecycle.internal.MojoExecutor.execute(MojoExecutor.java:209)
        ... 19 more
[ERROR]
[ERROR] Re-run Maven using the -X switch to enable full debug logging.
[ERROR]
[ERROR] For more information about the errors and possible solutions, please read the following articles:
[ERROR] [Help 1] http://cwiki.apache.org/confluence/display/MAVEN/MojoFailureException
[Pipeline] }
[Pipeline] // dir
[Pipeline] }
[Pipeline] // withMaven
[Pipeline] cleanWs
[WS-CLEANUP] Deleting project workspace...
[WS-CLEANUP] Deferred wipeout is used...
[WS-CLEANUP] done
[Pipeline] cleanWs
[WS-CLEANUP] Deleting project workspace...
[WS-CLEANUP] Deferred wipeout is used...
[WS-CLEANUP] done
[Pipeline] }
[Pipeline] // stage
[Pipeline] }
[Pipeline] // ws
[Pipeline] }
[Pipeline] // node
[Pipeline] }
Failed in branch linux-jdk7-m3.0.x_build
[withMaven] Publishers: Generated Artifacts Publisher: 34 ms, Junit Publisher: 264 ms, Open Task Scanner Publisher: 143 ms, Dependencies Fingerprint Publisher: 1 ms, Invoker Publisher: 42886 ms
[Pipeline] // withMaven
[Pipeline] cleanWs
[WS-CLEANUP] Deleting project workspace...
[WS-CLEANUP] Deferred wipeout is used...
[WS-CLEANUP] done
[Pipeline] cleanWs
[WS-CLEANUP] Deleting project workspace...
[WS-CLEANUP] Deferred wipeout is used...
[WS-CLEANUP] done
[Pipeline] }
[Pipeline] // stage
[Pipeline] }
[Pipeline] // ws
[Pipeline] }
[Pipeline] // node
[Pipeline] }
Failed in branch windows-jdk12-m3.6.x_build
[Pipeline] // parallel
[Pipeline] stage
[Pipeline] { (Notifications)
[Pipeline] echo
Build result: FAILURE
[Pipeline] jiraIssueSelector
[Pipeline] echo
The authors of changes [hboutemy].
[Pipeline] echo
Sending email ...
[Pipeline] emailext
Reply | Threaded
Open this post in threaded view
|

Build failed in Jenkins: Maven TLP » maven-site-plugin » master #46

Apache Jenkins Server-2
See https://builds.apache.org/job/maven-box/job/maven-site-plugin/job/master/46/

Changes:

* remove plugins versions override

All tests passed

Build log:
[...truncated 11975 lines...]
[Pipeline] // ws
[Pipeline] }
[Pipeline] // node
[Pipeline] }
Failed in branch windows-jdk7-m3.5.x_build
[INFO] run post-build script verify.bsh
[INFO]           template-skin\pom.xml ............................ SUCCESS (13.4 s)
[INFO] Building: validate\pom.xml
[INFO] run post-build script verify.groovy
[INFO]           site-sd-stagingSiteURL/pom.xml ................... SUCCESS (11.5 s)
[INFO] Building: MSITE-548/pom.xml
[INFO] run post-build script verify.groovy
[INFO]           validate\pom.xml ................................. SUCCESS (6.3 s)
[INFO]
[INFO] --- mrm-maven-plugin:1.2.0:stop (default) @ maven-site-plugin ---
[INFO] Stopping Mock Repository Manager on http://localhost:53261
[INFO] Stopped SocketConnector@0.0.0.0:53261
[INFO] Mock Repository Manager http://localhost:53261 is stopped.
[INFO]
[INFO] --- maven-checkstyle-plugin:3.0.0:check (checkstyle-check) @ maven-site-plugin ---
[INFO]
[INFO] --- maven-invoker-plugin:3.1.0:verify (integration-test) @ maven-site-plugin ---
[INFO] -------------------------------------------------
[INFO] Build Summary:
[INFO]   Passed: 55, Failed: 1, Errors: 0, Skipped: 0
[INFO] -------------------------------------------------
[ERROR] The following builds failed:
[ERROR] *  site-jar\pom.xml
[INFO] -------------------------------------------------
[INFO] ------------------------------------------------------------------------
[INFO] BUILD FAILURE
[INFO] ------------------------------------------------------------------------
[INFO] Total time:  11:59 min
[INFO] Finished at: 2019-11-09T08:32:53-08:00
[INFO] ------------------------------------------------------------------------
[INFO] [jenkins-event-spy] Generated F:\jenkins\jenkins-slave\workspace\ven-box_maven-site-plugin_master@2@tmp\withMavencb7eb530\maven-spy-20191109-082053-56948771632095651222.log
[ERROR] Failed to execute goal org.apache.maven.plugins:maven-invoker-plugin:3.1.0:verify (integration-test) on project maven-site-plugin: 1 build failed. See console output above for details. -> [Help 1]
org.apache.maven.lifecycle.LifecycleExecutionException: Failed to execute goal org.apache.maven.plugins:maven-invoker-plugin:3.1.0:verify (integration-test) on project maven-site-plugin: 1 build failed. See console output above for details.
    at org.apache.maven.lifecycle.internal.MojoExecutor.execute (MojoExecutor.java:215)
    at org.apache.maven.lifecycle.internal.MojoExecutor.execute (MojoExecutor.java:156)
    at org.apache.maven.lifecycle.internal.MojoExecutor.execute (MojoExecutor.java:148)
    at org.apache.maven.lifecycle.internal.LifecycleModuleBuilder.buildProject (LifecycleModuleBuilder.java:117)
    at org.apache.maven.lifecycle.internal.LifecycleModuleBuilder.buildProject (LifecycleModuleBuilder.java:81)
    at org.apache.maven.lifecycle.internal.builder.singlethreaded.SingleThreadedBuilder.build (SingleThreadedBuilder.java:56)
    at org.apache.maven.lifecycle.internal.LifecycleStarter.execute (LifecycleStarter.java:128)
    at org.apache.maven.DefaultMaven.doExecute (DefaultMaven.java:305)
    at org.apache.maven.DefaultMaven.doExecute (DefaultMaven.java:192)
    at org.apache.maven.DefaultMaven.execute (DefaultMaven.java:105)
    at org.apache.maven.cli.MavenCli.execute (MavenCli.java:956)
    at org.apache.maven.cli.MavenCli.doMain (MavenCli.java:288)
    at org.apache.maven.cli.MavenCli.main (MavenCli.java:192)
    at jdk.internal.reflect.NativeMethodAccessorImpl.invoke0 (Native Method)
    at jdk.internal.reflect.NativeMethodAccessorImpl.invoke (NativeMethodAccessorImpl.java:62)
    at jdk.internal.reflect.DelegatingMethodAccessorImpl.invoke (DelegatingMethodAccessorImpl.java:43)
    at java.lang.reflect.Method.invoke (Method.java:566)
    at org.codehaus.plexus.classworlds.launcher.Launcher.launchEnhanced (Launcher.java:282)
    at org.codehaus.plexus.classworlds.launcher.Launcher.launch (Launcher.java:225)
    at org.codehaus.plexus.classworlds.launcher.Launcher.mainWithExitCode (Launcher.java:406)
    at org.codehaus.plexus.classworlds.launcher.Launcher.main (Launcher.java:347)
Caused by: org.apache.maven.plugin.MojoFailureException: 1 build failed. See console output above for details.
    at org.apache.maven.plugins.invoker.InvokerSession.handleFailures (InvokerSession.java:260)
    at org.apache.maven.plugins.invoker.VerifyMojo.execute (VerifyMojo.java:137)
    at org.apache.maven.plugin.DefaultBuildPluginManager.executeMojo (DefaultBuildPluginManager.java:137)
    at org.apache.maven.lifecycle.internal.MojoExecutor.execute (MojoExecutor.java:210)
    at org.apache.maven.lifecycle.internal.MojoExecutor.execute (MojoExecutor.java:156)
    at org.apache.maven.lifecycle.internal.MojoExecutor.execute (MojoExecutor.java:148)
    at org.apache.maven.lifecycle.internal.LifecycleModuleBuilder.buildProject (LifecycleModuleBuilder.java:117)
    at org.apache.maven.lifecycle.internal.LifecycleModuleBuilder.buildProject (LifecycleModuleBuilder.java:81)
    at org.apache.maven.lifecycle.internal.builder.singlethreaded.SingleThreadedBuilder.build (SingleThreadedBuilder.java:56)
    at org.apache.maven.lifecycle.internal.LifecycleStarter.execute (LifecycleStarter.java:128)
    at org.apache.maven.DefaultMaven.doExecute (DefaultMaven.java:305)
    at org.apache.maven.DefaultMaven.doExecute (DefaultMaven.java:192)
    at org.apache.maven.DefaultMaven.execute (DefaultMaven.java:105)
    at org.apache.maven.cli.MavenCli.execute (MavenCli.java:956)
    at org.apache.maven.cli.MavenCli.doMain (MavenCli.java:288)
    at org.apache.maven.cli.MavenCli.main (MavenCli.java:192)
    at jdk.internal.reflect.NativeMethodAccessorImpl.invoke0 (Native Method)
    at jdk.internal.reflect.NativeMethodAccessorImpl.invoke (NativeMethodAccessorImpl.java:62)
    at jdk.internal.reflect.DelegatingMethodAccessorImpl.invoke (DelegatingMethodAccessorImpl.java:43)
    at java.lang.reflect.Method.invoke (Method.java:566)
    at org.codehaus.plexus.classworlds.launcher.Launcher.launchEnhanced (Launcher.java:282)
    at org.codehaus.plexus.classworlds.launcher.Launcher.launch (Launcher.java:225)
    at org.codehaus.plexus.classworlds.launcher.Launcher.mainWithExitCode (Launcher.java:406)
    at org.codehaus.plexus.classworlds.launcher.Launcher.main (Launcher.java:347)
[ERROR]
[ERROR] Re-run Maven using the -X switch to enable full debug logging.
[ERROR]
[ERROR] For more information about the errors and possible solutions, please read the following articles:
[ERROR] [Help 1] http://cwiki.apache.org/confluence/display/MAVEN/MojoFailureException
[Pipeline] }
[Pipeline] // dir
[Pipeline] }
[withMaven] junitPublisher - Archive test results for Maven artifact org.apache.maven.plugins:maven-site-plugin:maven-plugin:3.9.0-SNAPSHOT generated by maven-surefire-plugin:test (default-test): windows-jdk11-m3.6.x_build\target\surefire-reports\*.xml
Recording test results
[withMaven] openTasksPublisher - Scan Tasks for Maven artifact org.apache.maven.plugins:maven-site-plugin:maven-plugin:3.9.0-SNAPSHOT in source directory windows-jdk11-m3.6.x_build\src\main\java
[TASKS] Scanning folder 'f:\jenkins\jenkins-slave\workspace\ven-box_maven-site-plugin_master@2' for files matching the pattern 'windows-jdk11-m3.6.x_build\src\main\java\**\*' - excludes: null
[TASKS] Found 21 files to scan for tasks
[TASKS] Found 8 open tasks.
Skipping warnings blame since pipelines do not have an SCM link.%n
[TASKS] Computing warning deltas based on reference build #42
[withMaven] invokerPublisher - Archive invoker results for Maven artifact MavenArtifact{org.apache.maven.plugins:maven-site-plugin:maven-plugin:3.9.0-SNAPSHOT(version: 3.9.0-SNAPSHOT, snapshot:false) } generated by PluginInvocation{org.apache.maven.plugins:maven-invoker-plugin:3.1.0@integration-test  integration-test}: windows-jdk11-m3.6.x_build\target\invoker-reports\*.xml
[INFO] run post-build script verify.bsh
[INFO]           MSITE-548/pom.xml ................................ SUCCESS (16.2 s)
[INFO] Building: MSITE-497/pom.xml
[withMaven] Publishers: Generated Artifacts Publisher: 12 ms, Junit Publisher: 79 ms, Open Task Scanner Publisher: 122 ms, Dependencies Fingerprint Publisher: 1 ms, Invoker Publisher: 43051 ms
[Pipeline] // withMaven
[Pipeline] cleanWs
[WS-CLEANUP] Deleting project workspace...
[WS-CLEANUP] Deferred wipeout is used...
[INFO]           MSITE-497/pom.xml ................................ SUCCESS (27.7 s)
[INFO] Building: MSITE-604/pom.xml
[WS-CLEANUP] done
[Pipeline] cleanWs
[WS-CLEANUP] Deleting project workspace...
[WS-CLEANUP] Deferred wipeout is used...
[WS-CLEANUP] done
[Pipeline] }
[Pipeline] // stage
[Pipeline] }
[Pipeline] // ws
[Pipeline] }
[Pipeline] // node
[Pipeline] }
Failed in branch windows-jdk11-m3.6.x_build
[INFO] run post-build script verify.groovy
[INFO]           MSITE-604/pom.xml ................................ SUCCESS (9.8 s)
[INFO] Building: inheritedMenus/pom.xml
[INFO] run post-build script verify.bsh
[INFO]           inheritedMenus/pom.xml ........................... SUCCESS (11.0 s)
[INFO] Building: site-jar/pom.xml
[INFO] run post-build script verify.bsh
[INFO]           site-jar/pom.xml ................................. FAILED (10.1 s)
[INFO]   The post-build script returned false.
[INFO] Building: MSITE-665/pom.xml
[INFO]           MSITE-665/pom.xml ................................ SUCCESS (18.1 s)
[INFO] Building: MSITE-723/pom.xml
[INFO] run post-build script verify.groovy
[INFO]           MSITE-723/pom.xml ................................ SUCCESS (11.1 s)
[INFO] Building: surefire-report/pom.xml
[INFO] run post-build script verify.groovy
[INFO]           surefire-report/pom.xml .......................... SUCCESS (12.7 s)
[INFO] Building: MSITE-658/pom.xml
[INFO] run post-build script verify.bsh
[INFO]           MSITE-658/pom.xml ................................ SUCCESS (11.0 s)
[INFO] Building: it-plugin-test/pom.xml
[INFO]           it-plugin-test/pom.xml ........................... SUCCESS (11.8 s)
[INFO] Building: default-reports/pom.xml
[INFO] run post-build script verify.groovy
[INFO]           default-reports/pom.xml .......................... SUCCESS (13.0 s)
[INFO]
[INFO] --- mrm-maven-plugin:1.2.0:stop (default) @ maven-site-plugin ---
[INFO] Stopping Mock Repository Manager on http://localhost:45735
[INFO] Stopped SocketConnector@0.0.0.0:45735
[INFO] Mock Repository Manager http://localhost:45735 is stopped.
[INFO]
[INFO] --- maven-checkstyle-plugin:3.0.0:check (checkstyle-check) @ maven-site-plugin ---
[INFO]
[INFO] --- maven-invoker-plugin:3.1.0:verify (integration-test) @ maven-site-plugin ---
[INFO] -------------------------------------------------
[INFO] Build Summary:
[INFO]   Passed: 53, Failed: 3, Errors: 0, Skipped: 0
[INFO] -------------------------------------------------
[ERROR] The following builds failed:
[ERROR] *  MSITE-512/pom.xml
[ERROR] *  site-jar/pom.xml
[ERROR] *  full-reporting/pom.xml
[INFO] -------------------------------------------------
[INFO] ------------------------------------------------------------------------
[INFO] BUILD FAILURE
[INFO] ------------------------------------------------------------------------
[INFO] Total time: 14:31 min
[INFO] Finished at: 2019-11-09T16:35:25+00:00
[INFO] Final Memory: 67M/1780M
[INFO] ------------------------------------------------------------------------
[INFO] [jenkins-event-spy] Generated /home/jenkins/jenkins-slave/workspace/ven-box_maven-site-plugin_master@2@tmp/withMaven1172f755/maven-spy-20191109-162053-1981142528136693320200.log
[ERROR] Failed to execute goal org.apache.maven.plugins:maven-invoker-plugin:3.1.0:verify (integration-test) on project maven-site-plugin: 3 builds failed. See console output above for details. -> [Help 1]
org.apache.maven.lifecycle.LifecycleExecutionException: Failed to execute goal org.apache.maven.plugins:maven-invoker-plugin:3.1.0:verify (integration-test) on project maven-site-plugin: 3 builds failed. See console output above for details.
        at org.apache.maven.lifecycle.internal.MojoExecutor.execute(MojoExecutor.java:212)
        at org.apache.maven.lifecycle.internal.MojoExecutor.execute(MojoExecutor.java:153)
        at org.apache.maven.lifecycle.internal.MojoExecutor.execute(MojoExecutor.java:145)
        at org.apache.maven.lifecycle.internal.LifecycleModuleBuilder.buildProject(LifecycleModuleBuilder.java:116)
        at org.apache.maven.lifecycle.internal.LifecycleModuleBuilder.buildProject(LifecycleModuleBuilder.java:80)
        at org.apache.maven.lifecycle.internal.builder.singlethreaded.SingleThreadedBuilder.build(SingleThreadedBuilder.java:51)
        at org.apache.maven.lifecycle.internal.LifecycleStarter.execute(LifecycleStarter.java:120)
        at org.apache.maven.DefaultMaven.doExecute(DefaultMaven.java:355)
        at org.apache.maven.DefaultMaven.execute(DefaultMaven.java:155)
        at org.apache.maven.cli.MavenCli.execute(MavenCli.java:584)
        at org.apache.maven.cli.MavenCli.doMain(MavenCli.java:216)
        at org.apache.maven.cli.MavenCli.main(MavenCli.java:160)
        at sun.reflect.NativeMethodAccessorImpl.invoke0(Native Method)
        at sun.reflect.NativeMethodAccessorImpl.invoke(NativeMethodAccessorImpl.java:57)
        at sun.reflect.DelegatingMethodAccessorImpl.invoke(DelegatingMethodAccessorImpl.java:43)
        at java.lang.reflect.Method.invoke(Method.java:606)
        at org.codehaus.plexus.classworlds.launcher.Launcher.launchEnhanced(Launcher.java:289)
        at org.codehaus.plexus.classworlds.launcher.Launcher.launch(Launcher.java:229)
        at org.codehaus.plexus.classworlds.launcher.Launcher.mainWithExitCode(Launcher.java:415)
        at org.codehaus.plexus.classworlds.launcher.Launcher.main(Launcher.java:356)
Caused by: org.apache.maven.plugin.MojoFailureException: 3 builds failed. See console output above for details.
        at org.apache.maven.plugins.invoker.InvokerSession.handleFailures(InvokerSession.java:260)
        at org.apache.maven.plugins.invoker.VerifyMojo.execute(VerifyMojo.java:137)
        at org.apache.maven.plugin.DefaultBuildPluginManager.executeMojo(DefaultBuildPluginManager.java:132)
        at org.apache.maven.lifecycle.internal.MojoExecutor.execute(MojoExecutor.java:208)
        ... 19 more
[ERROR]
[ERROR] Re-run Maven using the -X switch to enable full debug logging.
[ERROR]
[ERROR] For more information about the errors and possible solutions, please read the following articles:
[ERROR] [Help 1] http://cwiki.apache.org/confluence/display/MAVEN/MojoFailureException
[Pipeline] }
[Pipeline] // dir
[Pipeline] }
[withMaven] junitPublisher - Archive test results for Maven artifact org.apache.maven.plugins:maven-site-plugin:maven-plugin:3.9.0-SNAPSHOT generated by maven-surefire-plugin:test (default-test): linux-jdk7-m3.2.x_build/target/surefire-reports/*.xml
Recording test results
[withMaven] openTasksPublisher - Scan Tasks for Maven artifact org.apache.maven.plugins:maven-site-plugin:maven-plugin:3.9.0-SNAPSHOT in source directory linux-jdk7-m3.2.x_build/src/main/java
[TASKS] Scanning folder '/home/jenkins/jenkins-slave/workspace/ven-box_maven-site-plugin_master@2' for files matching the pattern 'linux-jdk7-m3.2.x_build/src/main/java/**/*' - excludes: null
[TASKS] Found 21 files to scan for tasks
[TASKS] Found 8 open tasks.
Skipping warnings blame since pipelines do not have an SCM link.%n
[TASKS] Computing warning deltas based on reference build #42
[withMaven] invokerPublisher - Archive invoker results for Maven artifact MavenArtifact{org.apache.maven.plugins:maven-site-plugin:maven-plugin:3.9.0-SNAPSHOT(version: 3.9.0-SNAPSHOT, snapshot:false) } generated by PluginInvocation{org.apache.maven.plugins:maven-invoker-plugin:3.1.0@integration-test  integration-test}: linux-jdk7-m3.2.x_build/target/invoker-reports/*.xml
[withMaven] Publishers: Generated Artifacts Publisher: 311 ms, Junit Publisher: 1588 ms, Open Task Scanner Publisher: 1805 ms, Dependencies Fingerprint Publisher: 2 ms, Invoker Publisher: 70389 ms
[Pipeline] // withMaven
[Pipeline] cleanWs
[WS-CLEANUP] Deleting project workspace...
[WS-CLEANUP] Deferred wipeout is used...
[WS-CLEANUP] done
[Pipeline] cleanWs
[WS-CLEANUP] Deleting project workspace...
[WS-CLEANUP] Deferred wipeout is used...
[WS-CLEANUP] done
[Pipeline] }
[Pipeline] // stage
[Pipeline] }
[Pipeline] // ws
[Pipeline] }
[Pipeline] // node
[Pipeline] }
Failed in branch linux-jdk7-m3.2.x_build
[Pipeline] // parallel
[Pipeline] stage
[Pipeline] { (Notifications)
[Pipeline] echo
Build result: FAILURE
[Pipeline] jiraIssueSelector
[Pipeline] echo
The authors of changes [hboutemy].
[Pipeline] echo
Sending email ...
[Pipeline] emailext
Reply | Threaded
Open this post in threaded view
|

Build failed in Jenkins: Maven TLP » maven-site-plugin » master #47

Apache Jenkins Server-2
See https://builds.apache.org/job/maven-box/job/maven-site-plugin/job/master/47/

Changes:

* MSITE-851 fixed IT: jar internal timestamp cause variable local ts

All tests passed

Build log:
[...truncated 11295 lines...]
[WS-CLEANUP] Deferred wipeout is used...
[WS-CLEANUP] done
[Pipeline] }
[Pipeline] // stage
[Pipeline] }
[Pipeline] // ws
[Pipeline] }
[Pipeline] // node
[Pipeline] }
Failed in branch windows-jdk7-m3.2.x_build
[INFO]
[INFO] --- maven-invoker-plugin:3.1.0:verify (integration-test) @ maven-site-plugin ---
[INFO] -------------------------------------------------
[INFO] Build Summary:
[INFO]   Passed: 56, Failed: 0, Errors: 0, Skipped: 0
[INFO] -------------------------------------------------
[INFO] ------------------------------------------------------------------------
[INFO] BUILD SUCCESS
[INFO] ------------------------------------------------------------------------
[INFO] Total time:  10:37 min
[INFO] Finished at: 2019-11-09T08:45:34-08:00
[INFO] ------------------------------------------------------------------------
[INFO] [jenkins-event-spy] Generated F:\jenkins\jenkins-slave\workspace\ven-box_maven-site-plugin_master@2@tmp\withMavend2c82f6d\maven-spy-20191109-083457-25489768657759810293.log
[Pipeline] }
[Pipeline] // dir
[Pipeline] }
[withMaven] artifactsPublisher - Archive artifact windows-jdk12-m3.6.x_build\pom.xml under org\apache\maven\plugins\maven-site-plugin\3.9.0-SNAPSHOT\maven-site-plugin-3.9.0-SNAPSHOT.pom
[withMaven] artifactsPublisher - Archive artifact windows-jdk12-m3.6.x_build\target\maven-site-plugin-3.9.0-SNAPSHOT.jar under org\apache\maven\plugins\maven-site-plugin\3.9.0-SNAPSHOT\maven-site-plugin-3.9.0-SNAPSHOT.jar
[withMaven] junitPublisher - Archive test results for Maven artifact org.apache.maven.plugins:maven-site-plugin:maven-plugin:3.9.0-SNAPSHOT generated by maven-surefire-plugin:test (default-test): windows-jdk12-m3.6.x_build\target\surefire-reports\*.xml
Recording test results
[withMaven] openTasksPublisher - Scan Tasks for Maven artifact org.apache.maven.plugins:maven-site-plugin:maven-plugin:3.9.0-SNAPSHOT in source directory windows-jdk12-m3.6.x_build\src\main\java
[TASKS] Scanning folder 'f:\jenkins\jenkins-slave\workspace\ven-box_maven-site-plugin_master@2' for files matching the pattern 'windows-jdk12-m3.6.x_build\src\main\java\**\*' - excludes: null
[TASKS] Found 21 files to scan for tasks
[TASKS] Found 8 open tasks.
Skipping warnings blame since pipelines do not have an SCM link.%n
[TASKS] Computing warning deltas based on reference build #42
[withMaven] invokerPublisher - Archive invoker results for Maven artifact MavenArtifact{org.apache.maven.plugins:maven-site-plugin:maven-plugin:3.9.0-SNAPSHOT(version: 3.9.0-SNAPSHOT, snapshot:false) } generated by PluginInvocation{org.apache.maven.plugins:maven-invoker-plugin:3.1.0@integration-test  integration-test}: windows-jdk12-m3.6.x_build\target\invoker-reports\*.xml
[INFO] run post-build script verify.groovy
[INFO]           validate\pom.xml ................................. SUCCESS (6.0 s)
[INFO]
[INFO] --- mrm-maven-plugin:1.2.0:stop (default) @ maven-site-plugin ---
[INFO] Stopping Mock Repository Manager on http://localhost:49394
[INFO] Stopped SocketConnector@0.0.0.0:49394
[INFO] Mock Repository Manager http://localhost:49394 is stopped.
[INFO]
[INFO] --- maven-checkstyle-plugin:3.0.0:check (checkstyle-check) @ maven-site-plugin ---
[INFO]
[INFO] --- maven-invoker-plugin:3.1.0:verify (integration-test) @ maven-site-plugin ---
[INFO] -------------------------------------------------
[INFO] Build Summary:
[INFO]   Passed: 54, Failed: 2, Errors: 0, Skipped: 0
[INFO] -------------------------------------------------
[ERROR] The following builds failed:
[ERROR] *  full-reporting\pom.xml
[ERROR] *  MSITE-512\pom.xml
[INFO] -------------------------------------------------
[INFO] ------------------------------------------------------------------------
[INFO] BUILD FAILURE
[INFO] ------------------------------------------------------------------------
[INFO] Total time: 10:41 min
[INFO] Finished at: 2019-11-09T08:45:38-08:00
[INFO] Final Memory: 73M/1121M
[INFO] ------------------------------------------------------------------------
[INFO] [jenkins-event-spy] Generated F:\jenkins\jenkins-slave\workspace\ven-box_maven-site-plugin_master@3@tmp\withMaven0b458dc3\maven-spy-20191109-083456-6721442245262666641803.log
[ERROR] Failed to execute goal org.apache.maven.plugins:maven-invoker-plugin:3.1.0:verify (integration-test) on project maven-site-plugin: 2 builds failed. See console output above for details. -> [Help 1]
org.apache.maven.lifecycle.LifecycleExecutionException: Failed to execute goal org.apache.maven.plugins:maven-invoker-plugin:3.1.0:verify (integration-test) on project maven-site-plugin: 2 builds failed. See console output above for details.
    at org.apache.maven.lifecycle.internal.MojoExecutor.execute (MojoExecutor.java:213)
    at org.apache.maven.lifecycle.internal.MojoExecutor.execute (MojoExecutor.java:154)
    at org.apache.maven.lifecycle.internal.MojoExecutor.execute (MojoExecutor.java:146)
    at org.apache.maven.lifecycle.internal.LifecycleModuleBuilder.buildProject (LifecycleModuleBuilder.java:117)
    at org.apache.maven.lifecycle.internal.LifecycleModuleBuilder.buildProject (LifecycleModuleBuilder.java:81)
    at org.apache.maven.lifecycle.internal.builder.singlethreaded.SingleThreadedBuilder.build (SingleThreadedBuilder.java:51)
    at org.apache.maven.lifecycle.internal.LifecycleStarter.execute (LifecycleStarter.java:128)
    at org.apache.maven.DefaultMaven.doExecute (DefaultMaven.java:309)
    at org.apache.maven.DefaultMaven.doExecute (DefaultMaven.java:194)
    at org.apache.maven.DefaultMaven.execute (DefaultMaven.java:107)
    at org.apache.maven.cli.MavenCli.execute (MavenCli.java:955)
    at org.apache.maven.cli.MavenCli.doMain (MavenCli.java:290)
    at org.apache.maven.cli.MavenCli.main (MavenCli.java:194)
    at sun.reflect.NativeMethodAccessorImpl.invoke0 (Native Method)
    at sun.reflect.NativeMethodAccessorImpl.invoke (NativeMethodAccessorImpl.java:57)
    at sun.reflect.DelegatingMethodAccessorImpl.invoke (DelegatingMethodAccessorImpl.java:43)
    at java.lang.reflect.Method.invoke (Method.java:606)
    at org.codehaus.plexus.classworlds.launcher.Launcher.launchEnhanced (Launcher.java:289)
    at org.codehaus.plexus.classworlds.launcher.Launcher.launch (Launcher.java:229)
    at org.codehaus.plexus.classworlds.launcher.Launcher.mainWithExitCode (Launcher.java:415)
    at org.codehaus.plexus.classworlds.launcher.Launcher.main (Launcher.java:356)
Caused by: org.apache.maven.plugin.MojoFailureException: 2 builds failed. See console output above for details.
    at org.apache.maven.plugins.invoker.InvokerSession.handleFailures (InvokerSession.java:260)
    at org.apache.maven.plugins.invoker.VerifyMojo.execute (VerifyMojo.java:137)
    at org.apache.maven.plugin.DefaultBuildPluginManager.executeMojo (DefaultBuildPluginManager.java:134)
    at org.apache.maven.lifecycle.internal.MojoExecutor.execute (MojoExecutor.java:208)
    at org.apache.maven.lifecycle.internal.MojoExecutor.execute (MojoExecutor.java:154)
    at org.apache.maven.lifecycle.internal.MojoExecutor.execute (MojoExecutor.java:146)
    at org.apache.maven.lifecycle.internal.LifecycleModuleBuilder.buildProject (LifecycleModuleBuilder.java:117)
    at org.apache.maven.lifecycle.internal.LifecycleModuleBuilder.buildProject (LifecycleModuleBuilder.java:81)
    at org.apache.maven.lifecycle.internal.builder.singlethreaded.SingleThreadedBuilder.build (SingleThreadedBuilder.java:51)
    at org.apache.maven.lifecycle.internal.LifecycleStarter.execute (LifecycleStarter.java:128)
    at org.apache.maven.DefaultMaven.doExecute (DefaultMaven.java:309)
    at org.apache.maven.DefaultMaven.doExecute (DefaultMaven.java:194)
    at org.apache.maven.DefaultMaven.execute (DefaultMaven.java:107)
    at org.apache.maven.cli.MavenCli.execute (MavenCli.java:955)
    at org.apache.maven.cli.MavenCli.doMain (MavenCli.java:290)
    at org.apache.maven.cli.MavenCli.main (MavenCli.java:194)
    at sun.reflect.NativeMethodAccessorImpl.invoke0 (Native Method)
    at sun.reflect.NativeMethodAccessorImpl.invoke (NativeMethodAccessorImpl.java:57)
    at sun.reflect.DelegatingMethodAccessorImpl.invoke (DelegatingMethodAccessorImpl.java:43)
    at java.lang.reflect.Method.invoke (Method.java:606)
    at org.codehaus.plexus.classworlds.launcher.Launcher.launchEnhanced (Launcher.java:289)
    at org.codehaus.plexus.classworlds.launcher.Launcher.launch (Launcher.java:229)
    at org.codehaus.plexus.classworlds.launcher.Launcher.mainWithExitCode (Launcher.java:415)
    at org.codehaus.plexus.classworlds.launcher.Launcher.main (Launcher.java:356)
[ERROR]
[ERROR] Re-run Maven using the -X switch to enable full debug logging.
[ERROR]
[ERROR] For more information about the errors and possible solutions, please read the following articles:
[ERROR] [Help 1] http://cwiki.apache.org/confluence/display/MAVEN/MojoFailureException
Picked up JAVA_TOOL_OPTIONS: -Dmaven.ext.class.path="f:\jenkins\jenkins-slave\workspace\ven-box_maven-site-plugin_master@3@tmp\withMaven0b458dc3\pipeline-maven-spy.jar" -Dorg.jenkinsci.plugins.pipeline.maven.reportsFolder="f:\jenkins\jenkins-slave\workspace\ven-box_maven-site-plugin_master@3@tmp\withMaven0b458dc3"
[Pipeline] }
[Pipeline] // dir
[Pipeline] }
[withMaven] junitPublisher - Archive test results for Maven artifact org.apache.maven.plugins:maven-site-plugin:maven-plugin:3.9.0-SNAPSHOT generated by maven-surefire-plugin:test (default-test): windows-jdk7-m3.5.x_build\target\surefire-reports\*.xml
Recording test results
[withMaven] openTasksPublisher - Scan Tasks for Maven artifact org.apache.maven.plugins:maven-site-plugin:maven-plugin:3.9.0-SNAPSHOT in source directory windows-jdk7-m3.5.x_build\src\main\java
[TASKS] Scanning folder 'f:\jenkins\jenkins-slave\workspace\ven-box_maven-site-plugin_master@3' for files matching the pattern 'windows-jdk7-m3.5.x_build\src\main\java\**\*' - excludes: null
[TASKS] Found 21 files to scan for tasks
[TASKS] Found 8 open tasks.
Skipping warnings blame since pipelines do not have an SCM link.%n
[TASKS] Computing warning deltas based on reference build #42
[withMaven] invokerPublisher - Archive invoker results for Maven artifact MavenArtifact{org.apache.maven.plugins:maven-site-plugin:maven-plugin:3.9.0-SNAPSHOT(version: 3.9.0-SNAPSHOT, snapshot:false) } generated by PluginInvocation{org.apache.maven.plugins:maven-invoker-plugin:3.1.0@integration-test  integration-test}: windows-jdk7-m3.5.x_build\target\invoker-reports\*.xml
[INFO] run post-build script verify.bsh
[INFO]           site-skip\pom.xml ................................ SUCCESS (9.2 s)
[INFO] Building: surefire-report\pom.xml
[INFO] run post-build script verify.groovy
[INFO]           surefire-report\pom.xml .......................... SUCCESS (9.3 s)
[INFO] Building: template-skin\pom.xml
[INFO] run post-build script verify.bsh
[INFO]           template-skin\pom.xml ............................ SUCCESS (12.2 s)
[INFO] Building: validate\pom.xml
[withMaven] Publishers: Generated Artifacts Publisher: 14 ms, Junit Publisher: 80 ms, Open Task Scanner Publisher: 131 ms, Dependencies Fingerprint Publisher: 1 ms, Invoker Publisher: 32587 ms
[Pipeline] // withMaven
[Pipeline] cleanWs
[WS-CLEANUP] Deleting project workspace...
[WS-CLEANUP] Deferred wipeout is used...
[WS-CLEANUP] done
[Pipeline] cleanWs
[WS-CLEANUP] Deleting project workspace...
[WS-CLEANUP] Deferred wipeout is used...
[WS-CLEANUP] done
[Pipeline] }
[Pipeline] // stage
[Pipeline] }
[Pipeline] // ws
[Pipeline] }
[Pipeline] // node
[Pipeline] }
Failed in branch windows-jdk7-m3.3.x_build
[INFO] run post-build script verify.groovy
[INFO]           validate\pom.xml ................................. SUCCESS (6.4 s)
[INFO]
[INFO] --- mrm-maven-plugin:1.2.0:stop (default) @ maven-site-plugin ---
[INFO] Stopping Mock Repository Manager on http://localhost:53995
[INFO] Stopped SocketConnector@0.0.0.0:53995
[INFO] Mock Repository Manager http://localhost:53995 is stopped.
[INFO]
[INFO] --- maven-checkstyle-plugin:3.0.0:check (checkstyle-check) @ maven-site-plugin ---
[withMaven] Publishers: Generated Artifacts Publisher: 102 ms, Junit Publisher: 90 ms, Open Task Scanner Publisher: 152 ms, Dependencies Fingerprint Publisher: 1 ms, Invoker Publisher: 32854 ms, Pipeline Graph Publisher: 1 ms
[Pipeline] // withMaven
[Pipeline] cleanWs
[WS-CLEANUP] Deleting project workspace...
[WS-CLEANUP] Deferred wipeout is used...
[WS-CLEANUP] done
[Pipeline] }
[Pipeline] // stage
[Pipeline] }
[Pipeline] // ws
[Pipeline] }
[Pipeline] // node
[Pipeline] }
[INFO]
[INFO] --- maven-invoker-plugin:3.1.0:verify (integration-test) @ maven-site-plugin ---
[INFO] -------------------------------------------------
[INFO] Build Summary:
[INFO]   Passed: 56, Failed: 0, Errors: 0, Skipped: 0
[INFO] -------------------------------------------------
[INFO] ------------------------------------------------------------------------
[INFO] BUILD SUCCESS
[INFO] ------------------------------------------------------------------------
[INFO] Total time:  11:43 min
[INFO] Finished at: 2019-11-09T08:46:10-08:00
[INFO] ------------------------------------------------------------------------
[INFO] [jenkins-event-spy] Generated F:\jenkins\jenkins-slave\workspace\ven-box_maven-site-plugin_master@2@tmp\withMavene8db7154\maven-spy-20191109-083425-81517708232279585475349.log
[Pipeline] }
[Pipeline] // dir
[Pipeline] }
[withMaven] artifactsPublisher - Archive artifact windows-jdk11-m3.6.x_build\pom.xml under org\apache\maven\plugins\maven-site-plugin\3.9.0-SNAPSHOT\maven-site-plugin-3.9.0-SNAPSHOT.pom
[withMaven] artifactsPublisher - Archive artifact windows-jdk11-m3.6.x_build\target\maven-site-plugin-3.9.0-SNAPSHOT.jar under org\apache\maven\plugins\maven-site-plugin\3.9.0-SNAPSHOT\maven-site-plugin-3.9.0-SNAPSHOT.jar
[withMaven] junitPublisher - Archive test results for Maven artifact org.apache.maven.plugins:maven-site-plugin:maven-plugin:3.9.0-SNAPSHOT generated by maven-surefire-plugin:test (default-test): windows-jdk11-m3.6.x_build\target\surefire-reports\*.xml
Recording test results
[withMaven] openTasksPublisher - Scan Tasks for Maven artifact org.apache.maven.plugins:maven-site-plugin:maven-plugin:3.9.0-SNAPSHOT in source directory windows-jdk11-m3.6.x_build\src\main\java
[TASKS] Scanning folder 'f:\jenkins\jenkins-slave\workspace\ven-box_maven-site-plugin_master@2' for files matching the pattern 'windows-jdk11-m3.6.x_build\src\main\java\**\*' - excludes: null
[TASKS] Found 21 files to scan for tasks
[TASKS] Found 8 open tasks.
Skipping warnings blame since pipelines do not have an SCM link.%n
[TASKS] Computing warning deltas based on reference build #42
[withMaven] invokerPublisher - Archive invoker results for Maven artifact MavenArtifact{org.apache.maven.plugins:maven-site-plugin:maven-plugin:3.9.0-SNAPSHOT(version: 3.9.0-SNAPSHOT, snapshot:false) } generated by PluginInvocation{org.apache.maven.plugins:maven-invoker-plugin:3.1.0@integration-test  integration-test}: windows-jdk11-m3.6.x_build\target\invoker-reports\*.xml
[withMaven] Publishers: Generated Artifacts Publisher: 15 ms, Junit Publisher: 98 ms, Open Task Scanner Publisher: 121 ms, Invoker Publisher: 34809 ms
[Pipeline] // withMaven
[Pipeline] cleanWs
[WS-CLEANUP] Deleting project workspace...
[WS-CLEANUP] Deferred wipeout is used...
[WS-CLEANUP] done
[Pipeline] cleanWs
[WS-CLEANUP] Deleting project workspace...
[WS-CLEANUP] Deferred wipeout is used...
[WS-CLEANUP] done
[Pipeline] }
[Pipeline] // stage
[Pipeline] }
[Pipeline] // ws
[Pipeline] }
[Pipeline] // node
[Pipeline] }
Failed in branch windows-jdk7-m3.5.x_build
[withMaven] Publishers: Generated Artifacts Publisher: 102 ms, Junit Publisher: 84 ms, Open Task Scanner Publisher: 152 ms, Invoker Publisher: 46440 ms, Pipeline Graph Publisher: 2 ms
[Pipeline] // withMaven
[Pipeline] cleanWs
[WS-CLEANUP] Deleting project workspace...
[WS-CLEANUP] Deferred wipeout is used...
[WS-CLEANUP] done
[Pipeline] }
[Pipeline] // stage
[Pipeline] }
[Pipeline] // ws
[Pipeline] }
[Pipeline] // node
[Pipeline] }
[Pipeline] // parallel
[Pipeline] stage
[Pipeline] { (Notifications)
[Pipeline] echo
Build result: FAILURE
[Pipeline] jiraIssueSelector
[Pipeline] jiraComment
[Pipeline] echo
The authors of changes [hboutemy].
[Pipeline] echo
Sending email ...
[Pipeline] emailext
Reply | Threaded
Open this post in threaded view
|

Build succeeded in Jenkins: Maven TLP » maven-site-plugin » master #48

Apache Jenkins Server-2
See https://builds.apache.org/job/maven-box/job/maven-site-plugin/job/master/48/

Changes:

* H31 gives OOME (let's see if others are stable again...)
* MSITE-851 avoid IT failure with old JDK 7 caused by plexus-utils upgrade

All tests passed