Build failed in Jenkins: Maven TLP » maven-site-plugin » dependabot/maven/jettyVersion-9.4.22.v20191022 #1

classic Classic list List threaded Threaded
2 messages Options
Reply | Threaded
Open this post in threaded view
|

Build failed in Jenkins: Maven TLP » maven-site-plugin » dependabot/maven/jettyVersion-9.4.22.v20191022 #1

Apache Jenkins Server-2
See https://builds.apache.org/job/maven-box/job/maven-site-plugin/job/dependabot%252Fmaven%252FjettyVersion-9.4.22.v20191022/1/

No changes.

No tests ran.

Build log:
[...truncated 2796 lines...]
[TASKS] Found 21 files to scan for tasks
[TASKS] Found 8 open tasks.
Skipping warnings blame since pipelines do not have an SCM link.%n
[withMaven] Publishers: Generated Artifacts Publisher: 7 ms, Open Task Scanner Publisher: 300 ms, Dependencies Fingerprint Publisher: 1 ms
[Pipeline] // withMaven
[Pipeline] cleanWs
[WS-CLEANUP] Deleting project workspace...
[WS-CLEANUP] Deferred wipeout is used...
[WS-CLEANUP] done
[Pipeline] cleanWs
[WS-CLEANUP] Deleting project workspace...
[WS-CLEANUP] Deferred wipeout is used...
[WS-CLEANUP] done
[Pipeline] }
[Pipeline] // stage
[Pipeline] }
[Pipeline] // ws
[Pipeline] }
[Pipeline] // node
[Pipeline] }
Failed in branch windows-jdk11-m3.6.x_build
 > git config remote.origin.url https://gitbox.apache.org/repos/asf/maven-site-plugin.git # timeout=10
Fetching without tags
 > git config --add remote.origin.fetch +refs/heads/*:refs/remotes/origin/* # timeout=10
 > git config remote.origin.url https://gitbox.apache.org/repos/asf/maven-site-plugin.git # timeout=10
Fetching upstream changes from https://gitbox.apache.org/repos/asf/maven-site-plugin.git
 > git fetch --no-tags --progress -- https://gitbox.apache.org/repos/asf/maven-site-plugin.git +refs/heads/*:refs/remotes/origin/*
Checking out Revision ea2506a8c90fea063416630f2eb6d7b11886de8c (dependabot/maven/jettyVersion-9.4.22.v20191022)
 > git config core.sparsecheckout # timeout=10
 > git checkout -f ea2506a8c90fea063416630f2eb6d7b11886de8c
Commit message: "Bump jettyVersion from 9.2.28.v20190418 to 9.4.22.v20191022"
Cleaning workspace
fatal: bad object 837cc7adbf5727648e9caac5a4ba7d64b45359d1
[Pipeline] }
[Pipeline] // dir
[Pipeline] }
 > git rev-parse --verify HEAD # timeout=10
Resetting working tree
 > git reset --hard # timeout=10
 > git clean -fdx # timeout=10
[Pipeline] // stage
[Pipeline] stage
[Pipeline] { (Build windows-jdk12-m3.6.x_build)
[Pipeline] echo
Local Repo (windows-jdk12-m3.6.x_build): ../.maven_repositories/1
[Pipeline] withMaven
[withMaven] Options: [org.jenkinsci.plugins.pipeline.maven.publishers.GeneratedArtifactsPublisher[disabled=false], JunitTestsPublisher[disabled=false,healthScaleFactor=,keepLongStdio=false,ignoreAttachments=false], org.jenkinsci.plugins.pipeline.maven.publishers.FindbugsAnalysisPublisher[disabled='false', healthy='', unHealthy='', thresholdLimit='low'], org.jenkinsci.plugins.pipeline.maven.publishers.TasksScannerPublisher[disabled='false', healthy='', unHealthy='', thresholdLimit='low'], org.jenkinsci.plugins.pipeline.maven.publishers.DependenciesFingerprintPublisher[disabled=false, scopes=[compile, provided, runtime], versions={snapshot:true, release:false}], org.jenkinsci.plugins.pipeline.maven.publishers.InvokerRunsPublisher[disabled=false], org.jenkinsci.plugins.pipeline.maven.publishers.PipelineGraphPublisher[disabled=false, scopes=[compile, provided, runtime], versions={snapshot:true, release:false}, skipDownstreamTriggers=false, lifecycleThreshold=deploy, ignoreUpstreamTriggers=false], org.jenkinsci.plugins.pipeline.maven.publishers.MavenLinkerPublisher2[disabled=false]]
[withMaven] Available options:
[withMaven] using JDK installation JDK 12 (latest)
[withMaven] using Maven installation 'Maven 3.6.2 (Windows)'
[Pipeline] {
[Pipeline] dir
Running in f:\jenkins\jenkins-slave\workspace\en_jettyVersion-9.4.22.v20191022@3@2\windows-jdk12-m3.6.x_build
[Pipeline] {
[Pipeline] isUnix
[Pipeline] bat

f:\jenkins\jenkins-slave\workspace\en_jettyVersion-9.4.22.v20191022@3@2\windows-jdk12-m3.6.x_build>wmic logicaldisk get size,freespace,caption
Caption FreeSpace Size

C: 2919695200256 2999999000576

F: 2969173446656 3000574668800


[Pipeline] bat

f:\jenkins\jenkins-slave\workspace\en_jettyVersion-9.4.22.v20191022@3@2\windows-jdk12-m3.6.x_build>mvn -P+run-its -Dmaven.test.failure.ignore=true -Dfindbugs.failOnError=false -e clean verify
----- withMaven Wrapper script -----
Picked up JAVA_TOOL_OPTIONS: -Dmaven.ext.class.path="f:\jenkins\jenkins-slave\workspace\en_jettyVersion-9.4.22.v20191022@3@2@tmp\withMaven1951c805\pipeline-maven-spy.jar" -Dorg.jenkinsci.plugins.pipeline.maven.reportsFolder="f:\jenkins\jenkins-slave\workspace\en_jettyVersion-9.4.22.v20191022@3@2@tmp\withMaven1951c805"
Apache Maven 3.6.2 (40f52333136460af0dc0d7232c0dc0bcf0d9e117; 2019-08-27T08:06:16-07:00)
Maven home: F:\jenkins\tools\maven\apache-maven-3.6.2\bin\..
Java version: 12, vendor: Oracle Corporation, runtime: f:\jenkins\tools\java\latest12
Default locale: en_US, platform encoding: Cp1252
OS name: "windows server 2016", version: "10.0", arch: "amd64", family: "windows"
[INFO] [jenkins-event-spy] Generate F:\jenkins\jenkins-slave\workspace\en_jettyVersion-9.4.22.v20191022@3@2@tmp\withMaven1951c805\maven-spy-20191101-054704-8610170797099101976813.log.tmp ...
[INFO] Error stacktraces are turned on.
[INFO] Scanning for projects...
[INFO]
[INFO] -------------< org.apache.maven.plugins:maven-site-plugin >-------------
[INFO] Building Apache Maven Site Plugin 3.8.3-SNAPSHOT
[INFO] ----------------------------[ maven-plugin ]----------------------------
[INFO] Downloading from central: https://repo.maven.apache.org/maven2/org/eclipse/jetty/jetty-server/9.4.22.v20191022/jetty-server-9.4.22.v20191022.pom
[INFO] Downloaded from central: https://repo.maven.apache.org/maven2/org/eclipse/jetty/jetty-server/9.4.22.v20191022/jetty-server-9.4.22.v20191022.pom (2.6 kB at 3.2 kB/s)
[INFO] Downloading from central: https://repo.maven.apache.org/maven2/org/eclipse/jetty/jetty-project/9.4.22.v20191022/jetty-project-9.4.22.v20191022.pom
[INFO] Downloaded from central: https://repo.maven.apache.org/maven2/org/eclipse/jetty/jetty-project/9.4.22.v20191022/jetty-project-9.4.22.v20191022.pom (75 kB at 905 kB/s)
[INFO] Downloading from central: https://repo.maven.apache.org/maven2/org/eclipse/jetty/jetty-http/9.4.22.v20191022/jetty-http-9.4.22.v20191022.pom
[INFO] Downloaded from central: https://repo.maven.apache.org/maven2/org/eclipse/jetty/jetty-http/9.4.22.v20191022/jetty-http-9.4.22.v20191022.pom (4.2 kB at 146 kB/s)
[INFO] Downloading from central: https://repo.maven.apache.org/maven2/org/eclipse/jetty/jetty-util/9.4.22.v20191022/jetty-util-9.4.22.v20191022.pom
[INFO] Downloaded from central: https://repo.maven.apache.org/maven2/org/eclipse/jetty/jetty-util/9.4.22.v20191022/jetty-util-9.4.22.v20191022.pom (4.2 kB at 144 kB/s)
[INFO] Downloading from central: https://repo.maven.apache.org/maven2/org/eclipse/jetty/jetty-io/9.4.22.v20191022/jetty-io-9.4.22.v20191022.pom
[INFO] Downloaded from central: https://repo.maven.apache.org/maven2/org/eclipse/jetty/jetty-io/9.4.22.v20191022/jetty-io-9.4.22.v20191022.pom (1.3 kB at 45 kB/s)
[INFO] Downloading from central: https://repo.maven.apache.org/maven2/org/eclipse/jetty/jetty-servlet/9.4.22.v20191022/jetty-servlet-9.4.22.v20191022.pom
[INFO] Downloaded from central: https://repo.maven.apache.org/maven2/org/eclipse/jetty/jetty-servlet/9.4.22.v20191022/jetty-servlet-9.4.22.v20191022.pom (2.3 kB at 72 kB/s)
[INFO] Downloading from central: https://repo.maven.apache.org/maven2/org/eclipse/jetty/jetty-security/9.4.22.v20191022/jetty-security-9.4.22.v20191022.pom
[INFO] Downloaded from central: https://repo.maven.apache.org/maven2/org/eclipse/jetty/jetty-security/9.4.22.v20191022/jetty-security-9.4.22.v20191022.pom (1.6 kB at 56 kB/s)
[INFO] Downloading from central: https://repo.maven.apache.org/maven2/org/eclipse/jetty/jetty-webapp/9.4.22.v20191022/jetty-webapp-9.4.22.v20191022.pom
[INFO] Downloaded from central: https://repo.maven.apache.org/maven2/org/eclipse/jetty/jetty-webapp/9.4.22.v20191022/jetty-webapp-9.4.22.v20191022.pom (3.2 kB at 73 kB/s)
[INFO] Downloading from central: https://repo.maven.apache.org/maven2/org/eclipse/jetty/jetty-xml/9.4.22.v20191022/jetty-xml-9.4.22.v20191022.pom
[INFO] Downloaded from central: https://repo.maven.apache.org/maven2/org/eclipse/jetty/jetty-xml/9.4.22.v20191022/jetty-xml-9.4.22.v20191022.pom (1.9 kB at 45 kB/s)
[INFO] Downloading from central: https://repo.maven.apache.org/maven2/org/eclipse/jetty/jetty-client/9.4.22.v20191022/jetty-client-9.4.22.v20191022.pom
[INFO] Downloaded from central: https://repo.maven.apache.org/maven2/org/eclipse/jetty/jetty-client/9.4.22.v20191022/jetty-client-9.4.22.v20191022.pom (4.9 kB at 132 kB/s)
[INFO] Downloading from central: https://repo.maven.apache.org/maven2/org/eclipse/jetty/jetty-proxy/9.4.22.v20191022/jetty-proxy-9.4.22.v20191022.pom
[INFO] Downloaded from central: https://repo.maven.apache.org/maven2/org/eclipse/jetty/jetty-proxy/9.4.22.v20191022/jetty-proxy-9.4.22.v20191022.pom (2.2 kB at 58 kB/s)
[INFO] Downloading from central: https://repo.maven.apache.org/maven2/org/eclipse/jetty/jetty-server/9.4.22.v20191022/jetty-server-9.4.22.v20191022.jar
[INFO] Downloading from central: https://repo.maven.apache.org/maven2/org/eclipse/jetty/jetty-servlet/9.4.22.v20191022/jetty-servlet-9.4.22.v20191022.jar
[INFO] Downloading from central: https://repo.maven.apache.org/maven2/org/eclipse/jetty/jetty-io/9.4.22.v20191022/jetty-io-9.4.22.v20191022.jar
[INFO] Downloading from central: https://repo.maven.apache.org/maven2/org/eclipse/jetty/jetty-http/9.4.22.v20191022/jetty-http-9.4.22.v20191022.jar
[INFO] Downloading from central: https://repo.maven.apache.org/maven2/org/eclipse/jetty/jetty-security/9.4.22.v20191022/jetty-security-9.4.22.v20191022.jar
[INFO] Downloaded from central: https://repo.maven.apache.org/maven2/org/eclipse/jetty/jetty-security/9.4.22.v20191022/jetty-security-9.4.22.v20191022.jar (117 kB at 1.1 MB/s)
[INFO] Downloading from central: https://repo.maven.apache.org/maven2/org/eclipse/jetty/jetty-webapp/9.4.22.v20191022/jetty-webapp-9.4.22.v20191022.jar
[INFO] Downloaded from central: https://repo.maven.apache.org/maven2/org/eclipse/jetty/jetty-io/9.4.22.v20191022/jetty-io-9.4.22.v20191022.jar (159 kB at 1.3 MB/s)
[INFO] Downloading from central: https://repo.maven.apache.org/maven2/org/eclipse/jetty/jetty-xml/9.4.22.v20191022/jetty-xml-9.4.22.v20191022.jar
[INFO] Downloaded from central: https://repo.maven.apache.org/maven2/org/eclipse/jetty/jetty-servlet/9.4.22.v20191022/jetty-servlet-9.4.22.v20191022.jar (132 kB at 1.0 MB/s)
[INFO] Downloaded from central: https://repo.maven.apache.org/maven2/org/eclipse/jetty/jetty-http/9.4.22.v20191022/jetty-http-9.4.22.v20191022.jar (210 kB at 1.6 MB/s)
[INFO] Downloading from central: https://repo.maven.apache.org/maven2/org/eclipse/jetty/jetty-util/9.4.22.v20191022/jetty-util-9.4.22.v20191022.jar
[INFO] Downloading from central: https://repo.maven.apache.org/maven2/org/eclipse/jetty/jetty-client/9.4.22.v20191022/jetty-client-9.4.22.v20191022.jar
[INFO] Downloaded from central: https://repo.maven.apache.org/maven2/org/eclipse/jetty/jetty-server/9.4.22.v20191022/jetty-server-9.4.22.v20191022.jar (672 kB at 4.6 MB/s)
[INFO] Downloading from central: https://repo.maven.apache.org/maven2/org/eclipse/jetty/jetty-proxy/9.4.22.v20191022/jetty-proxy-9.4.22.v20191022.jar
[INFO] Downloaded from central: https://repo.maven.apache.org/maven2/org/eclipse/jetty/jetty-webapp/9.4.22.v20191022/jetty-webapp-9.4.22.v20191022.jar (138 kB at 817 kB/s)
[INFO] Downloaded from central: https://repo.maven.apache.org/maven2/org/eclipse/jetty/jetty-xml/9.4.22.v20191022/jetty-xml-9.4.22.v20191022.jar (63 kB at 348 kB/s)
[INFO] Downloaded from central: https://repo.maven.apache.org/maven2/org/eclipse/jetty/jetty-proxy/9.4.22.v20191022/jetty-proxy-9.4.22.v20191022.jar (96 kB at 502 kB/s)
[INFO] Downloaded from central: https://repo.maven.apache.org/maven2/org/eclipse/jetty/jetty-client/9.4.22.v20191022/jetty-client-9.4.22.v20191022.jar (304 kB at 1.5 MB/s)
[INFO] Downloaded from central: https://repo.maven.apache.org/maven2/org/eclipse/jetty/jetty-util/9.4.22.v20191022/jetty-util-9.4.22.v20191022.jar (542 kB at 2.4 MB/s)
[INFO]
[INFO] --- maven-clean-plugin:3.1.0:clean (default-clean) @ maven-site-plugin ---
[INFO]
[INFO] --- maven-enforcer-plugin:1.4.1:enforce (enforce-maven-version) @ maven-site-plugin ---
[INFO]
[INFO] --- maven-enforcer-plugin:1.4.1:enforce (enforce-bytecode-version) @ maven-site-plugin ---
[INFO] Restricted to JDK 1.7 yet org.eclipse.jetty:jetty-util:jar:9.4.22.v20191022:compile contains org/eclipse/jetty/util/StringUtil$CsvSplitState.class targeted to JDK 1.8
[INFO] Restricted to JDK 1.7 yet org.eclipse.jetty:jetty-http:jar:9.4.22.v20191022:compile contains org/eclipse/jetty/http/HttpField$IntValueHttpField.class targeted to JDK 1.8
[INFO] Restricted to JDK 1.7 yet org.eclipse.jetty:jetty-server:jar:9.4.22.v20191022:compile contains org/eclipse/jetty/server/HttpChannel$TransientListeners.class targeted to JDK 1.8
[INFO] Restricted to JDK 1.7 yet org.eclipse.jetty:jetty-xml:jar:9.4.22.v20191022:compile contains org/eclipse/jetty/xml/XmlParser$Node.class targeted to JDK 1.8
[INFO] Restricted to JDK 1.7 yet org.eclipse.jetty:jetty-io:jar:9.4.22.v20191022:compile contains org/eclipse/jetty/io/ManagedSelector$Accept.class targeted to JDK 1.8
[INFO] Restricted to JDK 1.7 yet org.eclipse.jetty:jetty-webapp:jar:9.4.22.v20191022:compile contains org/eclipse/jetty/webapp/WebInfConfiguration$WebAppPathNameMatcher.class targeted to JDK 1.8
[INFO] Restricted to JDK 1.7 yet org.eclipse.jetty:jetty-security:jar:9.4.22.v20191022:compile contains org/eclipse/jetty/security/RunAsToken.class targeted to JDK 1.8
[INFO] Restricted to JDK 1.7 yet org.eclipse.jetty:jetty-client:jar:9.4.22.v20191022:test contains org/eclipse/jetty/client/RoundRobinConnectionPool$Entry.class targeted to JDK 1.8
[INFO] Restricted to JDK 1.7 yet org.eclipse.jetty:jetty-servlet:jar:9.4.22.v20191022:compile contains org/eclipse/jetty/servlet/ServletHandler.class targeted to JDK 1.8
[INFO] Restricted to JDK 1.7 yet org.eclipse.jetty:jetty-proxy:jar:9.4.22.v20191022:test contains org/eclipse/jetty/proxy/AfterContentTransformer.class targeted to JDK 1.8
[WARNING] Rule 0: org.apache.maven.plugins.enforcer.EnforceBytecodeVersion failed with message:
Found Banned Dependency: org.eclipse.jetty:jetty-util:jar:9.4.22.v20191022
Found Banned Dependency: org.eclipse.jetty:jetty-http:jar:9.4.22.v20191022
Found Banned Dependency: org.eclipse.jetty:jetty-server:jar:9.4.22.v20191022
Found Banned Dependency: org.eclipse.jetty:jetty-xml:jar:9.4.22.v20191022
Found Banned Dependency: org.eclipse.jetty:jetty-io:jar:9.4.22.v20191022
Found Banned Dependency: org.eclipse.jetty:jetty-webapp:jar:9.4.22.v20191022
Found Banned Dependency: org.eclipse.jetty:jetty-security:jar:9.4.22.v20191022
Found Banned Dependency: org.eclipse.jetty:jetty-client:jar:9.4.22.v20191022
Found Banned Dependency: org.eclipse.jetty:jetty-servlet:jar:9.4.22.v20191022
Found Banned Dependency: org.eclipse.jetty:jetty-proxy:jar:9.4.22.v20191022
Use 'mvn dependency:tree' to locate the source of the banned dependencies.
[INFO] ------------------------------------------------------------------------
[INFO] BUILD FAILURE
[INFO] ------------------------------------------------------------------------
[INFO] Total time:  27.194 s
[INFO] Finished at: 2019-11-01T05:47:31-07:00
[INFO] ------------------------------------------------------------------------
[INFO] [jenkins-event-spy] Generated F:\jenkins\jenkins-slave\workspace\en_jettyVersion-9.4.22.v20191022@3@2@tmp\withMaven1951c805\maven-spy-20191101-054704-8610170797099101976813.log
[ERROR] Failed to execute goal org.apache.maven.plugins:maven-enforcer-plugin:1.4.1:enforce (enforce-bytecode-version) on project maven-site-plugin: Some Enforcer rules have failed. Look above for specific messages explaining why the rule failed. -> [Help 1]
org.apache.maven.lifecycle.LifecycleExecutionException: Failed to execute goal org.apache.maven.plugins:maven-enforcer-plugin:1.4.1:enforce (enforce-bytecode-version) on project maven-site-plugin: Some Enforcer rules have failed. Look above for specific messages explaining why the rule failed.
    at org.apache.maven.lifecycle.internal.MojoExecutor.execute (MojoExecutor.java:215)
    at org.apache.maven.lifecycle.internal.MojoExecutor.execute (MojoExecutor.java:156)
    at org.apache.maven.lifecycle.internal.MojoExecutor.execute (MojoExecutor.java:148)
    at org.apache.maven.lifecycle.internal.LifecycleModuleBuilder.buildProject (LifecycleModuleBuilder.java:117)
    at org.apache.maven.lifecycle.internal.LifecycleModuleBuilder.buildProject (LifecycleModuleBuilder.java:81)
    at org.apache.maven.lifecycle.internal.builder.singlethreaded.SingleThreadedBuilder.build (SingleThreadedBuilder.java:56)
    at org.apache.maven.lifecycle.internal.LifecycleStarter.execute (LifecycleStarter.java:128)
    at org.apache.maven.DefaultMaven.doExecute (DefaultMaven.java:305)
    at org.apache.maven.DefaultMaven.doExecute (DefaultMaven.java:192)
    at org.apache.maven.DefaultMaven.execute (DefaultMaven.java:105)
    at org.apache.maven.cli.MavenCli.execute (MavenCli.java:956)
    at org.apache.maven.cli.MavenCli.doMain (MavenCli.java:288)
    at org.apache.maven.cli.MavenCli.main (MavenCli.java:192)
    at jdk.internal.reflect.NativeMethodAccessorImpl.invoke0 (Native Method)
    at jdk.internal.reflect.NativeMethodAccessorImpl.invoke (NativeMethodAccessorImpl.java:62)
    at jdk.internal.reflect.DelegatingMethodAccessorImpl.invoke (DelegatingMethodAccessorImpl.java:43)
    at java.lang.reflect.Method.invoke (Method.java:567)
    at org.codehaus.plexus.classworlds.launcher.Launcher.launchEnhanced (Launcher.java:282)
    at org.codehaus.plexus.classworlds.launcher.Launcher.launch (Launcher.java:225)
    at org.codehaus.plexus.classworlds.launcher.Launcher.mainWithExitCode (Launcher.java:406)
    at org.codehaus.plexus.classworlds.launcher.Launcher.main (Launcher.java:347)
Caused by: org.apache.maven.plugin.MojoExecutionException: Some Enforcer rules have failed. Look above for specific messages explaining why the rule failed.
    at org.apache.maven.plugins.enforcer.EnforceMojo.execute (EnforceMojo.java:237)
    at org.apache.maven.plugin.DefaultBuildPluginManager.executeMojo (DefaultBuildPluginManager.java:137)
    at org.apache.maven.lifecycle.internal.MojoExecutor.execute (MojoExecutor.java:210)
    at org.apache.maven.lifecycle.internal.MojoExecutor.execute (MojoExecutor.java:156)
    at org.apache.maven.lifecycle.internal.MojoExecutor.execute (MojoExecutor.java:148)
    at org.apache.maven.lifecycle.internal.LifecycleModuleBuilder.buildProject (LifecycleModuleBuilder.java:117)
    at org.apache.maven.lifecycle.internal.LifecycleModuleBuilder.buildProject (LifecycleModuleBuilder.java:81)
    at org.apache.maven.lifecycle.internal.builder.singlethreaded.SingleThreadedBuilder.build (SingleThreadedBuilder.java:56)
    at org.apache.maven.lifecycle.internal.LifecycleStarter.execute (LifecycleStarter.java:128)
    at org.apache.maven.DefaultMaven.doExecute (DefaultMaven.java:305)
    at org.apache.maven.DefaultMaven.doExecute (DefaultMaven.java:192)
    at org.apache.maven.DefaultMaven.execute (DefaultMaven.java:105)
    at org.apache.maven.cli.MavenCli.execute (MavenCli.java:956)
    at org.apache.maven.cli.MavenCli.doMain (MavenCli.java:288)
    at org.apache.maven.cli.MavenCli.main (MavenCli.java:192)
    at jdk.internal.reflect.NativeMethodAccessorImpl.invoke0 (Native Method)
    at jdk.internal.reflect.NativeMethodAccessorImpl.invoke (NativeMethodAccessorImpl.java:62)
    at jdk.internal.reflect.DelegatingMethodAccessorImpl.invoke (DelegatingMethodAccessorImpl.java:43)
    at java.lang.reflect.Method.invoke (Method.java:567)
    at org.codehaus.plexus.classworlds.launcher.Launcher.launchEnhanced (Launcher.java:282)
    at org.codehaus.plexus.classworlds.launcher.Launcher.launch (Launcher.java:225)
    at org.codehaus.plexus.classworlds.launcher.Launcher.mainWithExitCode (Launcher.java:406)
    at org.codehaus.plexus.classworlds.launcher.Launcher.main (Launcher.java:347)
[ERROR]
[ERROR] Re-run Maven using the -X switch to enable full debug logging.
[ERROR]
[ERROR] For more information about the errors and possible solutions, please read the following articles:
[ERROR] [Help 1] http://cwiki.apache.org/confluence/display/MAVEN/MojoExecutionException
[Pipeline] }
[Pipeline] // dir
[Pipeline] }
[Fast Archiver] No prior successful build to compare, so performing full copy of artifacts
[withMaven] openTasksPublisher - Scan Tasks for Maven artifact org.apache.maven.plugins:maven-site-plugin:maven-plugin:3.8.3-SNAPSHOT in source directory windows-jdk12-m3.6.x_build\src\main\java
[TASKS] Scanning folder 'f:\jenkins\jenkins-slave\workspace\en_jettyVersion-9.4.22.v20191022@3@2' for files matching the pattern 'windows-jdk12-m3.6.x_build\src\main\java\**\*' - excludes: null
[TASKS] Found 21 files to scan for tasks
[TASKS] Found 8 open tasks.
Skipping warnings blame since pipelines do not have an SCM link.%n
[withMaven] Publishers: Generated Artifacts Publisher: 6 ms, Open Task Scanner Publisher: 333 ms, Dependencies Fingerprint Publisher: 1 ms
[Pipeline] // withMaven
[Pipeline] cleanWs
[WS-CLEANUP] Deleting project workspace...
[WS-CLEANUP] Deferred wipeout is used...
[WS-CLEANUP] done
[Pipeline] cleanWs
[WS-CLEANUP] Deleting project workspace...
[WS-CLEANUP] Deferred wipeout is used...
[WS-CLEANUP] done
[Pipeline] }
[Pipeline] // stage
[Pipeline] }
[Pipeline] // ws
[Pipeline] }
[Pipeline] // node
[Pipeline] }
Failed in branch windows-jdk12-m3.6.x_build
[Pipeline] // parallel
[Pipeline] stage
[Pipeline] { (Notifications)
[Pipeline] echo
Build result: FAILURE
[Pipeline] jiraIssueSelector
[Pipeline] echo
The authors of changes [].
[Pipeline] echo
Sending email ...
[Pipeline] emailext
Reply | Threaded
Open this post in threaded view
|

Build failed in Jenkins: Maven TLP » maven-site-plugin » dependabot/maven/jettyVersion-9.4.22.v20191022 #2

Apache Jenkins Server-2
See https://builds.apache.org/job/maven-box/job/maven-site-plugin/job/dependabot%252Fmaven%252FjettyVersion-9.4.22.v20191022/2/

No changes.

No tests ran.

Build log:
[...truncated 3115 lines...]
[INFO] Scanning for projects...
[INFO]
[INFO] -------------< org.apache.maven.plugins:maven-site-plugin >-------------
[INFO] Building Apache Maven Site Plugin 3.9.0-SNAPSHOT
[INFO] ----------------------------[ maven-plugin ]----------------------------
[INFO] Scanning for projects...
[INFO]
[INFO] -------------< org.apache.maven.plugins:maven-site-plugin >-------------
[INFO] Building Apache Maven Site Plugin 3.9.0-SNAPSHOT
[INFO] ----------------------------[ maven-plugin ]----------------------------
[INFO]
[INFO] --- maven-clean-plugin:3.1.0:clean (default-clean) @ maven-site-plugin ---
[INFO]
[INFO] --- maven-enforcer-plugin:1.4.1:enforce (enforce-maven-version) @ maven-site-plugin ---
[INFO]
[INFO] --- maven-enforcer-plugin:1.4.1:enforce (enforce-bytecode-version) @ maven-site-plugin ---
[INFO]
[INFO] --- maven-clean-plugin:3.1.0:clean (default-clean) @ maven-site-plugin ---
[INFO]
[INFO] --- maven-enforcer-plugin:1.4.1:enforce (enforce-maven-version) @ maven-site-plugin ---
[INFO]
[INFO] --- maven-enforcer-plugin:1.4.1:enforce (enforce-bytecode-version) @ maven-site-plugin ---
[INFO] Restricted to JDK 1.7 yet org.eclipse.jetty:jetty-util:jar:9.4.22.v20191022:compile contains org/eclipse/jetty/util/StringUtil$CsvSplitState.class targeted to JDK 1.8
[INFO] Restricted to JDK 1.7 yet org.eclipse.jetty:jetty-http:jar:9.4.22.v20191022:compile contains org/eclipse/jetty/http/HttpField$IntValueHttpField.class targeted to JDK 1.8
[INFO] Restricted to JDK 1.7 yet org.eclipse.jetty:jetty-server:jar:9.4.22.v20191022:compile contains org/eclipse/jetty/server/HttpChannel$TransientListeners.class targeted to JDK 1.8
[INFO] Restricted to JDK 1.7 yet org.eclipse.jetty:jetty-xml:jar:9.4.22.v20191022:compile contains org/eclipse/jetty/xml/XmlParser$Node.class targeted to JDK 1.8
[INFO] Restricted to JDK 1.7 yet org.eclipse.jetty:jetty-io:jar:9.4.22.v20191022:compile contains org/eclipse/jetty/io/ManagedSelector$Accept.class targeted to JDK 1.8
[INFO] Restricted to JDK 1.7 yet org.eclipse.jetty:jetty-webapp:jar:9.4.22.v20191022:compile contains org/eclipse/jetty/webapp/WebInfConfiguration$WebAppPathNameMatcher.class targeted to JDK 1.8
[INFO] Restricted to JDK 1.7 yet org.eclipse.jetty:jetty-security:jar:9.4.22.v20191022:compile contains org/eclipse/jetty/security/RunAsToken.class targeted to JDK 1.8
[INFO] Restricted to JDK 1.7 yet org.eclipse.jetty:jetty-client:jar:9.4.22.v20191022:test contains org/eclipse/jetty/client/RoundRobinConnectionPool$Entry.class targeted to JDK 1.8
[INFO] Restricted to JDK 1.7 yet org.eclipse.jetty:jetty-servlet:jar:9.4.22.v20191022:compile contains org/eclipse/jetty/servlet/ServletHandler.class targeted to JDK 1.8
[INFO] Restricted to JDK 1.7 yet org.eclipse.jetty:jetty-proxy:jar:9.4.22.v20191022:test contains org/eclipse/jetty/proxy/AfterContentTransformer.class targeted to JDK 1.8
[WARNING] Rule 0: org.apache.maven.plugins.enforcer.EnforceBytecodeVersion failed with message:
Found Banned Dependency: org.eclipse.jetty:jetty-util:jar:9.4.22.v20191022
Found Banned Dependency: org.eclipse.jetty:jetty-http:jar:9.4.22.v20191022
Found Banned Dependency: org.eclipse.jetty:jetty-server:jar:9.4.22.v20191022
Found Banned Dependency: org.eclipse.jetty:jetty-xml:jar:9.4.22.v20191022
Found Banned Dependency: org.eclipse.jetty:jetty-io:jar:9.4.22.v20191022
Found Banned Dependency: org.eclipse.jetty:jetty-webapp:jar:9.4.22.v20191022
Found Banned Dependency: org.eclipse.jetty:jetty-security:jar:9.4.22.v20191022
Found Banned Dependency: org.eclipse.jetty:jetty-client:jar:9.4.22.v20191022
Found Banned Dependency: org.eclipse.jetty:jetty-servlet:jar:9.4.22.v20191022
Found Banned Dependency: org.eclipse.jetty:jetty-proxy:jar:9.4.22.v20191022
Use 'mvn dependency:tree' to locate the source of the banned dependencies.
[INFO] ------------------------------------------------------------------------
[INFO] BUILD FAILURE
[INFO] ------------------------------------------------------------------------
[INFO] Total time:  3.800 s
[INFO] Finished at: 2019-11-09T06:46:55-08:00
[INFO] ------------------------------------------------------------------------
[INFO] [jenkins-event-spy] Generated F:\jenkins\jenkins-slave\workspace\en_jettyVersion-9.4.22.v20191022@2@2@tmp\withMavene92ebab8\maven-spy-20191109-064651-5396717616531458136560.log
[ERROR] Failed to execute goal org.apache.maven.plugins:maven-enforcer-plugin:1.4.1:enforce (enforce-bytecode-version) on project maven-site-plugin: Some Enforcer rules have failed. Look above for specific messages explaining why the rule failed. -> [Help 1]
org.apache.maven.lifecycle.LifecycleExecutionException: Failed to execute goal org.apache.maven.plugins:maven-enforcer-plugin:1.4.1:enforce (enforce-bytecode-version) on project maven-site-plugin: Some Enforcer rules have failed. Look above for specific messages explaining why the rule failed.
    at org.apache.maven.lifecycle.internal.MojoExecutor.execute (MojoExecutor.java:215)
    at org.apache.maven.lifecycle.internal.MojoExecutor.execute (MojoExecutor.java:156)
    at org.apache.maven.lifecycle.internal.MojoExecutor.execute (MojoExecutor.java:148)
    at org.apache.maven.lifecycle.internal.LifecycleModuleBuilder.buildProject (LifecycleModuleBuilder.java:117)
    at org.apache.maven.lifecycle.internal.LifecycleModuleBuilder.buildProject (LifecycleModuleBuilder.java:81)
    at org.apache.maven.lifecycle.internal.builder.singlethreaded.SingleThreadedBuilder.build (SingleThreadedBuilder.java:56)
    at org.apache.maven.lifecycle.internal.LifecycleStarter.execute (LifecycleStarter.java:128)
    at org.apache.maven.DefaultMaven.doExecute (DefaultMaven.java:305)
    at org.apache.maven.DefaultMaven.doExecute (DefaultMaven.java:192)
    at org.apache.maven.DefaultMaven.execute (DefaultMaven.java:105)
    at org.apache.maven.cli.MavenCli.execute (MavenCli.java:956)
    at org.apache.maven.cli.MavenCli.doMain (MavenCli.java:288)
    at org.apache.maven.cli.MavenCli.main (MavenCli.java:192)
    at jdk.internal.reflect.NativeMethodAccessorImpl.invoke0 (Native Method)
    at jdk.internal.reflect.NativeMethodAccessorImpl.invoke (NativeMethodAccessorImpl.java:62)
    at jdk.internal.reflect.DelegatingMethodAccessorImpl.invoke (DelegatingMethodAccessorImpl.java:43)
    at java.lang.reflect.Method.invoke (Method.java:567)
    at org.codehaus.plexus.classworlds.launcher.Launcher.launchEnhanced (Launcher.java:282)
    at org.codehaus.plexus.classworlds.launcher.Launcher.launch (Launcher.java:225)
    at org.codehaus.plexus.classworlds.launcher.Launcher.mainWithExitCode (Launcher.java:406)
    at org.codehaus.plexus.classworlds.launcher.Launcher.main (Launcher.java:347)
Caused by: org.apache.maven.plugin.MojoExecutionException: Some Enforcer rules have failed. Look above for specific messages explaining why the rule failed.
    at org.apache.maven.plugins.enforcer.EnforceMojo.execute (EnforceMojo.java:237)
    at org.apache.maven.plugin.DefaultBuildPluginManager.executeMojo (DefaultBuildPluginManager.java:137)
    at org.apache.maven.lifecycle.internal.MojoExecutor.execute (MojoExecutor.java:210)
    at org.apache.maven.lifecycle.internal.MojoExecutor.execute (MojoExecutor.java:156)
    at org.apache.maven.lifecycle.internal.MojoExecutor.execute (MojoExecutor.java:148)
    at org.apache.maven.lifecycle.internal.LifecycleModuleBuilder.buildProject (LifecycleModuleBuilder.java:117)
    at org.apache.maven.lifecycle.internal.LifecycleModuleBuilder.buildProject (LifecycleModuleBuilder.java:81)
    at org.apache.maven.lifecycle.internal.builder.singlethreaded.SingleThreadedBuilder.build (SingleThreadedBuilder.java:56)
    at org.apache.maven.lifecycle.internal.LifecycleStarter.execute (LifecycleStarter.java:128)
    at org.apache.maven.DefaultMaven.doExecute (DefaultMaven.java:305)
    at org.apache.maven.DefaultMaven.doExecute (DefaultMaven.java:192)
    at org.apache.maven.DefaultMaven.execute (DefaultMaven.java:105)
    at org.apache.maven.cli.MavenCli.execute (MavenCli.java:956)
    at org.apache.maven.cli.MavenCli.doMain (MavenCli.java:288)
    at org.apache.maven.cli.MavenCli.main (MavenCli.java:192)
    at jdk.internal.reflect.NativeMethodAccessorImpl.invoke0 (Native Method)
    at jdk.internal.reflect.NativeMethodAccessorImpl.invoke (NativeMethodAccessorImpl.java:62)
    at jdk.internal.reflect.DelegatingMethodAccessorImpl.invoke (DelegatingMethodAccessorImpl.java:43)
    at java.lang.reflect.Method.invoke (Method.java:567)
    at org.codehaus.plexus.classworlds.launcher.Launcher.launchEnhanced (Launcher.java:282)
    at org.codehaus.plexus.classworlds.launcher.Launcher.launch (Launcher.java:225)
    at org.codehaus.plexus.classworlds.launcher.Launcher.mainWithExitCode (Launcher.java:406)
    at org.codehaus.plexus.classworlds.launcher.Launcher.main (Launcher.java:347)
[ERROR]
[ERROR] Re-run Maven using the -X switch to enable full debug logging.
[ERROR]
[ERROR] For more information about the errors and possible solutions, please read the following articles:
[ERROR] [Help 1] http://cwiki.apache.org/confluence/display/MAVEN/MojoExecutionException
[Pipeline] }
[Pipeline] // dir
[Pipeline] }
[Fast Archiver] No prior successful build to compare, so performing full copy of artifacts
[withMaven] openTasksPublisher - Scan Tasks for Maven artifact org.apache.maven.plugins:maven-site-plugin:maven-plugin:3.9.0-SNAPSHOT in source directory windows-jdk12-m3.6.x_build\src\main\java
[TASKS] Scanning folder 'f:\jenkins\jenkins-slave\workspace\en_jettyVersion-9.4.22.v20191022@2@2' for files matching the pattern 'windows-jdk12-m3.6.x_build\src\main\java\**\*' - excludes: null
[TASKS] Found 21 files to scan for tasks
[TASKS] Found 8 open tasks.
Skipping warnings blame since pipelines do not have an SCM link.%n
[withMaven] Publishers: Generated Artifacts Publisher: 7 ms, Open Task Scanner Publisher: 229 ms, Dependencies Fingerprint Publisher: 1 ms
[Pipeline] // withMaven
[Pipeline] cleanWs
[WS-CLEANUP] Deleting project workspace...
[WS-CLEANUP] Deferred wipeout is used...
[WS-CLEANUP] done
[Pipeline] cleanWs
[WS-CLEANUP] Deleting project workspace...
[WS-CLEANUP] Deferred wipeout is used...
[WS-CLEANUP] done
[Pipeline] }
[Pipeline] // stage
[Pipeline] }
[Pipeline] // ws
[Pipeline] }
[Pipeline] // node
[Pipeline] }
Failed in branch windows-jdk12-m3.6.x_build
[INFO] Restricted to JDK 1.7 yet org.eclipse.jetty:jetty-util:jar:9.4.22.v20191022:compile contains org/eclipse/jetty/util/StringUtil$CsvSplitState.class targeted to JDK 1.8
[INFO] Restricted to JDK 1.7 yet org.eclipse.jetty:jetty-http:jar:9.4.22.v20191022:compile contains org/eclipse/jetty/http/HttpField$IntValueHttpField.class targeted to JDK 1.8
[INFO] Restricted to JDK 1.7 yet org.eclipse.jetty:jetty-server:jar:9.4.22.v20191022:compile contains org/eclipse/jetty/server/HttpChannel$TransientListeners.class targeted to JDK 1.8
[INFO] Restricted to JDK 1.7 yet org.eclipse.jetty:jetty-xml:jar:9.4.22.v20191022:compile contains org/eclipse/jetty/xml/XmlParser$Node.class targeted to JDK 1.8
[INFO] Restricted to JDK 1.7 yet org.eclipse.jetty:jetty-io:jar:9.4.22.v20191022:compile contains org/eclipse/jetty/io/ManagedSelector$Accept.class targeted to JDK 1.8
[INFO] Restricted to JDK 1.7 yet org.eclipse.jetty:jetty-webapp:jar:9.4.22.v20191022:compile contains org/eclipse/jetty/webapp/WebInfConfiguration$WebAppPathNameMatcher.class targeted to JDK 1.8
[INFO] Restricted to JDK 1.7 yet org.eclipse.jetty:jetty-security:jar:9.4.22.v20191022:compile contains org/eclipse/jetty/security/RunAsToken.class targeted to JDK 1.8
[INFO] Restricted to JDK 1.7 yet org.eclipse.jetty:jetty-client:jar:9.4.22.v20191022:test contains org/eclipse/jetty/client/RoundRobinConnectionPool$Entry.class targeted to JDK 1.8
[INFO] Restricted to JDK 1.7 yet org.eclipse.jetty:jetty-servlet:jar:9.4.22.v20191022:compile contains org/eclipse/jetty/servlet/ServletHandler.class targeted to JDK 1.8
[INFO] Restricted to JDK 1.7 yet org.eclipse.jetty:jetty-proxy:jar:9.4.22.v20191022:test contains org/eclipse/jetty/proxy/AfterContentTransformer.class targeted to JDK 1.8
[WARNING] Rule 0: org.apache.maven.plugins.enforcer.EnforceBytecodeVersion failed with message:
Found Banned Dependency: org.eclipse.jetty:jetty-util:jar:9.4.22.v20191022
Found Banned Dependency: org.eclipse.jetty:jetty-http:jar:9.4.22.v20191022
Found Banned Dependency: org.eclipse.jetty:jetty-server:jar:9.4.22.v20191022
Found Banned Dependency: org.eclipse.jetty:jetty-xml:jar:9.4.22.v20191022
Found Banned Dependency: org.eclipse.jetty:jetty-io:jar:9.4.22.v20191022
Found Banned Dependency: org.eclipse.jetty:jetty-webapp:jar:9.4.22.v20191022
Found Banned Dependency: org.eclipse.jetty:jetty-security:jar:9.4.22.v20191022
Found Banned Dependency: org.eclipse.jetty:jetty-client:jar:9.4.22.v20191022
Found Banned Dependency: org.eclipse.jetty:jetty-servlet:jar:9.4.22.v20191022
Found Banned Dependency: org.eclipse.jetty:jetty-proxy:jar:9.4.22.v20191022
Use 'mvn dependency:tree' to locate the source of the banned dependencies.
[INFO] ------------------------------------------------------------------------
[INFO] BUILD FAILURE
[INFO] ------------------------------------------------------------------------
[INFO] Total time:  3.967 s
[INFO] Finished at: 2019-11-09T06:46:56-08:00
[INFO] ------------------------------------------------------------------------
[INFO] [jenkins-event-spy] Generated F:\jenkins\jenkins-slave\workspace\en_jettyVersion-9.4.22.v20191022@2@tmp\withMaven897a56f3\maven-spy-20191109-064651-88914710506680024513436.log
[ERROR] Failed to execute goal org.apache.maven.plugins:maven-enforcer-plugin:1.4.1:enforce (enforce-bytecode-version) on project maven-site-plugin: Some Enforcer rules have failed. Look above for specific messages explaining why the rule failed. -> [Help 1]
org.apache.maven.lifecycle.LifecycleExecutionException: Failed to execute goal org.apache.maven.plugins:maven-enforcer-plugin:1.4.1:enforce (enforce-bytecode-version) on project maven-site-plugin: Some Enforcer rules have failed. Look above for specific messages explaining why the rule failed.
    at org.apache.maven.lifecycle.internal.MojoExecutor.execute (MojoExecutor.java:215)
    at org.apache.maven.lifecycle.internal.MojoExecutor.execute (MojoExecutor.java:156)
    at org.apache.maven.lifecycle.internal.MojoExecutor.execute (MojoExecutor.java:148)
    at org.apache.maven.lifecycle.internal.LifecycleModuleBuilder.buildProject (LifecycleModuleBuilder.java:117)
    at org.apache.maven.lifecycle.internal.LifecycleModuleBuilder.buildProject (LifecycleModuleBuilder.java:81)
    at org.apache.maven.lifecycle.internal.builder.singlethreaded.SingleThreadedBuilder.build (SingleThreadedBuilder.java:56)
    at org.apache.maven.lifecycle.internal.LifecycleStarter.execute (LifecycleStarter.java:128)
    at org.apache.maven.DefaultMaven.doExecute (DefaultMaven.java:305)
    at org.apache.maven.DefaultMaven.doExecute (DefaultMaven.java:192)
    at org.apache.maven.DefaultMaven.execute (DefaultMaven.java:105)
    at org.apache.maven.cli.MavenCli.execute (MavenCli.java:956)
    at org.apache.maven.cli.MavenCli.doMain (MavenCli.java:288)
    at org.apache.maven.cli.MavenCli.main (MavenCli.java:192)
    at jdk.internal.reflect.NativeMethodAccessorImpl.invoke0 (Native Method)
    at jdk.internal.reflect.NativeMethodAccessorImpl.invoke (NativeMethodAccessorImpl.java:62)
    at jdk.internal.reflect.DelegatingMethodAccessorImpl.invoke (DelegatingMethodAccessorImpl.java:43)
    at java.lang.reflect.Method.invoke (Method.java:566)
    at org.codehaus.plexus.classworlds.launcher.Launcher.launchEnhanced (Launcher.java:282)
    at org.codehaus.plexus.classworlds.launcher.Launcher.launch (Launcher.java:225)
    at org.codehaus.plexus.classworlds.launcher.Launcher.mainWithExitCode (Launcher.java:406)
    at org.codehaus.plexus.classworlds.launcher.Launcher.main (Launcher.java:347)
Caused by: org.apache.maven.plugin.MojoExecutionException: Some Enforcer rules have failed. Look above for specific messages explaining why the rule failed.
    at org.apache.maven.plugins.enforcer.EnforceMojo.execute (EnforceMojo.java:237)
    at org.apache.maven.plugin.DefaultBuildPluginManager.executeMojo (DefaultBuildPluginManager.java:137)
    at org.apache.maven.lifecycle.internal.MojoExecutor.execute (MojoExecutor.java:210)
    at org.apache.maven.lifecycle.internal.MojoExecutor.execute (MojoExecutor.java:156)
    at org.apache.maven.lifecycle.internal.MojoExecutor.execute (MojoExecutor.java:148)
    at org.apache.maven.lifecycle.internal.LifecycleModuleBuilder.buildProject (LifecycleModuleBuilder.java:117)
    at org.apache.maven.lifecycle.internal.LifecycleModuleBuilder.buildProject (LifecycleModuleBuilder.java:81)
    at org.apache.maven.lifecycle.internal.builder.singlethreaded.SingleThreadedBuilder.build (SingleThreadedBuilder.java:56)
    at org.apache.maven.lifecycle.internal.LifecycleStarter.execute (LifecycleStarter.java:128)
    at org.apache.maven.DefaultMaven.doExecute (DefaultMaven.java:305)
    at org.apache.maven.DefaultMaven.doExecute (DefaultMaven.java:192)
    at org.apache.maven.DefaultMaven.execute (DefaultMaven.java:105)
    at org.apache.maven.cli.MavenCli.execute (MavenCli.java:956)
    at org.apache.maven.cli.MavenCli.doMain (MavenCli.java:288)
    at org.apache.maven.cli.MavenCli.main (MavenCli.java:192)
    at jdk.internal.reflect.NativeMethodAccessorImpl.invoke0 (Native Method)
    at jdk.internal.reflect.NativeMethodAccessorImpl.invoke (NativeMethodAccessorImpl.java:62)
    at jdk.internal.reflect.DelegatingMethodAccessorImpl.invoke (DelegatingMethodAccessorImpl.java:43)
    at java.lang.reflect.Method.invoke (Method.java:566)
    at org.codehaus.plexus.classworlds.launcher.Launcher.launchEnhanced (Launcher.java:282)
    at org.codehaus.plexus.classworlds.launcher.Launcher.launch (Launcher.java:225)
    at org.codehaus.plexus.classworlds.launcher.Launcher.mainWithExitCode (Launcher.java:406)
    at org.codehaus.plexus.classworlds.launcher.Launcher.main (Launcher.java:347)
[ERROR]
[ERROR] Re-run Maven using the -X switch to enable full debug logging.
[ERROR]
[ERROR] For more information about the errors and possible solutions, please read the following articles:
[ERROR] [Help 1] http://cwiki.apache.org/confluence/display/MAVEN/MojoExecutionException
[Pipeline] }
[Pipeline] // dir
[Pipeline] }
[Fast Archiver] No prior successful build to compare, so performing full copy of artifacts
[withMaven] openTasksPublisher - Scan Tasks for Maven artifact org.apache.maven.plugins:maven-site-plugin:maven-plugin:3.9.0-SNAPSHOT in source directory windows-jdk11-m3.6.x_build\src\main\java
[TASKS] Scanning folder 'f:\jenkins\jenkins-slave\workspace\en_jettyVersion-9.4.22.v20191022@2' for files matching the pattern 'windows-jdk11-m3.6.x_build\src\main\java\**\*' - excludes: null
[TASKS] Found 21 files to scan for tasks
[TASKS] Found 8 open tasks.
Skipping warnings blame since pipelines do not have an SCM link.%n
[withMaven] Publishers: Generated Artifacts Publisher: 8 ms, Open Task Scanner Publisher: 276 ms, Dependencies Fingerprint Publisher: 1 ms
[Pipeline] // withMaven
[Pipeline] cleanWs
[WS-CLEANUP] Deleting project workspace...
[WS-CLEANUP] Deferred wipeout is used...
[WS-CLEANUP] done
[Pipeline] cleanWs
[WS-CLEANUP] Deleting project workspace...
[WS-CLEANUP] Deferred wipeout is used...
[WS-CLEANUP] done
[Pipeline] }
[Pipeline] // stage
[Pipeline] }
[Pipeline] // ws
[Pipeline] }
[Pipeline] // node
[Pipeline] }
Failed in branch windows-jdk11-m3.6.x_build
[Pipeline] // parallel
[Pipeline] stage
[Pipeline] { (Notifications)
[Pipeline] echo
Build result: FAILURE
[Pipeline] jiraIssueSelector
[Pipeline] echo
The authors of changes [].
[Pipeline] echo
Sending email ...
[Pipeline] emailext