Build failed in Jenkins: Maven TLP » maven-site-plugin » MSITE-845 #1

classic Classic list List threaded Threaded
3 messages Options
Reply | Threaded
Open this post in threaded view
|

Build failed in Jenkins: Maven TLP » maven-site-plugin » MSITE-845 #1

Apache Jenkins Server-2
See https://builds.apache.org/job/maven-box/job/maven-site-plugin/job/MSITE-845/1/

No changes.

All tests passed

Build log:
[...truncated 10796 lines...]
[withMaven] artifactsPublisher - Archive artifact windows-jdk7-m3.3.x_build\target\maven-site-plugin-3.8.2-SNAPSHOT.jar under org\apache\maven\plugins\maven-site-plugin\3.8.2-SNAPSHOT\maven-site-plugin-3.8.2-SNAPSHOT.jar
[Fast Archiver] No prior successful build to compare, so performing full copy of artifacts
[INFO] run post-build script verify.bsh
[INFO]           site-skip\pom.xml ................................ SUCCESS (8.1 s)
[INFO] Building: surefire-report\pom.xml
[withMaven] junitPublisher - Archive test results for Maven artifact org.apache.maven.plugins:maven-site-plugin:maven-plugin:3.8.2-SNAPSHOT generated by maven-surefire-plugin:test (default-test): windows-jdk7-m3.3.x_build\target\surefire-reports\*.xml
Recording test results
[withMaven] openTasksPublisher - Scan Tasks for Maven artifact org.apache.maven.plugins:maven-site-plugin:maven-plugin:3.8.2-SNAPSHOT in source directory windows-jdk7-m3.3.x_build\src\main\java
[TASKS] Scanning folder 'f:\jenkins\jenkins-slave\workspace\-box_maven-site-plugin_MSITE-845@2@2' for files matching the pattern 'windows-jdk7-m3.3.x_build\src\main\java\**\*' - excludes: null
[TASKS] Found 21 files to scan for tasks
[TASKS] Found 8 open tasks.
Skipping warnings blame since pipelines do not have an SCM link.%n
[withMaven] invokerPublisher - Archive invoker results for Maven artifact MavenArtifact{org.apache.maven.plugins:maven-site-plugin:maven-plugin:3.8.2-SNAPSHOT(version: 3.8.2-SNAPSHOT, snapshot:false) } generated by PluginInvocation{org.apache.maven.plugins:maven-invoker-plugin:3.1.0@integration-test  integration-test}: windows-jdk7-m3.3.x_build\target\invoker-reports\*.xml
[INFO] run post-build script verify.bsh
[INFO]           site-skip\pom.xml ................................ SUCCESS (7.9 s)
[INFO] Building: surefire-report\pom.xml
[INFO] artifact junit.junit.3.8.2:junit-3.8.2.jar: checking for updates from central
[INFO] artifact log4j.log4j.1.2.16:log4j-1.2.16.jar: checking for updates from central
[INFO]           MSITE-497/pom.xml ................................ SUCCESS (17.2 s)
[INFO] Building: MSITE-705-no-debug/pom.xml
[INFO] run post-build script verify.groovy
[INFO]           surefire-report\pom.xml .......................... SUCCESS (8.8 s)
[INFO] Building: template-skin\pom.xml
[INFO] run post-build script verify.groovy
[INFO]           surefire-report\pom.xml .......................... SUCCESS (9.2 s)
[INFO] Building: template-skin\pom.xml
[INFO] run post-build script verify.groovy
[INFO]           MSITE-705-no-debug/pom.xml ....................... SUCCESS (6.8 s)
[INFO] Building: MSITE-159/pom.xml
[withMaven] Publishers: Generated Artifacts Publisher: 958 ms, Junit Publisher: 1579 ms, Open Task Scanner Publisher: 1449 ms, Dependencies Fingerprint Publisher: 1 ms, Invoker Publisher: 57419 ms, Pipeline Graph Publisher: 2 ms
[Pipeline] // withMaven
[Pipeline] cleanWs
[WS-CLEANUP] Deleting project workspace...
[WS-CLEANUP] Deferred wipeout is used...
[INFO] run post-build script verify.bsh
[INFO]           MSITE-159/pom.xml ................................ SUCCESS (4.9 s)
[INFO] Building: site-sd-2/pom.xml
[WS-CLEANUP] done
[Pipeline] }
[Pipeline] // stage
[Pipeline] }
[Pipeline] // ws
[Pipeline] }
[Pipeline] // node
[Pipeline] }
[INFO] snapshot org.apache.maven.plugins.site.its:template-skin:1.0-SNAPSHOT: checking for updates from apache-snapshots
[INFO] snapshot org.apache.maven.plugins.site.its:template-skin:1.0-SNAPSHOT: checking for updates from Nexus
[INFO] artifact org.apache.maven.plugins.site.its.template-skin:1.0-SNAPSHOT: checking for updates from central
[INFO] run post-build script verify.bsh
[INFO]           template-skin\pom.xml ............................ SUCCESS (12.6 s)
[INFO] Building: validate\pom.xml
[INFO] run post-build script verify.bsh
[INFO]           template-skin\pom.xml ............................ SUCCESS (12.4 s)
[INFO] Building: validate\pom.xml
[INFO] run post-build script verify.groovy
[INFO]           site-sd-2/pom.xml ................................ SUCCESS (9.2 s)
[INFO] Building: MSITE-609/pom.xml
[INFO] run post-build script verify.groovy
[INFO]           validate\pom.xml ................................. SUCCESS (6.1 s)
[INFO]
[INFO] --- mrm-maven-plugin:1.2.0:stop (default) @ maven-site-plugin ---
[INFO] Stopping Mock Repository Manager on http://localhost:54644
[INFO] Stopped SocketConnector@0.0.0.0:54644
[INFO] Mock Repository Manager http://localhost:54644 is stopped.
[INFO]
[INFO] --- maven-checkstyle-plugin:3.0.0:check (checkstyle-check) @ maven-site-plugin ---
[withMaven] Publishers: Generated Artifacts Publisher: 249 ms, Junit Publisher: 134 ms, Open Task Scanner Publisher: 113 ms, Dependencies Fingerprint Publisher: 1 ms, Invoker Publisher: 31826 ms, Pipeline Graph Publisher: 2 ms
[Pipeline] // withMaven
[Pipeline] cleanWs
[WS-CLEANUP] Deleting project workspace...
[WS-CLEANUP] Deferred wipeout is used...
[WS-CLEANUP] done
[Pipeline] }
[Pipeline] // stage
[Pipeline] }
[Pipeline] // ws
[Pipeline] }
[Pipeline] // node
[Pipeline] }
[INFO] run post-build script verify.groovy
[INFO]           validate\pom.xml ................................. SUCCESS (5.9 s)
[INFO]
[INFO] --- mrm-maven-plugin:1.2.0:stop (default) @ maven-site-plugin ---
[INFO] Stopping Mock Repository Manager on http://localhost:54643
[INFO] Stopped SocketConnector@0.0.0.0:54643
[INFO] Mock Repository Manager http://localhost:54643 is stopped.
[INFO]
[INFO] --- maven-checkstyle-plugin:3.0.0:check (checkstyle-check) @ maven-site-plugin ---
[INFO]
[INFO] --- maven-invoker-plugin:3.1.0:verify (integration-test) @ maven-site-plugin ---
[INFO] -------------------------------------------------
[INFO] Build Summary:
[INFO]   Passed: 56, Failed: 0, Errors: 0, Skipped: 0
[INFO] -------------------------------------------------
[INFO] ------------------------------------------------------------------------
[INFO] BUILD SUCCESS
[INFO] ------------------------------------------------------------------------
[INFO] Total time:  11:51 min
[INFO] Finished at: 2019-07-08T05:33:20-07:00
[INFO] ------------------------------------------------------------------------
[INFO] [jenkins-event-spy] Generated F:\jenkins\jenkins-slave\workspace\-box_maven-site-plugin_MSITE-845@3@tmp\withMavend0481a3d\maven-spy-20190708-052129-979507899848601107873.log
[Pipeline] }
[Pipeline] // dir
[Pipeline] }
[withMaven] artifactsPublisher - Archive artifact windows-jdk11-m3.6.x_build\pom.xml under org\apache\maven\plugins\maven-site-plugin\3.8.2-SNAPSHOT\maven-site-plugin-3.8.2-SNAPSHOT.pom
[withMaven] artifactsPublisher - Archive artifact windows-jdk11-m3.6.x_build\target\maven-site-plugin-3.8.2-SNAPSHOT.jar under org\apache\maven\plugins\maven-site-plugin\3.8.2-SNAPSHOT\maven-site-plugin-3.8.2-SNAPSHOT.jar
[Fast Archiver] No prior successful build to compare, so performing full copy of artifacts
[withMaven] junitPublisher - Archive test results for Maven artifact org.apache.maven.plugins:maven-site-plugin:maven-plugin:3.8.2-SNAPSHOT generated by maven-surefire-plugin:test (default-test): windows-jdk11-m3.6.x_build\target\surefire-reports\*.xml
Recording test results
[withMaven] openTasksPublisher - Scan Tasks for Maven artifact org.apache.maven.plugins:maven-site-plugin:maven-plugin:3.8.2-SNAPSHOT in source directory windows-jdk11-m3.6.x_build\src\main\java
[TASKS] Scanning folder 'f:\jenkins\jenkins-slave\workspace\-box_maven-site-plugin_MSITE-845@3' for files matching the pattern 'windows-jdk11-m3.6.x_build\src\main\java\**\*' - excludes: null
[TASKS] Found 21 files to scan for tasks
[TASKS] Found 8 open tasks.
Skipping warnings blame since pipelines do not have an SCM link.%n
[withMaven] invokerPublisher - Archive invoker results for Maven artifact MavenArtifact{org.apache.maven.plugins:maven-site-plugin:maven-plugin:3.8.2-SNAPSHOT(version: 3.8.2-SNAPSHOT, snapshot:false) } generated by PluginInvocation{org.apache.maven.plugins:maven-invoker-plugin:3.1.0@integration-test  integration-test}: windows-jdk11-m3.6.x_build\target\invoker-reports\*.xml
[INFO]
[INFO] --- maven-invoker-plugin:3.1.0:verify (integration-test) @ maven-site-plugin ---
[INFO] -------------------------------------------------
[INFO] Build Summary:
[INFO]   Passed: 56, Failed: 0, Errors: 0, Skipped: 0
[INFO] -------------------------------------------------
[INFO] ------------------------------------------------------------------------
[INFO] BUILD SUCCESS
[INFO] ------------------------------------------------------------------------
[INFO] Total time:  11:52 min
[INFO] Finished at: 2019-07-08T05:33:22-07:00
[INFO] ------------------------------------------------------------------------
[INFO] [jenkins-event-spy] Generated F:\jenkins\jenkins-slave\workspace\-box_maven-site-plugin_MSITE-845@2@2@tmp\withMavene364eacf\maven-spy-20190708-052129-19311419283790457744004.log
[Pipeline] }
[Pipeline] // dir
[Pipeline] }
[withMaven] artifactsPublisher - Archive artifact windows-jdk12-m3.6.x_build\pom.xml under org\apache\maven\plugins\maven-site-plugin\3.8.2-SNAPSHOT\maven-site-plugin-3.8.2-SNAPSHOT.pom
[INFO] run post-build script verify.bsh
[INFO]           MSITE-609/pom.xml ................................ SUCCESS (5.1 s)
[INFO] Building: empty-report-set/pom.xml
[withMaven] artifactsPublisher - Archive artifact windows-jdk12-m3.6.x_build\target\maven-site-plugin-3.8.2-SNAPSHOT.jar under org\apache\maven\plugins\maven-site-plugin\3.8.2-SNAPSHOT\maven-site-plugin-3.8.2-SNAPSHOT.jar
[Fast Archiver] No prior successful build to compare, so performing full copy of artifacts
[withMaven] junitPublisher - Archive test results for Maven artifact org.apache.maven.plugins:maven-site-plugin:maven-plugin:3.8.2-SNAPSHOT generated by maven-surefire-plugin:test (default-test): windows-jdk12-m3.6.x_build\target\surefire-reports\*.xml
Recording test results
[withMaven] openTasksPublisher - Scan Tasks for Maven artifact org.apache.maven.plugins:maven-site-plugin:maven-plugin:3.8.2-SNAPSHOT in source directory windows-jdk12-m3.6.x_build\src\main\java
[TASKS] Scanning folder 'f:\jenkins\jenkins-slave\workspace\-box_maven-site-plugin_MSITE-845@2@2' for files matching the pattern 'windows-jdk12-m3.6.x_build\src\main\java\**\*' - excludes: null
[TASKS] Found 21 files to scan for tasks
[TASKS] Found 8 open tasks.
Skipping warnings blame since pipelines do not have an SCM link.%n
[withMaven] invokerPublisher - Archive invoker results for Maven artifact MavenArtifact{org.apache.maven.plugins:maven-site-plugin:maven-plugin:3.8.2-SNAPSHOT(version: 3.8.2-SNAPSHOT, snapshot:false) } generated by PluginInvocation{org.apache.maven.plugins:maven-invoker-plugin:3.1.0@integration-test  integration-test}: windows-jdk12-m3.6.x_build\target\invoker-reports\*.xml
[withMaven] Publishers: Generated Artifacts Publisher: 266 ms, Junit Publisher: 111 ms, Open Task Scanner Publisher: 112 ms, Dependencies Fingerprint Publisher: 1 ms, Invoker Publisher: 32288 ms, Pipeline Graph Publisher: 1 ms
[Pipeline] // withMaven
[Pipeline] cleanWs
[WS-CLEANUP] Deleting project workspace...
[WS-CLEANUP] Deferred wipeout is used...
[WS-CLEANUP] done
[Pipeline] }
[Pipeline] // stage
[Pipeline] }
[Pipeline] // ws
[Pipeline] }
[Pipeline] // node
[Pipeline] }
[INFO] run post-build script verify.bsh
[INFO]           empty-report-set/pom.xml ......................... SUCCESS (4.2 s)
[INFO] Building: report-changes-generation/pom.xml
[INFO] run post-build script verify.bsh
[INFO]           report-changes-generation/pom.xml ................ SUCCESS (5.3 s)
[INFO] Building: site-deploy/pom.xml
[INFO] run post-build script verify.bsh
[INFO]           site-deploy/pom.xml .............................. SUCCESS (5.3 s)
[INFO] Building: site-sd-top-parent-no-site/pom.xml
[INFO] run post-build script verify.groovy
[INFO]           site-sd-top-parent-no-site/pom.xml ............... SUCCESS (7.6 s)
[INFO]
[INFO] --- mrm-maven-plugin:1.2.0:stop (default) @ maven-site-plugin ---
[INFO] Stopping Mock Repository Manager on http://localhost:41226
[INFO] Stopped SocketConnector@0.0.0.0:41226
[INFO] Mock Repository Manager http://localhost:41226 is stopped.
[INFO]
[INFO] --- maven-checkstyle-plugin:3.0.0:check (checkstyle-check) @ maven-site-plugin ---
[withMaven] Publishers: Generated Artifacts Publisher: 52 ms, Junit Publisher: 94 ms, Open Task Scanner Publisher: 134 ms, Dependencies Fingerprint Publisher: 1 ms, Invoker Publisher: 25032 ms, Pipeline Graph Publisher: 1 ms
[Pipeline] // withMaven
[Pipeline] cleanWs
[WS-CLEANUP] Deleting project workspace...
[WS-CLEANUP] Deferred wipeout is used...
[WS-CLEANUP] done
[Pipeline] }
[Pipeline] // stage
[Pipeline] }
[Pipeline] // ws
[Pipeline] }
[Pipeline] // node
[Pipeline] }
[INFO]
[INFO] --- maven-invoker-plugin:3.1.0:verify (integration-test) @ maven-site-plugin ---
[INFO] -------------------------------------------------
[INFO] Build Summary:
[INFO]   Passed: 56, Failed: 0, Errors: 0, Skipped: 0
[INFO] -------------------------------------------------
[INFO] ------------------------------------------------------------------------
[INFO] BUILD SUCCESS
[INFO] ------------------------------------------------------------------------
[INFO] Total time:  07:30 min
[INFO] Finished at: 2019-07-08T12:33:46Z
[INFO] ------------------------------------------------------------------------
[INFO] [jenkins-event-spy] Generated /home/jenkins/jenkins-slave/workspace/-box_maven-site-plugin_MSITE-845@2@tmp/withMaven5db4aab2/maven-spy-20190708-122615-28514505432153354347199.log
[Pipeline] }
[Pipeline] // dir
[Pipeline] }
[withMaven] artifactsPublisher - Archive artifact linux-jdk12-m3.6.x_build/pom.xml under org/apache/maven/plugins/maven-site-plugin/3.8.2-SNAPSHOT/maven-site-plugin-3.8.2-SNAPSHOT.pom
[withMaven] Publishers: Generated Artifacts Publisher: 51 ms, Junit Publisher: 77 ms, Open Task Scanner Publisher: 282 ms, Dependencies Fingerprint Publisher: 1 ms, Invoker Publisher: 25298 ms, Pipeline Graph Publisher: 2 ms
[Pipeline] // withMaven
[Pipeline] cleanWs
[WS-CLEANUP] Deleting project workspace...
[WS-CLEANUP] Deferred wipeout is used...
[WS-CLEANUP] done
[Pipeline] }
[Pipeline] // stage
[Pipeline] }
[Pipeline] // ws
[Pipeline] }
[withMaven] artifactsPublisher - Archive artifact linux-jdk12-m3.6.x_build/target/maven-site-plugin-3.8.2-SNAPSHOT.jar under org/apache/maven/plugins/maven-site-plugin/3.8.2-SNAPSHOT/maven-site-plugin-3.8.2-SNAPSHOT.jar
[Pipeline] // node
[Pipeline] }
[Fast Archiver] No prior successful build to compare, so performing full copy of artifacts
[withMaven] junitPublisher - Archive test results for Maven artifact org.apache.maven.plugins:maven-site-plugin:maven-plugin:3.8.2-SNAPSHOT generated by maven-surefire-plugin:test (default-test): linux-jdk12-m3.6.x_build/target/surefire-reports/*.xml
Recording test results
[withMaven] openTasksPublisher - Scan Tasks for Maven artifact org.apache.maven.plugins:maven-site-plugin:maven-plugin:3.8.2-SNAPSHOT in source directory linux-jdk12-m3.6.x_build/src/main/java
[TASKS] Scanning folder '/home/jenkins/jenkins-slave/workspace/-box_maven-site-plugin_MSITE-845@2' for files matching the pattern 'linux-jdk12-m3.6.x_build/src/main/java/**/*' - excludes: null
[TASKS] Found 21 files to scan for tasks
[TASKS] Found 8 open tasks.
Skipping warnings blame since pipelines do not have an SCM link.%n
[withMaven] invokerPublisher - Archive invoker results for Maven artifact MavenArtifact{org.apache.maven.plugins:maven-site-plugin:maven-plugin:3.8.2-SNAPSHOT(version: 3.8.2-SNAPSHOT, snapshot:false) } generated by PluginInvocation{org.apache.maven.plugins:maven-invoker-plugin:3.1.0@integration-test  integration-test}: linux-jdk12-m3.6.x_build/target/invoker-reports/*.xml
[withMaven] Publishers: Generated Artifacts Publisher: 1107 ms, Junit Publisher: 1594 ms, Open Task Scanner Publisher: 1503 ms, Dependencies Fingerprint Publisher: 1 ms, Invoker Publisher: 62407 ms, Pipeline Graph Publisher: 1 ms
[Pipeline] // withMaven
[Pipeline] cleanWs
[WS-CLEANUP] Deleting project workspace...
[WS-CLEANUP] Deferred wipeout is used...
[WS-CLEANUP] done
[Pipeline] }
[Pipeline] // stage
[Pipeline] }
[Pipeline] // ws
[Pipeline] }
[Pipeline] // node
[Pipeline] }
[Pipeline] // parallel
[Pipeline] stage
[Pipeline] { (Notifications)
[Pipeline] echo
Build result: FAILURE
[Pipeline] jiraIssueSelector
[Pipeline] emailext
Reply | Threaded
Open this post in threaded view
|

Build failed in Jenkins: Maven TLP » maven-site-plugin » MSITE-845 #2

Apache Jenkins Server-2
See https://builds.apache.org/job/maven-box/job/maven-site-plugin/job/MSITE-845/2/

No changes.

All tests passed

Build log:
[...truncated 10441 lines...]
[INFO] ------------------------------------------------------------------------
[INFO] [jenkins-event-spy] Generated /home/jenkins/jenkins-slave/workspace/-box_maven-site-plugin_MSITE-845@2@tmp/withMavenb4b8cfc4/maven-spy-20190708-124846-5457948175966523279233.log
[ERROR] Failed to execute goal org.apache.maven.plugins:maven-invoker-plugin:3.1.0:verify (integration-test) on project maven-site-plugin: 1 build failed. See console output above for details. -> [Help 1]
org.apache.maven.lifecycle.LifecycleExecutionException: Failed to execute goal org.apache.maven.plugins:maven-invoker-plugin:3.1.0:verify (integration-test) on project maven-site-plugin: 1 build failed. See console output above for details.
    at org.apache.maven.lifecycle.internal.MojoExecutor.execute (MojoExecutor.java:215)
    at org.apache.maven.lifecycle.internal.MojoExecutor.execute (MojoExecutor.java:156)
    at org.apache.maven.lifecycle.internal.MojoExecutor.execute (MojoExecutor.java:148)
    at org.apache.maven.lifecycle.internal.LifecycleModuleBuilder.buildProject (LifecycleModuleBuilder.java:117)
    at org.apache.maven.lifecycle.internal.LifecycleModuleBuilder.buildProject (LifecycleModuleBuilder.java:81)
    at org.apache.maven.lifecycle.internal.builder.singlethreaded.SingleThreadedBuilder.build (SingleThreadedBuilder.java:56)
    at org.apache.maven.lifecycle.internal.LifecycleStarter.execute (LifecycleStarter.java:128)
    at org.apache.maven.DefaultMaven.doExecute (DefaultMaven.java:305)
    at org.apache.maven.DefaultMaven.doExecute (DefaultMaven.java:192)
    at org.apache.maven.DefaultMaven.execute (DefaultMaven.java:105)
    at org.apache.maven.cli.MavenCli.execute (MavenCli.java:956)
    at org.apache.maven.cli.MavenCli.doMain (MavenCli.java:288)
    at org.apache.maven.cli.MavenCli.main (MavenCli.java:192)
    at sun.reflect.NativeMethodAccessorImpl.invoke0 (Native Method)
    at sun.reflect.NativeMethodAccessorImpl.invoke (NativeMethodAccessorImpl.java:62)
    at sun.reflect.DelegatingMethodAccessorImpl.invoke (DelegatingMethodAccessorImpl.java:43)
    at java.lang.reflect.Method.invoke (Method.java:498)
    at org.codehaus.plexus.classworlds.launcher.Launcher.launchEnhanced (Launcher.java:289)
    at org.codehaus.plexus.classworlds.launcher.Launcher.launch (Launcher.java:229)
    at org.codehaus.plexus.classworlds.launcher.Launcher.mainWithExitCode (Launcher.java:415)
    at org.codehaus.plexus.classworlds.launcher.Launcher.main (Launcher.java:356)
Caused by: org.apache.maven.plugin.MojoFailureException: 1 build failed. See console output above for details.
    at org.apache.maven.plugins.invoker.InvokerSession.handleFailures (InvokerSession.java:260)
    at org.apache.maven.plugins.invoker.VerifyMojo.execute (VerifyMojo.java:137)
    at org.apache.maven.plugin.DefaultBuildPluginManager.executeMojo (DefaultBuildPluginManager.java:137)
    at org.apache.maven.lifecycle.internal.MojoExecutor.execute (MojoExecutor.java:210)
    at org.apache.maven.lifecycle.internal.MojoExecutor.execute (MojoExecutor.java:156)
    at org.apache.maven.lifecycle.internal.MojoExecutor.execute (MojoExecutor.java:148)
    at org.apache.maven.lifecycle.internal.LifecycleModuleBuilder.buildProject (LifecycleModuleBuilder.java:117)
    at org.apache.maven.lifecycle.internal.LifecycleModuleBuilder.buildProject (LifecycleModuleBuilder.java:81)
    at org.apache.maven.lifecycle.internal.builder.singlethreaded.SingleThreadedBuilder.build (SingleThreadedBuilder.java:56)
    at org.apache.maven.lifecycle.internal.LifecycleStarter.execute (LifecycleStarter.java:128)
    at org.apache.maven.DefaultMaven.doExecute (DefaultMaven.java:305)
    at org.apache.maven.DefaultMaven.doExecute (DefaultMaven.java:192)
    at org.apache.maven.DefaultMaven.execute (DefaultMaven.java:105)
    at org.apache.maven.cli.MavenCli.execute (MavenCli.java:956)
    at org.apache.maven.cli.MavenCli.doMain (MavenCli.java:288)
    at org.apache.maven.cli.MavenCli.main (MavenCli.java:192)
    at sun.reflect.NativeMethodAccessorImpl.invoke0 (Native Method)
    at sun.reflect.NativeMethodAccessorImpl.invoke (NativeMethodAccessorImpl.java:62)
    at sun.reflect.DelegatingMethodAccessorImpl.invoke (DelegatingMethodAccessorImpl.java:43)
    at java.lang.reflect.Method.invoke (Method.java:498)
    at org.codehaus.plexus.classworlds.launcher.Launcher.launchEnhanced (Launcher.java:289)
    at org.codehaus.plexus.classworlds.launcher.Launcher.launch (Launcher.java:229)
    at org.codehaus.plexus.classworlds.launcher.Launcher.mainWithExitCode (Launcher.java:415)
    at org.codehaus.plexus.classworlds.launcher.Launcher.main (Launcher.java:356)
[ERROR]
[ERROR] Re-run Maven using the -X switch to enable full debug logging.
[ERROR]
[ERROR] For more information about the errors and possible solutions, please read the following articles:
[ERROR] [Help 1] http://cwiki.apache.org/confluence/display/MAVEN/MojoFailureException
[Pipeline] }
[Pipeline] // dir
[Pipeline] }
[Fast Archiver] No prior successful build to compare, so performing full copy of artifacts
[withMaven] junitPublisher - Archive test results for Maven artifact org.apache.maven.plugins:maven-site-plugin:maven-plugin:3.8.2-SNAPSHOT generated by maven-surefire-plugin:test (default-test): linux-jdk8-m3.6.x_build/target/surefire-reports/*.xml
Recording test results
[INFO]           failure/pom.xml .................................. SUCCESS (20.5 s)
[INFO] Building: MSITE-627/pom.xml
[withMaven] openTasksPublisher - Scan Tasks for Maven artifact org.apache.maven.plugins:maven-site-plugin:maven-plugin:3.8.2-SNAPSHOT in source directory linux-jdk8-m3.6.x_build/src/main/java
[TASKS] Scanning folder '/home/jenkins/jenkins-slave/workspace/-box_maven-site-plugin_MSITE-845@2' for files matching the pattern 'linux-jdk8-m3.6.x_build/src/main/java/**/*' - excludes: null
[TASKS] Found 21 files to scan for tasks
[TASKS] Found 8 open tasks.
Skipping warnings blame since pipelines do not have an SCM link.%n
[withMaven] invokerPublisher - Archive invoker results for Maven artifact MavenArtifact{org.apache.maven.plugins:maven-site-plugin:maven-plugin:3.8.2-SNAPSHOT(version: 3.8.2-SNAPSHOT, snapshot:false) } generated by PluginInvocation{org.apache.maven.plugins:maven-invoker-plugin:3.1.0@integration-test  integration-test}: linux-jdk8-m3.6.x_build/target/invoker-reports/*.xml
[INFO]           failure/pom.xml .................................. SUCCESS (20.5 s)
[INFO] Building: MSITE-627/pom.xml
[INFO] run post-build script verify.bsh
[INFO]           MSITE-627/pom.xml ................................ SUCCESS (14.9 s)
[INFO] Building: site-attach-descriptor/pom.xml
[INFO] run post-build script verify.bsh
[INFO]           MSITE-627/pom.xml ................................ SUCCESS (14.7 s)
[INFO] Building: site-attach-descriptor/pom.xml
[INFO] run post-build script verify.bsh
[INFO]           site-attach-descriptor/pom.xml ................... SUCCESS (5.2 s)
[INFO] Building: default-reports-excluded/pom.xml
[INFO] run post-build script verify.bsh
[INFO]           site-attach-descriptor/pom.xml ................... SUCCESS (4.9 s)
[INFO] Building: default-reports-excluded/pom.xml
[INFO] run post-build script verify.groovy
[INFO]           default-reports-excluded/pom.xml ................. SUCCESS (4.2 s)
[INFO] Building: full-reporting/pom.xml
[INFO] run post-build script verify.groovy
[INFO]           default-reports-excluded/pom.xml ................. SUCCESS (4.2 s)
[INFO] Building: full-reporting/pom.xml
[withMaven] Publishers: Generated Artifacts Publisher: 1066 ms, Junit Publisher: 1555 ms, Open Task Scanner Publisher: 1442 ms, Invoker Publisher: 63590 ms, Pipeline Graph Publisher: 19 ms
[Pipeline] // withMaven
[Pipeline] cleanWs
[WS-CLEANUP] Deleting project workspace...
[WS-CLEANUP] Deferred wipeout is used...
[WS-CLEANUP] done
[Pipeline] }
[Pipeline] // stage
[Pipeline] }
[Pipeline] // ws
[Pipeline] }
[Pipeline] // node
[Pipeline] }
[INFO] run post-build script verify.groovy
[INFO]           full-reporting/pom.xml ........................... SUCCESS (26.9 s)
[INFO] Building: MSITE-354/pom.xml
[INFO] run post-build script verify.bsh
[INFO]           MSITE-354/pom.xml ................................ SUCCESS (4.9 s)
[INFO] Building: MSITE-458/pom.xml
[INFO] run post-build script verify.groovy
[INFO]           full-reporting/pom.xml ........................... SUCCESS (28.1 s)
[INFO] Building: MSITE-354/pom.xml
[withMaven] Publishers: Generated Artifacts Publisher: 158 ms, Junit Publisher: 1628 ms, Open Task Scanner Publisher: 1479 ms, Invoker Publisher: 56387 ms
[Pipeline] // withMaven
[Pipeline] cleanWs
[INFO] run post-build script verify.bsh
[INFO]           MSITE-354/pom.xml ................................ SUCCESS (5.3 s)
[INFO] Building: MSITE-458/pom.xml
[WS-CLEANUP] Deleting project workspace...
[WS-CLEANUP] Deferred wipeout is used...
[WS-CLEANUP] done
[Pipeline] cleanWs
[WS-CLEANUP] Deleting project workspace...
[WS-CLEANUP] Deferred wipeout is used...
[WS-CLEANUP] done
[Pipeline] }
[Pipeline] // stage
[Pipeline] }
[Pipeline] // ws
[Pipeline] }
[Pipeline] // node
[Pipeline] }
Failed in branch linux-jdk8-m3.6.x_build
[INFO] run post-build script verify.bsh
[INFO]           MSITE-458/pom.xml ................................ SUCCESS (10.4 s)
[INFO] Building: site-sd-top-parent-no-site/pom.xml
[INFO] run post-build script verify.bsh
[INFO]           MSITE-458/pom.xml ................................ SUCCESS (10.7 s)
[INFO] Building: site-sd-top-parent-no-site/pom.xml
[INFO] run post-build script verify.groovy
[INFO]           site-sd-top-parent-no-site/pom.xml ............... SUCCESS (7.3 s)
[INFO] Building: reportConfig/pom.xml
[INFO] run post-build script verify.groovy
[INFO]           reportConfig/pom.xml ............................. SUCCESS (5.3 s)
[INFO]
[INFO] --- mrm-maven-plugin:1.2.0:stop (default) @ maven-site-plugin ---
[INFO] Stopping Mock Repository Manager on http://localhost:38377
[INFO] Stopped SocketConnector@0.0.0.0:38377
[INFO] Mock Repository Manager http://localhost:38377 is stopped.
[INFO]
[INFO] --- maven-checkstyle-plugin:3.0.0:check (checkstyle-check) @ maven-site-plugin ---
[INFO] run post-build script verify.groovy
[INFO]           site-sd-top-parent-no-site/pom.xml ............... SUCCESS (7.8 s)
[INFO] Building: reportConfig/pom.xml
[INFO]
[INFO] --- maven-invoker-plugin:3.1.0:verify (integration-test) @ maven-site-plugin ---
[INFO] -------------------------------------------------
[INFO] Build Summary:
[INFO]   Passed: 56, Failed: 0, Errors: 0, Skipped: 0
[INFO] -------------------------------------------------
[INFO] ------------------------------------------------------------------------
[INFO] BUILD SUCCESS
[INFO] ------------------------------------------------------------------------
[INFO] Total time:  07:27 min
[INFO] Finished at: 2019-07-08T12:56:48Z
[INFO] ------------------------------------------------------------------------
[INFO] [jenkins-event-spy] Generated /home/jenkins/jenkins-slave/workspace/-box_maven-site-plugin_MSITE-845@3@2@tmp/withMaven579c2ac9/maven-spy-20190708-124921-63813870522915947076893.log
[Pipeline] }
[Pipeline] // dir
[Pipeline] }
[withMaven] artifactsPublisher - Archive artifact linux-jdk12-m3.6.x_build/pom.xml under org/apache/maven/plugins/maven-site-plugin/3.8.2-SNAPSHOT/maven-site-plugin-3.8.2-SNAPSHOT.pom
[withMaven] artifactsPublisher - Archive artifact linux-jdk12-m3.6.x_build/target/maven-site-plugin-3.8.2-SNAPSHOT.jar under org/apache/maven/plugins/maven-site-plugin/3.8.2-SNAPSHOT/maven-site-plugin-3.8.2-SNAPSHOT.jar
[Fast Archiver] No prior successful build to compare, so performing full copy of artifacts
[withMaven] junitPublisher - Archive test results for Maven artifact org.apache.maven.plugins:maven-site-plugin:maven-plugin:3.8.2-SNAPSHOT generated by maven-surefire-plugin:test (default-test): linux-jdk12-m3.6.x_build/target/surefire-reports/*.xml
Recording test results
[INFO] run post-build script verify.groovy
[INFO]           reportConfig/pom.xml ............................. SUCCESS (4.9 s)
[INFO]
[INFO] --- mrm-maven-plugin:1.2.0:stop (default) @ maven-site-plugin ---
[INFO] Stopping Mock Repository Manager on http://localhost:35199
[INFO] Stopped SocketConnector@0.0.0.0:35199
[INFO] Mock Repository Manager http://localhost:35199 is stopped.
[INFO]
[INFO] --- maven-checkstyle-plugin:3.0.0:check (checkstyle-check) @ maven-site-plugin ---
[INFO]
[INFO] --- maven-invoker-plugin:3.1.0:verify (integration-test) @ maven-site-plugin ---
[INFO] -------------------------------------------------
[INFO] Build Summary:
[INFO]   Passed: 56, Failed: 0, Errors: 0, Skipped: 0
[INFO] -------------------------------------------------
[INFO] ------------------------------------------------------------------------
[INFO] BUILD SUCCESS
[INFO] ------------------------------------------------------------------------
[INFO] Total time:  07:33 min
[INFO] Finished at: 2019-07-08T12:56:53Z
[INFO] ------------------------------------------------------------------------
[INFO] [jenkins-event-spy] Generated /home/jenkins/jenkins-slave/workspace/-box_maven-site-plugin_MSITE-845@2@tmp/withMaven42518204/maven-spy-20190708-124919-8101318444007015994739.log
[withMaven] openTasksPublisher - Scan Tasks for Maven artifact org.apache.maven.plugins:maven-site-plugin:maven-plugin:3.8.2-SNAPSHOT in source directory linux-jdk12-m3.6.x_build/src/main/java
[TASKS] Scanning folder '/home/jenkins/jenkins-slave/workspace/-box_maven-site-plugin_MSITE-845@3@2' for files matching the pattern 'linux-jdk12-m3.6.x_build/src/main/java/**/*' - excludes: null
[TASKS] Found 21 files to scan for tasks
[TASKS] Found 8 open tasks.
Skipping warnings blame since pipelines do not have an SCM link.%n
[Pipeline] }
[Pipeline] // dir
[Pipeline] }
[withMaven] artifactsPublisher - Archive artifact linux-jdk11-m3.6.x_build/pom.xml under org/apache/maven/plugins/maven-site-plugin/3.8.2-SNAPSHOT/maven-site-plugin-3.8.2-SNAPSHOT.pom
[withMaven] artifactsPublisher - Archive artifact linux-jdk11-m3.6.x_build/target/maven-site-plugin-3.8.2-SNAPSHOT.jar under org/apache/maven/plugins/maven-site-plugin/3.8.2-SNAPSHOT/maven-site-plugin-3.8.2-SNAPSHOT.jar
[Fast Archiver] No prior successful build to compare, so performing full copy of artifacts
[withMaven] invokerPublisher - Archive invoker results for Maven artifact MavenArtifact{org.apache.maven.plugins:maven-site-plugin:maven-plugin:3.8.2-SNAPSHOT(version: 3.8.2-SNAPSHOT, snapshot:false) } generated by PluginInvocation{org.apache.maven.plugins:maven-invoker-plugin:3.1.0@integration-test  integration-test}: linux-jdk12-m3.6.x_build/target/invoker-reports/*.xml
[withMaven] junitPublisher - Archive test results for Maven artifact org.apache.maven.plugins:maven-site-plugin:maven-plugin:3.8.2-SNAPSHOT generated by maven-surefire-plugin:test (default-test): linux-jdk11-m3.6.x_build/target/surefire-reports/*.xml
Recording test results
[withMaven] openTasksPublisher - Scan Tasks for Maven artifact org.apache.maven.plugins:maven-site-plugin:maven-plugin:3.8.2-SNAPSHOT in source directory linux-jdk11-m3.6.x_build/src/main/java
[TASKS] Scanning folder '/home/jenkins/jenkins-slave/workspace/-box_maven-site-plugin_MSITE-845@2' for files matching the pattern 'linux-jdk11-m3.6.x_build/src/main/java/**/*' - excludes: null
[TASKS] Found 21 files to scan for tasks
[TASKS] Found 8 open tasks.
Skipping warnings blame since pipelines do not have an SCM link.%n
[withMaven] invokerPublisher - Archive invoker results for Maven artifact MavenArtifact{org.apache.maven.plugins:maven-site-plugin:maven-plugin:3.8.2-SNAPSHOT(version: 3.8.2-SNAPSHOT, snapshot:false) } generated by PluginInvocation{org.apache.maven.plugins:maven-invoker-plugin:3.1.0@integration-test  integration-test}: linux-jdk11-m3.6.x_build/target/invoker-reports/*.xml
[withMaven] Publishers: Generated Artifacts Publisher: 1052 ms, Junit Publisher: 1574 ms, Open Task Scanner Publisher: 1450 ms, Dependencies Fingerprint Publisher: 1 ms, Invoker Publisher: 56429 ms, Pipeline Graph Publisher: 3 ms
[Pipeline] // withMaven
[Pipeline] cleanWs
[WS-CLEANUP] Deleting project workspace...
[WS-CLEANUP] Deferred wipeout is used...
[WS-CLEANUP] done
[Pipeline] }
[Pipeline] // stage
[Pipeline] }
[Pipeline] // ws
[Pipeline] }
[Pipeline] // node
[Pipeline] }
[withMaven] Publishers: Generated Artifacts Publisher: 956 ms, Junit Publisher: 1560 ms, Open Task Scanner Publisher: 1455 ms, Dependencies Fingerprint Publisher: 1 ms, Invoker Publisher: 56059 ms, Pipeline Graph Publisher: 1 ms
[Pipeline] // withMaven
[Pipeline] cleanWs
[WS-CLEANUP] Deleting project workspace...
[WS-CLEANUP] Deferred wipeout is used...
[WS-CLEANUP] done
[Pipeline] }
[Pipeline] // stage
[Pipeline] }
[Pipeline] // ws
[Pipeline] }
[Pipeline] // node
[Pipeline] }
[Pipeline] // parallel
[Pipeline] stage
[Pipeline] { (Notifications)
[Pipeline] echo
Build result: FAILURE
[Pipeline] jiraIssueSelector
[Pipeline] emailext
Reply | Threaded
Open this post in threaded view
|

Build succeeded in Jenkins: Maven TLP » maven-site-plugin » MSITE-845 #3

Apache Jenkins Server-2
See https://builds.apache.org/job/maven-box/job/maven-site-plugin/job/MSITE-845/3/

Changes:

* exclude nodes with MAVEN_OPTS issues
* exclude more nodes with MAVEN_OPTS issues
* exclude more nodes with MAVEN_OPTS issues
* stop avoiding nodes with MAVEN_OPTS issue
* [INFRA-18734] Jenkins builds fail on email notifications due to unknown
* Scripts not permitted to use staticMethod
* excluded message body from the log message
* NotSerializableException: hudson.plugins.git.GitChangeSetList
* investigating permissions to the call 'ChangeSetList.author'
* NotSerializableException: hudson.plugins.git.GitChangeSetList
* [INFRA-18734] Jenkins builds fail on email notifications due to unknown
* Prevent Caused: java.io.NotSerializableException: hudson.model.User
* added archives
* added archives fix
* print disk space usage
* sh 'df -hT'
* [INFRA-18734] Jenkins builds fail on email notifications due to unknown
* last() cannot be called on []
* [improvement] currentBuild.changeSets can be referenced as changes
* moved the fix of INFRA-18734 to jenkinsNotify
* ${env.EXECUTOR_NUMBER} returns null
* inline env.BRANCH_NAME directly in IF statement
* used env.EXECUTOR_NUMBER
* moved "def localRepo ..." to the stage execution block

All tests passed