Build failed in Jenkins: Maven TLP » maven-site » MNG-6432 #2

classic Classic list List threaded Threaded
1 message Options
Reply | Threaded
Open this post in threaded view
|

Build failed in Jenkins: Maven TLP » maven-site » MNG-6432 #2

Apache Jenkins Server-2
See https://builds.apache.org/job/maven-box/job/maven-site/job/MNG-6432/2/

Changes:

* Add JDK 14 (latest)
* exclude nodes with MAVEN_OPTS issues
* exclude more nodes with MAVEN_OPTS issues
* exclude more nodes with MAVEN_OPTS issues
* stop avoiding nodes with MAVEN_OPTS issue
* [INFRA-18734] Jenkins builds fail on email notifications due to unknown
* Scripts not permitted to use staticMethod
* excluded message body from the log message
* NotSerializableException: hudson.plugins.git.GitChangeSetList
* investigating permissions to the call 'ChangeSetList.author'
* NotSerializableException: hudson.plugins.git.GitChangeSetList
* [INFRA-18734] Jenkins builds fail on email notifications due to unknown
* Prevent Caused: java.io.NotSerializableException: hudson.model.User
* added archives
* added archives fix
* print disk space usage
* sh 'df -hT'
* [INFRA-18734] Jenkins builds fail on email notifications due to unknown
* last() cannot be called on []
* [improvement] currentBuild.changeSets can be referenced as changes
* moved the fix of INFRA-18734 to jenkinsNotify
* ${env.EXECUTOR_NUMBER} returns null
* inline env.BRANCH_NAME directly in IF statement
* used env.EXECUTOR_NUMBER
* moved "def localRepo ..." to the stage execution block

No tests ran.

Build log:
Branch indexing
Obtained Jenkinsfile from 723a9a867214c4404bf29294bca084cbcd74014b
Running in Durability level: MAX_SURVIVABILITY
Loading library jenkins-env@master
Attempting to resolve master from remote references...
 > git --version # timeout=10
 > git ls-remote -h https://gitbox.apache.org/repos/asf/maven-jenkins-env.git # timeout=10
Found match: refs/heads/master revision c85d339c36fa2140d7f0048ffd1a4370ce69b502
No credentials specified
 > git rev-parse --is-inside-work-tree # timeout=10
Fetching changes from the remote Git repository
 > git config remote.origin.url https://gitbox.apache.org/repos/asf/maven-jenkins-env.git # timeout=10
Fetching without tags
Fetching upstream changes from https://gitbox.apache.org/repos/asf/maven-jenkins-env.git
 > git --version # timeout=10
 > git fetch --no-tags --progress https://gitbox.apache.org/repos/asf/maven-jenkins-env.git +refs/heads/*:refs/remotes/origin/*
Checking out Revision c85d339c36fa2140d7f0048ffd1a4370ce69b502 (master)
 > git config core.sparsecheckout # timeout=10
 > git checkout -f c85d339c36fa2140d7f0048ffd1a4370ce69b502
Commit message: "Prevent Caused: java.io.NotSerializableException: hudson.model.User"
 > git rev-list --no-walk 231a3fd4025bb4364e3accacf0ac0ee6e2191219 # timeout=10
Loading library jenkins-lib@master
Attempting to resolve master from remote references...
 > git --version # timeout=10
 > git ls-remote -h https://gitbox.apache.org/repos/asf/maven-jenkins-lib.git # timeout=10
Found match: refs/heads/master revision aee445426dac012af4326c0b80c93422200c2a56
No credentials specified
 > git rev-parse --is-inside-work-tree # timeout=10
Fetching changes from the remote Git repository
 > git config remote.origin.url https://gitbox.apache.org/repos/asf/maven-jenkins-lib.git # timeout=10
Fetching without tags
Fetching upstream changes from https://gitbox.apache.org/repos/asf/maven-jenkins-lib.git
 > git --version # timeout=10
 > git fetch --no-tags --progress https://gitbox.apache.org/repos/asf/maven-jenkins-lib.git +refs/heads/*:refs/remotes/origin/*
Checking out Revision aee445426dac012af4326c0b80c93422200c2a56 (master)
 > git config core.sparsecheckout # timeout=10
 > git checkout -f aee445426dac012af4326c0b80c93422200c2a56
Commit message: "moved "def localRepo ..." to the stage execution block"
 > git rev-list --no-walk cd522d07cd26bbad3d5d3449c44726c1bf576660 # timeout=10
[Pipeline] Start of Pipeline
[Pipeline] node
Still waiting to schedule task
There are no nodes with the label ‘websites1’
[Pipeline] // node
[Pipeline] stage
[Pipeline] { (Declarative: Post Actions)
[Pipeline] echo
Build result: FAILURE
[Pipeline] jiraIssueSelector
[Pipeline] echo
The authors of changes [slachiewicz, hboutemy, tibordigana, rfscholte].
[Pipeline] echo
Sending email ...
[Pipeline] emailext