Build failed in Jenkins: Maven TLP » maven-site » MNG-5940 #13

classic Classic list List threaded Threaded
3 messages Options
Reply | Threaded
Open this post in threaded view
|

Build failed in Jenkins: Maven TLP » maven-site » MNG-5940 #13

Apache Jenkins Server-2
See https://builds.apache.org/job/maven-box/job/maven-site/job/MNG-5940/13/

No changes.

No tests ran.

Build log:
Branch indexing
Obtained Jenkinsfile from dc40536effb28dea0bb481850f29dc22a8e49549
Running in Durability level: MAX_SURVIVABILITY
Loading library jenkins-env@master
Attempting to resolve master from remote references...
 > git --version # timeout=10
 > git ls-remote -h https://gitbox.apache.org/repos/asf/maven-jenkins-env.git # timeout=10
Found match: refs/heads/master revision 3d06b769e61a13a2a9719212c5c06012f2a55535
 > git rev-parse --is-inside-work-tree # timeout=10
Fetching changes from the remote Git repository
 > git config remote.origin.url https://gitbox.apache.org/repos/asf/maven-jenkins-env.git # timeout=10
Fetching without tags
Fetching upstream changes from https://gitbox.apache.org/repos/asf/maven-jenkins-env.git
 > git --version # timeout=10
 > git fetch --no-tags --progress https://gitbox.apache.org/repos/asf/maven-jenkins-env.git +refs/heads/*:refs/remotes/origin/*
Checking out Revision 3d06b769e61a13a2a9719212c5c06012f2a55535 (master)
 > git config core.sparsecheckout # timeout=10
 > git checkout -f 3d06b769e61a13a2a9719212c5c06012f2a55535
Commit message: "Back to all Windows nodes"
 > git rev-list --no-walk 3d06b769e61a13a2a9719212c5c06012f2a55535 # timeout=10
Loading library jenkins-lib@master
Attempting to resolve master from remote references...
 > git --version # timeout=10
 > git ls-remote -h https://gitbox.apache.org/repos/asf/maven-jenkins-lib.git # timeout=10
Found match: refs/heads/master revision c2152da6e3520c4631ffc32521dcab9ac0f1aea0
 > git rev-parse --is-inside-work-tree # timeout=10
Fetching changes from the remote Git repository
 > git config remote.origin.url https://gitbox.apache.org/repos/asf/maven-jenkins-lib.git # timeout=10
Fetching without tags
Fetching upstream changes from https://gitbox.apache.org/repos/asf/maven-jenkins-lib.git
 > git --version # timeout=10
 > git fetch --no-tags --progress https://gitbox.apache.org/repos/asf/maven-jenkins-lib.git +refs/heads/*:refs/remotes/origin/*
Checking out Revision c2152da6e3520c4631ffc32521dcab9ac0f1aea0 (master)
 > git config core.sparsecheckout # timeout=10
 > git checkout -f c2152da6e3520c4631ffc32521dcab9ac0f1aea0
Commit message: "Try to display PATH value"
 > git rev-list --no-walk c2152da6e3520c4631ffc32521dcab9ac0f1aea0 # timeout=10
[Pipeline] node
Running on websites1 in /home/jenkins/jenkins-slave/workspace/ven-box_maven-site_MNG-5940-R7ZPTTNRDZNPHVI7PL4TMFQGIC5LFUCK5IWKE4AQAYNXVPJILVOQ
[Pipeline] {
[Pipeline] stage
[Pipeline] { (Declarative: Checkout SCM)
[Pipeline] checkout
 > git rev-parse --is-inside-work-tree # timeout=10
Fetching changes from the remote Git repository
 > git config remote.origin.url https://gitbox.apache.org/repos/asf/maven-site.git # timeout=10
Fetching without tags
Fetching upstream changes from https://gitbox.apache.org/repos/asf/maven-site.git
 > git --version # timeout=10
 > git fetch --no-tags --progress https://gitbox.apache.org/repos/asf/maven-site.git +refs/heads/*:refs/remotes/origin/*
Checking out Revision dc40536effb28dea0bb481850f29dc22a8e49549 (MNG-5940)
 > git config core.sparsecheckout # timeout=10
 > git checkout -f dc40536effb28dea0bb481850f29dc22a8e49549
Commit message: "[MNG-5940] Change the maven-source-plugin jar goal into jar-no-fork in Maven Super POM"
 > git rev-list --no-walk dc40536effb28dea0bb481850f29dc22a8e49549 # timeout=10
Cleaning workspace
 > git rev-parse --verify HEAD # timeout=10
Resetting working tree
 > git reset --hard # timeout=10
 > git clean -fdx # timeout=10
[Pipeline] }
[Pipeline] // stage
[Pipeline] withEnv
[Pipeline] {
[Pipeline] timeout
Timeout set to expire in 10 min
[Pipeline] {
[Pipeline] timestamps
[Pipeline] {
[Pipeline] ansiColor
[Pipeline] {
[Pipeline] stage
[Pipeline] { (Build)
[Pipeline] withMaven
[withMaven] Options: [org.jenkinsci.plugins.pipeline.maven.publishers.GeneratedArtifactsPublisher[disabled=true], JunitTestsPublisher[disabled=true,healthScaleFactor=,keepLongStdio=false,ignoreAttachments=false], org.jenkinsci.plugins.pipeline.maven.publishers.FindbugsAnalysisPublisher[disabled='true', healthy='', unHealthy='', thresholdLimit='low'], org.jenkinsci.plugins.pipeline.maven.publishers.TasksScannerPublisher[disabled='true', healthy='', unHealthy='', thresholdLimit='low']]
[withMaven] Available options:
[withMaven] using JDK installation JDK 1.8 (latest)
[withMaven] using Maven installation 'Maven 3 (latest)'
[Pipeline] {
[Pipeline] sh
[ven-box_maven-site_MNG-5940-R7ZPTTNRDZNPHVI7PL4TMFQGIC5LFUCK5IWKE4AQAYNXVPJILVOQ] Running shell script
+ mvn clean site
----- withMaven Wrapper script -----
Picked up JAVA_TOOL_OPTIONS: -Dmaven.ext.class.path="/home/jenkins/jenkins-slave/workspace/ven-box_maven-site_MNG-5940-R7ZPTTNRDZNPHVI7PL4TMFQGIC5LFUCK5IWKE4AQAYNXVPJILVOQ@tmp/withMaven47c9b81d/pipeline-maven-spy.jar" -Dorg.jenkinsci.plugins.pipeline.maven.reportsFolder="/home/jenkins/jenkins-slave/workspace/ven-box_maven-site_MNG-5940-R7ZPTTNRDZNPHVI7PL4TMFQGIC5LFUCK5IWKE4AQAYNXVPJILVOQ@tmp/withMaven47c9b81d"
Apache Maven 3.5.4 (1edded0938998edf8bf061f1ceb3cfdeccf443fe; 2018-06-17T18:33:14Z)
Maven home: /home/jenkins/tools/maven/latest3
Java version: 1.8.0_172, vendor: Oracle Corporation, runtime: /usr/local/asfpackages/java/jdk1.8.0_172/jre
Default locale: en_US, platform encoding: UTF-8
OS name: "linux", version: "4.4.0-116-generic", arch: "amd64", family: "unix"
[INFO] [jenkins-event-spy] Generate /home/jenkins/jenkins-slave/workspace/ven-box_maven-site_MNG-5940-R7ZPTTNRDZNPHVI7PL4TMFQGIC5LFUCK5IWKE4AQAYNXVPJILVOQ@tmp/withMaven47c9b81d/maven-spy-20180912-071310-3255496536131573179264.log.tmp ...
[INFO] Scanning for projects...
[INFO] Downloading from Nexus: http://repository.apache.org/snapshots/org/apache/maven/maven-parent/32-SNAPSHOT/maven-metadata.xml
[INFO] Downloading from Nexus: http://repository.apache.org/snapshots/org/apache/maven/maven-parent/32-SNAPSHOT/maven-parent-32-SNAPSHOT.pom
[ERROR] [ERROR] Some problems were encountered while processing the POMs:
[FATAL] Non-resolvable parent POM for org.apache.maven:maven-site:1.0: Could not find artifact org.apache.maven:maven-parent:pom:32-SNAPSHOT in Nexus (http://repository.apache.org/snapshots) and 'parent.relativePath' points at wrong local POM @ line 23, column 11
 @
[INFO] [jenkins-event-spy] Generated /home/jenkins/jenkins-slave/workspace/ven-box_maven-site_MNG-5940-R7ZPTTNRDZNPHVI7PL4TMFQGIC5LFUCK5IWKE4AQAYNXVPJILVOQ@tmp/withMaven47c9b81d/maven-spy-20180912-071310-3255496536131573179264.log
[ERROR] The build could not read 1 project -> [Help 1]
[ERROR]  
[ERROR]   The project org.apache.maven:maven-site:1.0 (/home/jenkins/jenkins-slave/workspace/ven-box_maven-site_MNG-5940-R7ZPTTNRDZNPHVI7PL4TMFQGIC5LFUCK5IWKE4AQAYNXVPJILVOQ/pom.xml) has 1 error
[ERROR]     Non-resolvable parent POM for org.apache.maven:maven-site:1.0: Could not find artifact org.apache.maven:maven-parent:pom:32-SNAPSHOT in Nexus (http://repository.apache.org/snapshots) and 'parent.relativePath' points at wrong local POM @ line 23, column 11 -> [Help 2]
[ERROR]
[ERROR] To see the full stack trace of the errors, re-run Maven with the -e switch.
[ERROR] Re-run Maven using the -X switch to enable full debug logging.
[ERROR]
[ERROR] For more information about the errors and possible solutions, please read the following articles:
[ERROR] [Help 1] http://cwiki.apache.org/confluence/display/MAVEN/ProjectBuildingException
[ERROR] [Help 2] http://cwiki.apache.org/confluence/display/MAVEN/UnresolvableModelException
[Pipeline] }
[Pipeline] // withMaven
[Pipeline] }
[Pipeline] // stage
[Pipeline] stage
[Pipeline] { (Deploy)
Stage "Deploy" skipped due to earlier failure(s)
[Pipeline] }
[Pipeline] // stage
[Pipeline] stage
[Pipeline] { (Declarative: Post Actions)
[Pipeline] echo
Build result: FAILURE
[Pipeline] jiraIssueSelector
[Pipeline] emailext
Reply | Threaded
Open this post in threaded view
|

Build failed in Jenkins: Maven TLP » maven-site » MNG-5940 #14

Apache Jenkins Server-2
See https://builds.apache.org/job/maven-box/job/maven-site/job/MNG-5940/14/

No changes.

No tests ran.

Build log:
Branch indexing
Obtained Jenkinsfile from dc40536effb28dea0bb481850f29dc22a8e49549
Running in Durability level: MAX_SURVIVABILITY
Loading library jenkins-env@master
Attempting to resolve master from remote references...
 > git --version # timeout=10
 > git ls-remote -h https://gitbox.apache.org/repos/asf/maven-jenkins-env.git # timeout=10
Found match: refs/heads/master revision 3d06b769e61a13a2a9719212c5c06012f2a55535
 > git rev-parse --is-inside-work-tree # timeout=10
Fetching changes from the remote Git repository
 > git config remote.origin.url https://gitbox.apache.org/repos/asf/maven-jenkins-env.git # timeout=10
Fetching without tags
Fetching upstream changes from https://gitbox.apache.org/repos/asf/maven-jenkins-env.git
 > git --version # timeout=10
 > git fetch --no-tags --progress https://gitbox.apache.org/repos/asf/maven-jenkins-env.git +refs/heads/*:refs/remotes/origin/*
Checking out Revision 3d06b769e61a13a2a9719212c5c06012f2a55535 (master)
 > git config core.sparsecheckout # timeout=10
 > git checkout -f 3d06b769e61a13a2a9719212c5c06012f2a55535
Commit message: "Back to all Windows nodes"
 > git rev-list --no-walk 3d06b769e61a13a2a9719212c5c06012f2a55535 # timeout=10
Loading library jenkins-lib@master
Attempting to resolve master from remote references...
 > git --version # timeout=10
 > git ls-remote -h https://gitbox.apache.org/repos/asf/maven-jenkins-lib.git # timeout=10
Found match: refs/heads/master revision c2152da6e3520c4631ffc32521dcab9ac0f1aea0
 > git rev-parse --is-inside-work-tree # timeout=10
Fetching changes from the remote Git repository
 > git config remote.origin.url https://gitbox.apache.org/repos/asf/maven-jenkins-lib.git # timeout=10
Fetching without tags
Fetching upstream changes from https://gitbox.apache.org/repos/asf/maven-jenkins-lib.git
 > git --version # timeout=10
 > git fetch --no-tags --progress https://gitbox.apache.org/repos/asf/maven-jenkins-lib.git +refs/heads/*:refs/remotes/origin/*
Checking out Revision c2152da6e3520c4631ffc32521dcab9ac0f1aea0 (master)
 > git config core.sparsecheckout # timeout=10
 > git checkout -f c2152da6e3520c4631ffc32521dcab9ac0f1aea0
Commit message: "Try to display PATH value"
 > git rev-list --no-walk c2152da6e3520c4631ffc32521dcab9ac0f1aea0 # timeout=10
[Pipeline] node
Still waiting to schedule task
Waiting for next available executor on websites1
Running on websites1 in /home/jenkins/jenkins-slave/workspace/ven-box_maven-site_MNG-5940-R7ZPTTNRDZNPHVI7PL4TMFQGIC5LFUCK5IWKE4AQAYNXVPJILVOQ
[Pipeline] {
[Pipeline] stage
[Pipeline] { (Declarative: Checkout SCM)
[Pipeline] checkout
 > git rev-parse --is-inside-work-tree # timeout=10
Fetching changes from the remote Git repository
 > git config remote.origin.url https://gitbox.apache.org/repos/asf/maven-site.git # timeout=10
Fetching without tags
Fetching upstream changes from https://gitbox.apache.org/repos/asf/maven-site.git
 > git --version # timeout=10
 > git fetch --no-tags --progress https://gitbox.apache.org/repos/asf/maven-site.git +refs/heads/*:refs/remotes/origin/*
Checking out Revision dc40536effb28dea0bb481850f29dc22a8e49549 (MNG-5940)
 > git config core.sparsecheckout # timeout=10
 > git checkout -f dc40536effb28dea0bb481850f29dc22a8e49549
Commit message: "[MNG-5940] Change the maven-source-plugin jar goal into jar-no-fork in Maven Super POM"
 > git rev-list --no-walk dc40536effb28dea0bb481850f29dc22a8e49549 # timeout=10
Cleaning workspace
 > git rev-parse --verify HEAD # timeout=10
Resetting working tree
 > git reset --hard # timeout=10
 > git clean -fdx # timeout=10
[Pipeline] }
[Pipeline] // stage
[Pipeline] withEnv
[Pipeline] {
[Pipeline] timeout
Timeout set to expire in 10 min
[Pipeline] {
[Pipeline] timestamps
[Pipeline] {
[Pipeline] ansiColor
[Pipeline] {
[Pipeline] stage
[Pipeline] { (Build)
[Pipeline] withMaven
[withMaven] Options: [org.jenkinsci.plugins.pipeline.maven.publishers.GeneratedArtifactsPublisher[disabled=true], JunitTestsPublisher[disabled=true,healthScaleFactor=,keepLongStdio=false,ignoreAttachments=false], org.jenkinsci.plugins.pipeline.maven.publishers.FindbugsAnalysisPublisher[disabled='true', healthy='', unHealthy='', thresholdLimit='low'], org.jenkinsci.plugins.pipeline.maven.publishers.TasksScannerPublisher[disabled='true', healthy='', unHealthy='', thresholdLimit='low']]
[withMaven] Available options:
[withMaven] using JDK installation JDK 1.8 (latest)
[withMaven] using Maven installation 'Maven 3 (latest)'
[Pipeline] {
[Pipeline] sh
[ven-box_maven-site_MNG-5940-R7ZPTTNRDZNPHVI7PL4TMFQGIC5LFUCK5IWKE4AQAYNXVPJILVOQ] Running shell script
+ mvn clean site
----- withMaven Wrapper script -----
Picked up JAVA_TOOL_OPTIONS: -Dmaven.ext.class.path="/home/jenkins/jenkins-slave/workspace/ven-box_maven-site_MNG-5940-R7ZPTTNRDZNPHVI7PL4TMFQGIC5LFUCK5IWKE4AQAYNXVPJILVOQ@tmp/withMavenfe5e37dd/pipeline-maven-spy.jar" -Dorg.jenkinsci.plugins.pipeline.maven.reportsFolder="/home/jenkins/jenkins-slave/workspace/ven-box_maven-site_MNG-5940-R7ZPTTNRDZNPHVI7PL4TMFQGIC5LFUCK5IWKE4AQAYNXVPJILVOQ@tmp/withMavenfe5e37dd"
Apache Maven 3.5.4 (1edded0938998edf8bf061f1ceb3cfdeccf443fe; 2018-06-17T18:33:14Z)
Maven home: /home/jenkins/tools/maven/latest3
Java version: 1.8.0_172, vendor: Oracle Corporation, runtime: /usr/local/asfpackages/java/jdk1.8.0_172/jre
Default locale: en_US, platform encoding: UTF-8
OS name: "linux", version: "4.4.0-116-generic", arch: "amd64", family: "unix"
[INFO] [jenkins-event-spy] Generate /home/jenkins/jenkins-slave/workspace/ven-box_maven-site_MNG-5940-R7ZPTTNRDZNPHVI7PL4TMFQGIC5LFUCK5IWKE4AQAYNXVPJILVOQ@tmp/withMavenfe5e37dd/maven-spy-20180914-071413-9036410727777223546195.log.tmp ...
[INFO] Scanning for projects...
[INFO] Downloading from Nexus: http://repository.apache.org/snapshots/org/apache/maven/maven-parent/32-SNAPSHOT/maven-metadata.xml
[INFO] Downloading from Nexus: http://repository.apache.org/snapshots/org/apache/maven/maven-parent/32-SNAPSHOT/maven-parent-32-SNAPSHOT.pom
[ERROR] [ERROR] Some problems were encountered while processing the POMs:
[FATAL] Non-resolvable parent POM for org.apache.maven:maven-site:1.0: Could not find artifact org.apache.maven:maven-parent:pom:32-SNAPSHOT in Nexus (http://repository.apache.org/snapshots) and 'parent.relativePath' points at wrong local POM @ line 23, column 11
 @
[INFO] [jenkins-event-spy] Generated /home/jenkins/jenkins-slave/workspace/ven-box_maven-site_MNG-5940-R7ZPTTNRDZNPHVI7PL4TMFQGIC5LFUCK5IWKE4AQAYNXVPJILVOQ@tmp/withMavenfe5e37dd/maven-spy-20180914-071413-9036410727777223546195.log
[ERROR] The build could not read 1 project -> [Help 1]
[ERROR]  
[ERROR]   The project org.apache.maven:maven-site:1.0 (/home/jenkins/jenkins-slave/workspace/ven-box_maven-site_MNG-5940-R7ZPTTNRDZNPHVI7PL4TMFQGIC5LFUCK5IWKE4AQAYNXVPJILVOQ/pom.xml) has 1 error
[ERROR]     Non-resolvable parent POM for org.apache.maven:maven-site:1.0: Could not find artifact org.apache.maven:maven-parent:pom:32-SNAPSHOT in Nexus (http://repository.apache.org/snapshots) and 'parent.relativePath' points at wrong local POM @ line 23, column 11 -> [Help 2]
[ERROR]
[ERROR] To see the full stack trace of the errors, re-run Maven with the -e switch.
[ERROR] Re-run Maven using the -X switch to enable full debug logging.
[ERROR]
[ERROR] For more information about the errors and possible solutions, please read the following articles:
[ERROR] [Help 1] http://cwiki.apache.org/confluence/display/MAVEN/ProjectBuildingException
[ERROR] [Help 2] http://cwiki.apache.org/confluence/display/MAVEN/UnresolvableModelException
[Pipeline] }
[Pipeline] // withMaven
[Pipeline] }
[Pipeline] // stage
[Pipeline] stage
[Pipeline] { (Deploy)
Stage "Deploy" skipped due to earlier failure(s)
[Pipeline] }
[Pipeline] // stage
[Pipeline] stage
[Pipeline] { (Declarative: Post Actions)
[Pipeline] echo
Build result: FAILURE
[Pipeline] jiraIssueSelector
[Pipeline] emailext
Reply | Threaded
Open this post in threaded view
|

Build failed in Jenkins: Maven TLP » maven-site » MNG-5940 #15

Apache Jenkins Server-2
See https://builds.apache.org/job/maven-box/job/maven-site/job/MNG-5940/15/

Changes:

* Exclude H25
* Exclude H31 cause master is failing constantly.
* no need to test anymore with '3.0.x'
* Add Java 11 to defaults
* Try to shorten path for Windows by using tempDir
* Fix arguments
* Add option for temp workspace
* disable tmpWs
* enable tmpWs
* Use def
* Try to shorten wsDir

No tests ran.

Build log:
Branch indexing
Obtained Jenkinsfile from dc40536effb28dea0bb481850f29dc22a8e49549
Running in Durability level: MAX_SURVIVABILITY
Loading library jenkins-env@master
Attempting to resolve master from remote references...
 > git --version # timeout=10
 > git ls-remote -h https://gitbox.apache.org/repos/asf/maven-jenkins-env.git # timeout=10
Found match: refs/heads/master revision 86878be82560f40675d84559cc29576c5661df75
 > git rev-parse --is-inside-work-tree # timeout=10
Fetching changes from the remote Git repository
 > git config remote.origin.url https://gitbox.apache.org/repos/asf/maven-jenkins-env.git # timeout=10
Fetching without tags
Fetching upstream changes from https://gitbox.apache.org/repos/asf/maven-jenkins-env.git
 > git --version # timeout=10
 > git fetch --no-tags --progress https://gitbox.apache.org/repos/asf/maven-jenkins-env.git +refs/heads/*:refs/remotes/origin/*
Checking out Revision 86878be82560f40675d84559cc29576c5661df75 (master)
 > git config core.sparsecheckout # timeout=10
 > git checkout -f 86878be82560f40675d84559cc29576c5661df75
Commit message: "Exclude H31 cause master is failing constantly."
 > git rev-list --no-walk 3d06b769e61a13a2a9719212c5c06012f2a55535 # timeout=10
Loading library jenkins-lib@master
Attempting to resolve master from remote references...
 > git --version # timeout=10
 > git ls-remote -h https://gitbox.apache.org/repos/asf/maven-jenkins-lib.git # timeout=10
Found match: refs/heads/master revision c70c94d6cc26afa1c640f64749f47f9db10e73c4
 > git rev-parse --is-inside-work-tree # timeout=10
Fetching changes from the remote Git repository
 > git config remote.origin.url https://gitbox.apache.org/repos/asf/maven-jenkins-lib.git # timeout=10
Fetching without tags
Fetching upstream changes from https://gitbox.apache.org/repos/asf/maven-jenkins-lib.git
 > git --version # timeout=10
 > git fetch --no-tags --progress https://gitbox.apache.org/repos/asf/maven-jenkins-lib.git +refs/heads/*:refs/remotes/origin/*
Checking out Revision c70c94d6cc26afa1c640f64749f47f9db10e73c4 (master)
 > git config core.sparsecheckout # timeout=10
 > git checkout -f c70c94d6cc26afa1c640f64749f47f9db10e73c4
Commit message: "Try to shorten wsDir"
 > git rev-list --no-walk c2152da6e3520c4631ffc32521dcab9ac0f1aea0 # timeout=10
[Pipeline] node
Running on websites1 in /home/jenkins/jenkins-slave/workspace/ven-box_maven-site_MNG-5940-R7ZPTTNRDZNPHVI7PL4TMFQGIC5LFUCK5IWKE4AQAYNXVPJILVOQ
[Pipeline] {
[Pipeline] stage
[Pipeline] { (Declarative: Checkout SCM)
[Pipeline] checkout
 > git rev-parse --is-inside-work-tree # timeout=10
Fetching changes from the remote Git repository
 > git config remote.origin.url https://gitbox.apache.org/repos/asf/maven-site.git # timeout=10
Fetching without tags
Fetching upstream changes from https://gitbox.apache.org/repos/asf/maven-site.git
 > git --version # timeout=10
 > git fetch --no-tags --progress https://gitbox.apache.org/repos/asf/maven-site.git +refs/heads/*:refs/remotes/origin/*
Checking out Revision dc40536effb28dea0bb481850f29dc22a8e49549 (MNG-5940)
 > git config core.sparsecheckout # timeout=10
 > git checkout -f dc40536effb28dea0bb481850f29dc22a8e49549
Commit message: "[MNG-5940] Change the maven-source-plugin jar goal into jar-no-fork in Maven Super POM"
 > git rev-list --no-walk dc40536effb28dea0bb481850f29dc22a8e49549 # timeout=10
Cleaning workspace
 > git rev-parse --verify HEAD # timeout=10
Resetting working tree
 > git reset --hard # timeout=10
 > git clean -fdx # timeout=10
[Pipeline] }
[Pipeline] // stage
[Pipeline] withEnv
[Pipeline] {
[Pipeline] timeout
Timeout set to expire in 10 min
[Pipeline] {
[Pipeline] timestamps
[Pipeline] {
[Pipeline] ansiColor
[Pipeline] {
[Pipeline] stage
[Pipeline] { (Build)
[Pipeline] withMaven
[withMaven] Options: [org.jenkinsci.plugins.pipeline.maven.publishers.GeneratedArtifactsPublisher[disabled=true], JunitTestsPublisher[disabled=true,healthScaleFactor=,keepLongStdio=false,ignoreAttachments=false], org.jenkinsci.plugins.pipeline.maven.publishers.FindbugsAnalysisPublisher[disabled='true', healthy='', unHealthy='', thresholdLimit='low'], org.jenkinsci.plugins.pipeline.maven.publishers.TasksScannerPublisher[disabled='true', healthy='', unHealthy='', thresholdLimit='low']]
[withMaven] Available options:
[withMaven] using JDK installation JDK 1.8 (latest)
[withMaven] using Maven installation 'Maven 3 (latest)'
[Pipeline] {
[Pipeline] sh
[ven-box_maven-site_MNG-5940-R7ZPTTNRDZNPHVI7PL4TMFQGIC5LFUCK5IWKE4AQAYNXVPJILVOQ] Running shell script
+ mvn clean site
----- withMaven Wrapper script -----
Picked up JAVA_TOOL_OPTIONS: -Dmaven.ext.class.path="/home/jenkins/jenkins-slave/workspace/ven-box_maven-site_MNG-5940-R7ZPTTNRDZNPHVI7PL4TMFQGIC5LFUCK5IWKE4AQAYNXVPJILVOQ@tmp/withMavenf4d79721/pipeline-maven-spy.jar" -Dorg.jenkinsci.plugins.pipeline.maven.reportsFolder="/home/jenkins/jenkins-slave/workspace/ven-box_maven-site_MNG-5940-R7ZPTTNRDZNPHVI7PL4TMFQGIC5LFUCK5IWKE4AQAYNXVPJILVOQ@tmp/withMavenf4d79721"
Apache Maven 3.5.4 (1edded0938998edf8bf061f1ceb3cfdeccf443fe; 2018-06-17T18:33:14Z)
Maven home: /home/jenkins/tools/maven/latest3
Java version: 1.8.0_172, vendor: Oracle Corporation, runtime: /usr/local/asfpackages/java/jdk1.8.0_172/jre
Default locale: en_US, platform encoding: UTF-8
OS name: "linux", version: "4.4.0-116-generic", arch: "amd64", family: "unix"
[INFO] [jenkins-event-spy] Generate /home/jenkins/jenkins-slave/workspace/ven-box_maven-site_MNG-5940-R7ZPTTNRDZNPHVI7PL4TMFQGIC5LFUCK5IWKE4AQAYNXVPJILVOQ@tmp/withMavenf4d79721/maven-spy-20181010-071311-267446535533254806342.log.tmp ...
[INFO] Scanning for projects...
[INFO] Downloading from Nexus: http://repository.apache.org/snapshots/org/apache/maven/maven-parent/32-SNAPSHOT/maven-metadata.xml
[INFO] Downloading from Nexus: http://repository.apache.org/snapshots/org/apache/maven/maven-parent/32-SNAPSHOT/maven-parent-32-SNAPSHOT.pom
[ERROR] [ERROR] Some problems were encountered while processing the POMs:
[FATAL] Non-resolvable parent POM for org.apache.maven:maven-site:1.0: Could not find artifact org.apache.maven:maven-parent:pom:32-SNAPSHOT in Nexus (http://repository.apache.org/snapshots) and 'parent.relativePath' points at wrong local POM @ line 23, column 11
 @
[INFO] [jenkins-event-spy] Generated /home/jenkins/jenkins-slave/workspace/ven-box_maven-site_MNG-5940-R7ZPTTNRDZNPHVI7PL4TMFQGIC5LFUCK5IWKE4AQAYNXVPJILVOQ@tmp/withMavenf4d79721/maven-spy-20181010-071311-267446535533254806342.log
[ERROR] The build could not read 1 project -> [Help 1]
[ERROR]  
[ERROR]   The project org.apache.maven:maven-site:1.0 (/home/jenkins/jenkins-slave/workspace/ven-box_maven-site_MNG-5940-R7ZPTTNRDZNPHVI7PL4TMFQGIC5LFUCK5IWKE4AQAYNXVPJILVOQ/pom.xml) has 1 error
[ERROR]     Non-resolvable parent POM for org.apache.maven:maven-site:1.0: Could not find artifact org.apache.maven:maven-parent:pom:32-SNAPSHOT in Nexus (http://repository.apache.org/snapshots) and 'parent.relativePath' points at wrong local POM @ line 23, column 11 -> [Help 2]
[ERROR]
[ERROR] To see the full stack trace of the errors, re-run Maven with the -e switch.
[ERROR] Re-run Maven using the -X switch to enable full debug logging.
[ERROR]
[ERROR] For more information about the errors and possible solutions, please read the following articles:
[ERROR] [Help 1] http://cwiki.apache.org/confluence/display/MAVEN/ProjectBuildingException
[ERROR] [Help 2] http://cwiki.apache.org/confluence/display/MAVEN/UnresolvableModelException
[Pipeline] }
[Pipeline] // withMaven
[Pipeline] }
[Pipeline] // stage
[Pipeline] stage
[Pipeline] { (Deploy)
Stage "Deploy" skipped due to earlier failure(s)
[Pipeline] }
[Pipeline] // stage
[Pipeline] stage
[Pipeline] { (Declarative: Post Actions)
[Pipeline] echo
Build result: FAILURE
[Pipeline] jiraIssueSelector
[Pipeline] emailext