Build failed in Jenkins: Maven TLP » maven-shared-resources » master #1

Previous Topic Next Topic
 
classic Classic list List threaded Threaded
2 messages Options
Reply | Threaded
Open this post in threaded view
|

Build failed in Jenkins: Maven TLP » maven-shared-resources » master #1

Apache Jenkins Server-2
See https://builds.apache.org/job/maven-box/job/maven-shared-resources/job/master/1/

No changes.

No tests ran.

Build log:
[...truncated 20.27 KB...]
[windows-jdk7] First time build. Skipping changelog.
[windows-jdk7] Cleaning workspace
[windows-jdk7]  > git rev-parse --verify HEAD # timeout=10
[windows-jdk7] Resetting working tree
[windows-jdk7]  > git reset --hard # timeout=10
[windows-jdk7]  > git clean -fdx # timeout=10
[Pipeline] [windows-jdk7] }
[Pipeline] [windows-jdk7] // dir
[Pipeline] [windows-jdk7] }
[Pipeline] [windows-jdk7] // stage
[Pipeline] [windows-jdk7] stage
[Pipeline] [windows-jdk7] { (Build windows-jdk7)
[linux-jdk7] Checking out Revision e0cda1b06815692c33b509d6d9457e384cbf6703 (master)
[linux-jdk7]  > git config core.sparsecheckout # timeout=10
[linux-jdk7]  > git checkout -f e0cda1b06815692c33b509d6d9457e384cbf6703
[linux-jdk7] Commit message: "moved to git"
[linux-jdk7] Cleaning workspace
[linux-jdk7]  > git rev-parse --verify HEAD # timeout=10
[linux-jdk7] Resetting working tree
[linux-jdk7]  > git reset --hard # timeout=10
[linux-jdk7]  > git clean -fdx # timeout=10
[linux-jdk8]  > git config remote.origin.url https://gitbox.apache.org/repos/asf/maven-shared-resources.git # timeout=10
[linux-jdk8]  > git config --add remote.origin.fetch +refs/heads/*:refs/remotes/origin/* # timeout=10
[linux-jdk8]  > git config remote.origin.url https://gitbox.apache.org/repos/asf/maven-shared-resources.git # timeout=10
[linux-jdk8] Fetching without tags
[linux-jdk8] Fetching upstream changes from https://gitbox.apache.org/repos/asf/maven-shared-resources.git
[linux-jdk8]  > git fetch --no-tags --progress https://gitbox.apache.org/repos/asf/maven-shared-resources.git +refs/heads/*:refs/remotes/origin/*
[linux-jdk9]  > git config remote.origin.url https://gitbox.apache.org/repos/asf/maven-shared-resources.git # timeout=10
[linux-jdk9]  > git config --add remote.origin.fetch +refs/heads/*:refs/remotes/origin/* # timeout=10
[linux-jdk9]  > git config remote.origin.url https://gitbox.apache.org/repos/asf/maven-shared-resources.git # timeout=10
[linux-jdk9] Fetching without tags
[linux-jdk9] Fetching upstream changes from https://gitbox.apache.org/repos/asf/maven-shared-resources.git
[linux-jdk9]  > git fetch --no-tags --progress https://gitbox.apache.org/repos/asf/maven-shared-resources.git +refs/heads/*:refs/remotes/origin/*
[Pipeline] [windows-jdk7] withMaven
[windows-jdk7] [withMaven] Options: [org.jenkinsci.plugins.pipeline.maven.publishers.GeneratedArtifactsPublisher[disabled=true], org.jenkinsci.plugins.pipeline.maven.publishers.JunitTestsPublisher[disabled=false], org.jenkinsci.plugins.pipeline.maven.publishers.FindbugsAnalysisPublisher[disabled=true], org.jenkinsci.plugins.pipeline.maven.publishers.TasksScannerPublisher[disabled=true], org.jenkinsci.plugins.pipeline.maven.publishers.DependenciesFingerprintPublisher[disabled=false, scopes=[compile, provided, runtime], versions={snapshot:true, release:false}], org.jenkinsci.plugins.pipeline.maven.publishers.InvokerRunsPublisher[disabled=false], org.jenkinsci.plugins.pipeline.maven.publishers.PipelineGraphPublisher[disabled=false, scopes=[compile, provided, runtime], versions={snapshot:true, release:false}, skipDownstreamTriggers=false, lifecycleThreshold=deploy, ignoreUpstreamTriggers=false]]
[windows-jdk7] [withMaven] Available options:
[windows-jdk7] [withMaven] use JDK installation JDK 1.7 (latest)
[windows-jdk7] [withMaven] use Maven installation 'Maven 3.5.0 (Windows)'
[Pipeline] [windows-jdk7] {
[Pipeline] [windows-jdk7] dir
[windows-jdk7] Running in f:\jenkins\jenkins-slave\workspace\ven-shared-resources_master-K6BBC6MQ2YZQI2YGTV6U4YXVWYESQSUXKMGMCQ4VOQE5HROYDPSQ\m
[Pipeline] [windows-jdk7] {
[Pipeline] [windows-jdk7] isUnix
[Pipeline] [windows-jdk7] bat
[windows-jdk7] [m] Running batch script
[windows-jdk8] Running on windows-2012-2 in f:\jenkins\jenkins-slave\workspace\ven-shared-resources_master-K6BBC6MQ2YZQI2YGTV6U4YXVWYESQSUXKMGMCQ4VOQE5HROYDPSQ@2
[Pipeline] [windows-jdk8] {
[Pipeline] [windows-jdk8] stage
[Pipeline] [windows-jdk8] { (Checkout windows-jdk8)
[Pipeline] [windows-jdk8] dir
[windows-jdk8] Running in f:\jenkins\jenkins-slave\workspace\ven-shared-resources_master-K6BBC6MQ2YZQI2YGTV6U4YXVWYESQSUXKMGMCQ4VOQE5HROYDPSQ@2\m
[Pipeline] [windows-jdk8] {
[Pipeline] [windows-jdk8] checkout
[linux-jdk8] Checking out Revision e0cda1b06815692c33b509d6d9457e384cbf6703 (master)
[linux-jdk8]  > git config core.sparsecheckout # timeout=10
[linux-jdk8]  > git checkout -f e0cda1b06815692c33b509d6d9457e384cbf6703
[linux-jdk9] Checking out Revision e0cda1b06815692c33b509d6d9457e384cbf6703 (master)
[windows-jdk7]
[windows-jdk7] f:\jenkins\jenkins-slave\workspace\ven-shared-resources_master-K6BBC6MQ2YZQI2YGTV6U4YXVWYESQSUXKMGMCQ4VOQE5HROYDPSQ\m>mvn -P+run-its -Dmaven.test.failure.ignore=true -Dfindbugs.failOnError=false -Dfindbugs.skip=true clean verify
[windows-jdk7] ----- withMaven Wrapper script -----
[windows-jdk8] Cloning the remote Git repository
[windows-jdk8] Cloning with configured refspecs honoured and without tags
[windows-jdk8] Cloning repository https://gitbox.apache.org/repos/asf/maven-shared-resources.git
[windows-jdk8]  > git init f:\jenkins\jenkins-slave\workspace\ven-shared-resources_master-K6BBC6MQ2YZQI2YGTV6U4YXVWYESQSUXKMGMCQ4VOQE5HROYDPSQ@2\m # timeout=10
[windows-jdk8] Fetching upstream changes from https://gitbox.apache.org/repos/asf/maven-shared-resources.git
[windows-jdk8]  > git --version # timeout=10
[windows-jdk8]  > git fetch --no-tags --progress https://gitbox.apache.org/repos/asf/maven-shared-resources.git +refs/heads/*:refs/remotes/origin/*
[Pipeline] [linux-jdk7] }
[Pipeline] [linux-jdk7] // dir
[Pipeline] [linux-jdk7] }
[Pipeline] [linux-jdk7] // stage
[Pipeline] [linux-jdk7] stage
[Pipeline] [linux-jdk7] { (Build linux-jdk7)
[linux-jdk9]  > git config core.sparsecheckout # timeout=10
[linux-jdk9]  > git checkout -f e0cda1b06815692c33b509d6d9457e384cbf6703
[windows-jdk7] Apache Maven 3.5.0 (ff8f5e7444045639af65f6095c62210b5713f426; 2017-04-03T19:39:06Z)
[windows-jdk7] Maven home: F:\jenkins\tools\maven\apache-maven-3.5.0\bin\..
[windows-jdk7] Java version: 1.7.0_79, vendor: Oracle Corporation
[windows-jdk7] Java home: f:\jenkins\tools\java\latest1.7\jre
[windows-jdk7] Default locale: en_US, platform encoding: Cp1252
[windows-jdk7] OS name: "windows server 2012 r2", version: "6.3", arch: "amd64", family: "windows"
[windows-jdk8]  > git config remote.origin.url https://gitbox.apache.org/repos/asf/maven-shared-resources.git # timeout=10
[windows-jdk8]  > git config --add remote.origin.fetch +refs/heads/*:refs/remotes/origin/* # timeout=10
[windows-jdk8]  > git config remote.origin.url https://gitbox.apache.org/repos/asf/maven-shared-resources.git # timeout=10
[windows-jdk8] Fetching without tags
[windows-jdk8] Fetching upstream changes from https://gitbox.apache.org/repos/asf/maven-shared-resources.git
[windows-jdk8]  > git fetch --no-tags --progress https://gitbox.apache.org/repos/asf/maven-shared-resources.git +refs/heads/*:refs/remotes/origin/*
[windows-jdk8] Checking out Revision e0cda1b06815692c33b509d6d9457e384cbf6703 (master)
[windows-jdk8]  > git config core.sparsecheckout # timeout=10
[windows-jdk8]  > git checkout -f e0cda1b06815692c33b509d6d9457e384cbf6703
[windows-jdk8] Commit message: "moved to git"
[windows-jdk8] Cleaning workspace
[windows-jdk8]  > git rev-parse --verify HEAD # timeout=10
[windows-jdk8] Resetting working tree
[windows-jdk8]  > git reset --hard # timeout=10
[windows-jdk8]  > git clean -fdx # timeout=10
[Pipeline] [linux-jdk7] withMaven
[linux-jdk7] [withMaven] Options: [org.jenkinsci.plugins.pipeline.maven.publishers.GeneratedArtifactsPublisher[disabled=false], org.jenkinsci.plugins.pipeline.maven.publishers.JunitTestsPublisher[disabled=false], org.jenkinsci.plugins.pipeline.maven.publishers.FindbugsAnalysisPublisher[disabled=false], org.jenkinsci.plugins.pipeline.maven.publishers.TasksScannerPublisher[disabled=false], org.jenkinsci.plugins.pipeline.maven.publishers.DependenciesFingerprintPublisher[disabled=false, scopes=[compile, provided, runtime], versions={snapshot:true, release:false}], org.jenkinsci.plugins.pipeline.maven.publishers.InvokerRunsPublisher[disabled=false], org.jenkinsci.plugins.pipeline.maven.publishers.PipelineGraphPublisher[disabled=false, scopes=[compile, provided, runtime], versions={snapshot:true, release:false}, skipDownstreamTriggers=false, lifecycleThreshold=deploy, ignoreUpstreamTriggers=false]]
[linux-jdk7] [withMaven] Available options:
[linux-jdk7] [withMaven] use JDK installation JDK 1.7 (latest)
[linux-jdk7] [withMaven] use Maven installation 'Maven 3.5.2'
[Pipeline] [linux-jdk7] {
[Pipeline] [linux-jdk8] }
[Pipeline] [linux-jdk9] }
[Pipeline] [linux-jdk7] dir
[linux-jdk7] Running in /home/jenkins/jenkins-slave/workspace/ven-shared-resources_master-K6BBC6MQ2YZQI2YGTV6U4YXVWYESQSUXKMGMCQ4VOQE5HROYDPSQ/m
[Pipeline] [linux-jdk7] {
[Pipeline] [linux-jdk8] // dir
[windows-jdk7] [jenkins-maven-event-spy] INFO generate F:\jenkins\jenkins-slave\workspace\ven-shared-resources_master-K6BBC6MQ2YZQI2YGTV6U4YXVWYESQSUXKMGMCQ4VOQE5HROYDPSQ@tmp\withMaven7b1a5be1\maven-spy-20171209-205257-2287049925276175320791.log.tmp ...
[windows-jdk7] [INFO] Scanning for projects...
[windows-jdk7] [ERROR] [ERROR] Some problems were encountered while processing the POMs:
[windows-jdk7] [FATAL] Non-parseable POM f:\jenkins\jenkins-slave\workspace\ven-shared-resources_master-K6BBC6MQ2YZQI2YGTV6U4YXVWYESQSUXKMGMCQ4VOQE5HROYDPSQ\m\pom.xml: Duplicated tag: 'ciManagement' (position: START_TAG seen ...</distributionManagement>\n\n  <ciManagement>... @59:17)  @ line 59, column 17
[windows-jdk7]  @
[windows-jdk7] [jenkins-maven-event-spy] INFO generated F:\jenkins\jenkins-slave\workspace\ven-shared-resources_master-K6BBC6MQ2YZQI2YGTV6U4YXVWYESQSUXKMGMCQ4VOQE5HROYDPSQ@tmp\withMaven7b1a5be1\maven-spy-20171209-205257-2287049925276175320791.log
[windows-jdk7] [ERROR] The build could not read 1 project -> [Help 1]
[windows-jdk7] [ERROR]  
[windows-jdk7] [ERROR]   The project  (f:\jenkins\jenkins-slave\workspace\ven-shared-resources_master-K6BBC6MQ2YZQI2YGTV6U4YXVWYESQSUXKMGMCQ4VOQE5HROYDPSQ\m\pom.xml) has 1 error
[windows-jdk7] [ERROR]     Non-parseable POM f:\jenkins\jenkins-slave\workspace\ven-shared-resources_master-K6BBC6MQ2YZQI2YGTV6U4YXVWYESQSUXKMGMCQ4VOQE5HROYDPSQ\m\pom.xml: Duplicated tag: 'ciManagement' (position: START_TAG seen ...</distributionManagement>\n\n  <ciManagement>... @59:17)  @ line 59, column 17 -> [Help 2]
[windows-jdk7] [ERROR]
[windows-jdk7] [ERROR] To see the full stack trace of the errors, re-run Maven with the -e switch.
[windows-jdk7] [ERROR] Re-run Maven using the -X switch to enable full debug logging.
[windows-jdk7] [ERROR]
[windows-jdk7] [ERROR] For more information about the errors and possible solutions, please read the following articles:
[windows-jdk7] [ERROR] [Help 1] http://cwiki.apache.org/confluence/display/MAVEN/ProjectBuildingException
[windows-jdk7] [ERROR] [Help 2] http://cwiki.apache.org/confluence/display/MAVEN/ModelParseException
[windows-jdk7] Picked up JAVA_TOOL_OPTIONS: -Dmaven.ext.class.path="f:\jenkins\jenkins-slave\workspace\ven-shared-resources_master-K6BBC6MQ2YZQI2YGTV6U4YXVWYESQSUXKMGMCQ4VOQE5HROYDPSQ@tmp\withMaven7b1a5be1\pipeline-maven-spy.jar" -Dorg.jenkinsci.plugins.pipeline.maven.reportsFolder="f:\jenkins\jenkins-slave\workspace\ven-shared-resources_master-K6BBC6MQ2YZQI2YGTV6U4YXVWYESQSUXKMGMCQ4VOQE5HROYDPSQ@tmp\withMaven7b1a5be1"
[Pipeline] [linux-jdk9] // dir
[Pipeline] [linux-jdk8] }
[Pipeline] [linux-jdk9] }
[Pipeline] [linux-jdk7] isUnix
[Pipeline] [linux-jdk7] sh
[linux-jdk7] [m] Running shell script
[Pipeline] [linux-jdk8] // stage
[Pipeline] [linux-jdk9] // stage
[Pipeline] [linux-jdk8] }
[Pipeline] [linux-jdk9] }
[Pipeline] [windows-jdk8] }
[Pipeline] [windows-jdk7] }
[windows-jdk9] Running on windows-2012-1 in f:\jenkins\jenkins-slave\workspace\ven-shared-resources_master-K6BBC6MQ2YZQI2YGTV6U4YXVWYESQSUXKMGMCQ4VOQE5HROYDPSQ
[Pipeline] [linux-jdk8] // node
[Pipeline] [linux-jdk9] // node
[Pipeline] [windows-jdk8] // dir
[Pipeline] [linux-jdk8] }
[linux-jdk8] Failed in branch linux-jdk8
[Pipeline] [linux-jdk9] }
[linux-jdk9] Failed in branch linux-jdk9
[Pipeline] [windows-jdk8] }
[Pipeline] [windows-jdk7] // dir
[Pipeline] [windows-jdk9] {
[Pipeline] [windows-jdk7] }
[windows-jdk7] [withMaven] Skip 'Generated Artifacts Publisher' disabled by configuration
[windows-jdk7] [withMaven] Skip 'Findbugs Publisher' disabled by configuration
[windows-jdk7] [withMaven] Skip 'Open Task Scanner Publisher' disabled by configuration
[Pipeline] [windows-jdk9] stage
[Pipeline] [windows-jdk9] { (Checkout windows-jdk9)
[linux-jdk7] Sending interrupt signal to process
[linux-jdk7] + mvn -P+run-its -Dmaven.test.failure.ignore=true -Dfindbugs.failOnError=false clean verify
[linux-jdk7] ----- withMaven Wrapper script -----
[linux-jdk7] Picked up JAVA_TOOL_OPTIONS: -Dmaven.ext.class.path="/home/jenkins/jenkins-slave/workspace/ven-shared-resources_master-K6BBC6MQ2YZQI2YGTV6U4YXVWYESQSUXKMGMCQ4VOQE5HROYDPSQ@tmp/withMavene019cd11/pipeline-maven-spy.jar" -Dorg.jenkinsci.plugins.pipeline.maven.reportsFolder="/home/jenkins/jenkins-slave/workspace/ven-shared-resources_master-K6BBC6MQ2YZQI2YGTV6U4YXVWYESQSUXKMGMCQ4VOQE5HROYDPSQ@tmp/withMavene019cd11"
[linux-jdk7] Apache Maven 3.5.2 (138edd61fd100ec658bfa2d307c43b76940a5d7d; 2017-10-18T07:58:13Z)
[linux-jdk7] Maven home: /home/jenkins/tools/maven/apache-maven-3.5.2
[linux-jdk7] Java version: 1.7.0_80, vendor: Oracle Corporation
[linux-jdk7] Java home: /usr/local/asfpackages/java/jdk1.7.0_80/jre
[linux-jdk7] Default locale: en_US, platform encoding: ISO-8859-1
[linux-jdk7] OS name: "linux", version: "4.4.0-43-generic", arch: "amd64", family: "unix"
[Pipeline] [windows-jdk8] // stage
[Pipeline] [windows-jdk8] stage
[Pipeline] [windows-jdk8] { (Build windows-jdk8)
[Pipeline] [windows-jdk9] }
[Pipeline] [windows-jdk7] // withMaven
[Pipeline] [windows-jdk7] }
[Pipeline] [windows-jdk8] withMaven
[windows-jdk8] [withMaven] Options: [org.jenkinsci.plugins.pipeline.maven.publishers.GeneratedArtifactsPublisher[disabled=true], org.jenkinsci.plugins.pipeline.maven.publishers.JunitTestsPublisher[disabled=false], org.jenkinsci.plugins.pipeline.maven.publishers.FindbugsAnalysisPublisher[disabled=true], org.jenkinsci.plugins.pipeline.maven.publishers.TasksScannerPublisher[disabled=true], org.jenkinsci.plugins.pipeline.maven.publishers.DependenciesFingerprintPublisher[disabled=false, scopes=[compile, provided, runtime], versions={snapshot:true, release:false}], org.jenkinsci.plugins.pipeline.maven.publishers.InvokerRunsPublisher[disabled=false], org.jenkinsci.plugins.pipeline.maven.publishers.PipelineGraphPublisher[disabled=false, scopes=[compile, provided, runtime], versions={snapshot:true, release:false}, skipDownstreamTriggers=false, lifecycleThreshold=deploy, ignoreUpstreamTriggers=false]]
[windows-jdk8] [withMaven] Available options:
[windows-jdk8] [withMaven] use JDK installation JDK 1.8 (latest)
[windows-jdk8] [withMaven] use Maven installation 'Maven 3.5.0 (Windows)'
[Pipeline] [windows-jdk8] {
[Pipeline] [windows-jdk8] dir
[windows-jdk8] Running in f:\jenkins\jenkins-slave\workspace\ven-shared-resources_master-K6BBC6MQ2YZQI2YGTV6U4YXVWYESQSUXKMGMCQ4VOQE5HROYDPSQ@2\m
[Pipeline] [windows-jdk8] {
[Pipeline] [windows-jdk8] isUnix
[Pipeline] [windows-jdk8] bat
[windows-jdk8] [m] Running batch script
[Pipeline] [windows-jdk9] // stage
[Pipeline] [windows-jdk9] }
[Pipeline] [windows-jdk7] // stage
[Pipeline] [windows-jdk7] }
[Pipeline] [linux-jdk7] }
[Pipeline] [windows-jdk9] // node
[Pipeline] [windows-jdk9] }
[windows-jdk9] Failed in branch windows-jdk9
[Pipeline] [windows-jdk7] // node
[Pipeline] [linux-jdk7] // dir
[windows-jdk8]
[windows-jdk8] f:\jenkins\jenkins-slave\workspace\ven-shared-resources_master-K6BBC6MQ2YZQI2YGTV6U4YXVWYESQSUXKMGMCQ4VOQE5HROYDPSQ@2\m>mvn -P+run-its -Dmaven.test.failure.ignore=true -Dfindbugs.failOnError=false -Dfindbugs.skip=true clean verify
[windows-jdk8] ----- withMaven Wrapper script -----
[Pipeline] [windows-jdk7] }
[windows-jdk7] Failed in branch windows-jdk7
[Pipeline] [linux-jdk7] }
[Pipeline] [linux-jdk7] // withMaven
[Pipeline] [linux-jdk7] }
[Pipeline] [linux-jdk7] // stage
[Pipeline] [linux-jdk7] }
[Pipeline] [linux-jdk7] // node
[Pipeline] [linux-jdk7] }
[windows-jdk8] Apache Maven 3.5.0 (ff8f5e7444045639af65f6095c62210b5713f426; 2017-04-03T19:39:06Z)
[windows-jdk8] Maven home: F:\jenkins\tools\maven\apache-maven-3.5.0\bin\..
[windows-jdk8] Java version: 1.8.0_152, vendor: Oracle Corporation
[windows-jdk8] Java home: f:\jenkins\tools\java\latest1.8\jre
[windows-jdk8] Default locale: en_US, platform encoding: Cp1252
[windows-jdk8] OS name: "windows server 2012 r2", version: "6.3", arch: "amd64", family: "windows"
[linux-jdk7] Failed in branch linux-jdk7
[windows-jdk8] [jenkins-maven-event-spy] INFO generate F:\jenkins\jenkins-slave\workspace\ven-shared-resources_master-K6BBC6MQ2YZQI2YGTV6U4YXVWYESQSUXKMGMCQ4VOQE5HROYDPSQ@2@tmp\withMaven5681c271\maven-spy-20171209-205302-8742628054197988311838.log.tmp ...
[windows-jdk8] [INFO] Scanning for projects...
[windows-jdk8] [ERROR] [ERROR] Some problems were encountered while processing the POMs:
[windows-jdk8] [FATAL] Non-parseable POM f:\jenkins\jenkins-slave\workspace\ven-shared-resources_master-K6BBC6MQ2YZQI2YGTV6U4YXVWYESQSUXKMGMCQ4VOQE5HROYDPSQ@2\m\pom.xml: Duplicated tag: 'ciManagement' (position: START_TAG seen ...</distributionManagement>\n\n  <ciManagement>... @59:17)  @ line 59, column 17
[windows-jdk8]  @
[windows-jdk8] [jenkins-maven-event-spy] INFO generated F:\jenkins\jenkins-slave\workspace\ven-shared-resources_master-K6BBC6MQ2YZQI2YGTV6U4YXVWYESQSUXKMGMCQ4VOQE5HROYDPSQ@2@tmp\withMaven5681c271\maven-spy-20171209-205302-8742628054197988311838.log
[windows-jdk8] [ERROR] The build could not read 1 project -> [Help 1]
[windows-jdk8] [ERROR]  
[windows-jdk8] [ERROR]   The project  (f:\jenkins\jenkins-slave\workspace\ven-shared-resources_master-K6BBC6MQ2YZQI2YGTV6U4YXVWYESQSUXKMGMCQ4VOQE5HROYDPSQ@2\m\pom.xml) has 1 error
[windows-jdk8] [ERROR]     Non-parseable POM f:\jenkins\jenkins-slave\workspace\ven-shared-resources_master-K6BBC6MQ2YZQI2YGTV6U4YXVWYESQSUXKMGMCQ4VOQE5HROYDPSQ@2\m\pom.xml: Duplicated tag: 'ciManagement' (position: START_TAG seen ...</distributionManagement>\n\n  <ciManagement>... @59:17)  @ line 59, column 17 -> [Help 2]
[windows-jdk8] [ERROR]
[windows-jdk8] [ERROR] To see the full stack trace of the errors, re-run Maven with the -e switch.
[windows-jdk8] [ERROR] Re-run Maven using the -X switch to enable full debug logging.
[windows-jdk8] [ERROR]
[windows-jdk8] [ERROR] For more information about the errors and possible solutions, please read the following articles:
[windows-jdk8] [ERROR] [Help 1] http://cwiki.apache.org/confluence/display/MAVEN/ProjectBuildingException
[windows-jdk8] [ERROR] [Help 2] http://cwiki.apache.org/confluence/display/MAVEN/ModelParseException
[windows-jdk8] Picked up JAVA_TOOL_OPTIONS: -Dmaven.ext.class.path="f:\jenkins\jenkins-slave\workspace\ven-shared-resources_master-K6BBC6MQ2YZQI2YGTV6U4YXVWYESQSUXKMGMCQ4VOQE5HROYDPSQ@2@tmp\withMaven5681c271\pipeline-maven-spy.jar" -Dorg.jenkinsci.plugins.pipeline.maven.reportsFolder="f:\jenkins\jenkins-slave\workspace\ven-shared-resources_master-K6BBC6MQ2YZQI2YGTV6U4YXVWYESQSUXKMGMCQ4VOQE5HROYDPSQ@2@tmp\withMaven5681c271"
[Pipeline] [windows-jdk8] }
[Pipeline] [windows-jdk8] // dir
[Pipeline] [windows-jdk8] }
[windows-jdk8] [withMaven] Skip 'Generated Artifacts Publisher' disabled by configuration
[windows-jdk8] [withMaven] Skip 'Findbugs Publisher' disabled by configuration
[windows-jdk8] [withMaven] Skip 'Open Task Scanner Publisher' disabled by configuration
[Pipeline] [windows-jdk8] // withMaven
[Pipeline] [windows-jdk8] }
[Pipeline] [windows-jdk8] // stage
[Pipeline] [windows-jdk8] }
[Pipeline] [windows-jdk8] // node
[Pipeline] [windows-jdk8] }
[windows-jdk8] Failed in branch windows-jdk8
[Pipeline] // parallel
[Pipeline] stage
[Pipeline] { (Notifications)
[Pipeline] echo
Build result: FAILURE
[Pipeline] jiraIssueSelector
Reply | Threaded
Open this post in threaded view
|

Build succeeded in Jenkins: Maven TLP » maven-shared-resources » master #2

Apache Jenkins Server-2
See https://builds.apache.org/job/maven-box/job/maven-shared-resources/job/master/2/

Changes:

* Noting INFRA-15651
* Typowq
* [CLOSES INFRA-15651] ubuntu-4 is confirmed fixed
* Stop commenting on INFRA tickets
* Add JDK 10 b37 (early access build) (Windows Only)
* Better fail-fast diagnostics (hopefully)
* Better fail-fast diagnostics (hopefully)
* fix scoping
* Correctly attribute fast failure root node
* Correctly attribute fast failure root node
* Handle other parts of the parallel being interrupted by fast fail
* suppress duplicate changelogs
* take 2 on changelog optimization
* debug
* Seems we have to live with duplicate changelogs
* Fix build by removing duplicate ciManagement tag
* Fix build by removing duplicate ciManagement tag
* Fix build by removing duplicate ciManagement tag
* Fix build by removing duplicate ciManagement tag
* Fix build by removing duplicate ciManagement tag
* Fix build by removing duplicate ciManagement tag

No tests ran.