Build failed in Jenkins: Maven TLP » maven-scripting-plugin » master #27

classic Classic list List threaded Threaded
1 message Options
Reply | Threaded
Open this post in threaded view
|

Build failed in Jenkins: Maven TLP » maven-scripting-plugin » master #27

Apache Jenkins Server-2
See https://builds.apache.org/job/maven-box/job/maven-scripting-plugin/job/master/27/

Changes:

* Plugins should use asfMavenTlpPlgnBuild()
* Plugins should use asfMavenTlpPlgnBuild()
* Plugins should use asfMavenTlpPlgnBuild()
* Plugins should use asfMavenTlpPlgnBuild()
* Plugins should use asfMavenTlpPlgnBuild()
* Plugins should use asfMavenTlpPlgnBuild()
* Plugins should use asfMavenTlpPlgnBuild()
* Plugins should use asfMavenTlpPlgnBuild()
* Plugins should use asfMavenTlpPlgnBuild()
* Plugins should use asfMavenTlpPlgnBuild()
* Plugins should use asfMavenTlpPlgnBuild()
* Plugins should use asfMavenTlpPlgnBuild()

No tests ran.

Build log:
[...truncated 2256 lines...]
[Pipeline] }
[WS-CLEANUP] Deleting project workspace...
[WS-CLEANUP] Deferred wipeout is used...
[withMaven] invokerPublisher - Archive invoker results for Maven artifact MavenArtifact{org.apache.maven.plugins:maven-scripting-plugin:maven-plugin:3.0.0-SNAPSHOT(version: 3.0.0-SNAPSHOT, snapshot:false) } generated by PluginInvocation{org.apache.maven.plugins:maven-invoker-plugin:3.0.1@integration-test  integration-test}: linux-jdk7-m3.2.x_build/target/invoker-reports/*.xml
[WS-CLEANUP] done
[Pipeline] }
[Pipeline] // stage
[Pipeline] }
[Pipeline] // ws
[Pipeline] }
[Pipeline] // node
[Pipeline] }
[INFO] Changes detected - recompiling the module!
[INFO] Compiling 2 source files to f:\jenkins\jenkins-slave\workspace\ox_maven-scripting-plugin_master@2\windows-jdk12-m3.5.x_build\target\classes
[withMaven] Publishers: Generated Artifacts Publisher: 1105 ms, Junit Publisher: 161 ms, Open Task Scanner Publisher: 330 ms, Invoker Publisher: 962 ms, Pipeline Graph Publisher: 2 ms
[INFO] -------------------------------------------------------------
[ERROR] COMPILATION ERROR :
[INFO] -------------------------------------------------------------
[ERROR] Source option 6 is no longer supported. Use 7 or later.
[ERROR] Target option 6 is no longer supported. Use 7 or later.
[INFO] 2 errors
[INFO] -------------------------------------------------------------
[INFO] ------------------------------------------------------------------------
[INFO] BUILD FAILURE
[INFO] ------------------------------------------------------------------------
[INFO] Total time: 26.779 s
[INFO] Finished at: 2019-02-11T14:15:25-08:00
[Pipeline] // withMaven
[Pipeline] cleanWs
[INFO] Final Memory: 26M/94M
[INFO] ------------------------------------------------------------------------
[INFO] [jenkins-event-spy] Generated F:\jenkins\jenkins-slave\workspace\ox_maven-scripting-plugin_master@2@tmp\withMavena3c95b8c\maven-spy-20190211-141458-28315998151003104654490.log
[ERROR] Failed to execute goal org.apache.maven.plugins:maven-compiler-plugin:3.7.0:compile (default-compile) on project maven-scripting-plugin: Compilation failure: Compilation failure:
[ERROR] Source option 6 is no longer supported. Use 7 or later.
[ERROR] Target option 6 is no longer supported. Use 7 or later.
[ERROR] -> [Help 1]
org.apache.maven.lifecycle.LifecycleExecutionException: Failed to execute goal org.apache.maven.plugins:maven-compiler-plugin:3.7.0:compile (default-compile) on project maven-scripting-plugin: Compilation failure
    at org.apache.maven.lifecycle.internal.MojoExecutor.execute (MojoExecutor.java:213)
    at org.apache.maven.lifecycle.internal.MojoExecutor.execute (MojoExecutor.java:154)
    at org.apache.maven.lifecycle.internal.MojoExecutor.execute (MojoExecutor.java:146)
    at org.apache.maven.lifecycle.internal.LifecycleModuleBuilder.buildProject (LifecycleModuleBuilder.java:117)
    at org.apache.maven.lifecycle.internal.LifecycleModuleBuilder.buildProject (LifecycleModuleBuilder.java:81)
    at org.apache.maven.lifecycle.internal.builder.singlethreaded.SingleThreadedBuilder.build (SingleThreadedBuilder.java:51)
    at org.apache.maven.lifecycle.internal.LifecycleStarter.execute (LifecycleStarter.java:128)
    at org.apache.maven.DefaultMaven.doExecute (DefaultMaven.java:309)
    at org.apache.maven.DefaultMaven.doExecute (DefaultMaven.java:194)
    at org.apache.maven.DefaultMaven.execute (DefaultMaven.java:107)
    at org.apache.maven.cli.MavenCli.execute (MavenCli.java:955)
    at org.apache.maven.cli.MavenCli.doMain (MavenCli.java:290)
    at org.apache.maven.cli.MavenCli.main (MavenCli.java:194)
    at jdk.internal.reflect.NativeMethodAccessorImpl.invoke0 (Native Method)
    at jdk.internal.reflect.NativeMethodAccessorImpl.invoke (NativeMethodAccessorImpl.java:62)
    at jdk.internal.reflect.DelegatingMethodAccessorImpl.invoke (DelegatingMethodAccessorImpl.java:43)
    at java.lang.reflect.Method.invoke (Method.java:567)
    at org.codehaus.plexus.classworlds.launcher.Launcher.launchEnhanced (Launcher.java:289)
    at org.codehaus.plexus.classworlds.launcher.Launcher.launch (Launcher.java:229)
    at org.codehaus.plexus.classworlds.launcher.Launcher.mainWithExitCode (Launcher.java:415)
    at org.codehaus.plexus.classworlds.launcher.Launcher.main (Launcher.java:356)
Caused by: org.apache.maven.plugin.compiler.CompilationFailureException: Compilation failure
    at org.apache.maven.plugin.compiler.AbstractCompilerMojo.execute (AbstractCompilerMojo.java:1161)
    at org.apache.maven.plugin.compiler.CompilerMojo.execute (CompilerMojo.java:168)
    at org.apache.maven.plugin.DefaultBuildPluginManager.executeMojo (DefaultBuildPluginManager.java:134)
    at org.apache.maven.lifecycle.internal.MojoExecutor.execute (MojoExecutor.java:208)
    at org.apache.maven.lifecycle.internal.MojoExecutor.execute (MojoExecutor.java:154)
    at org.apache.maven.lifecycle.internal.MojoExecutor.execute (MojoExecutor.java:146)
    at org.apache.maven.lifecycle.internal.LifecycleModuleBuilder.buildProject (LifecycleModuleBuilder.java:117)
    at org.apache.maven.lifecycle.internal.LifecycleModuleBuilder.buildProject (LifecycleModuleBuilder.java:81)
    at org.apache.maven.lifecycle.internal.builder.singlethreaded.SingleThreadedBuilder.build (SingleThreadedBuilder.java:51)
    at org.apache.maven.lifecycle.internal.LifecycleStarter.execute (LifecycleStarter.java:128)
    at org.apache.maven.DefaultMaven.doExecute (DefaultMaven.java:309)
    at org.apache.maven.DefaultMaven.doExecute (DefaultMaven.java:194)
    at org.apache.maven.DefaultMaven.execute (DefaultMaven.java:107)
    at org.apache.maven.cli.MavenCli.execute (MavenCli.java:955)
    at org.apache.maven.cli.MavenCli.doMain (MavenCli.java:290)
    at org.apache.maven.cli.MavenCli.main (MavenCli.java:194)
    at jdk.internal.reflect.NativeMethodAccessorImpl.invoke0 (Native Method)
    at jdk.internal.reflect.NativeMethodAccessorImpl.invoke (NativeMethodAccessorImpl.java:62)
    at jdk.internal.reflect.DelegatingMethodAccessorImpl.invoke (DelegatingMethodAccessorImpl.java:43)
    at java.lang.reflect.Method.invoke (Method.java:567)
    at org.codehaus.plexus.classworlds.launcher.Launcher.launchEnhanced (Launcher.java:289)
    at org.codehaus.plexus.classworlds.launcher.Launcher.launch (Launcher.java:229)
    at org.codehaus.plexus.classworlds.launcher.Launcher.mainWithExitCode (Launcher.java:415)
    at org.codehaus.plexus.classworlds.launcher.Launcher.main (Launcher.java:356)
[ERROR]
[ERROR] Re-run Maven using the -X switch to enable full debug logging.
[ERROR]
[ERROR] For more information about the errors and possible solutions, please read the following articles:
[ERROR] [Help 1] http://cwiki.apache.org/confluence/display/MAVEN/MojoFailureException
[Pipeline] }
[Pipeline] // dir
[Pipeline] }
[withMaven] openTasksPublisher - Scan Tasks for Maven artifact org.apache.maven.plugins:maven-scripting-plugin:maven-plugin:3.0.0-SNAPSHOT in source directory windows-jdk12-m3.5.x_build\src\main\java
[TASKS] Scanning folder 'f:\jenkins\jenkins-slave\workspace\ox_maven-scripting-plugin_master@2' for files matching the pattern 'windows-jdk12-m3.5.x_build\src\main\java\**\*' - excludes: null
[TASKS] Found 1 files to scan for tasks
[TASKS] Found 0 open tasks.
Skipping warnings blame since pipelines do not have an SCM link.%n
[TASKS] Computing warning deltas based on reference build #26
[WS-CLEANUP] Deleting project workspace...
[WS-CLEANUP] Deferred wipeout is used...
[withMaven] Publishers: Generated Artifacts Publisher: 30 ms, Open Task Scanner Publisher: 57 ms
[Pipeline] // withMaven
[Pipeline] cleanWs
[WS-CLEANUP] Deleting project workspace...
[WS-CLEANUP] Deferred wipeout is used...
[WS-CLEANUP] done
[Pipeline] cleanWs
[WS-CLEANUP] Deleting project workspace...
[WS-CLEANUP] Deferred wipeout is used...
[WS-CLEANUP] done
[Pipeline] }
[WS-CLEANUP] done
[Pipeline] // stage
[Pipeline] }
[Pipeline] }
[Pipeline] // ws
[Pipeline] // stage
[Pipeline] }
[Pipeline] }
[Pipeline] // node
[Pipeline] // ws
[Pipeline] }
Failed in branch windows-jdk12-m3.5.x_build
[Pipeline] }
[Pipeline] // node
[Pipeline] }
[INFO] Downloaded from central: https://repo.maven.apache.org/maven2/org/codehaus/groovy/groovy-jsr223/2.4.7/groovy-jsr223-2.4.7.pom (0 B at 0 B/s)
[INFO]
[INFO] --- maven-clean-plugin:3.0.0:clean (default-clean) @ maven-scripting-plugin ---
[INFO]
[INFO] --- maven-enforcer-plugin:1.4.1:enforce (enforce-maven-version) @ maven-scripting-plugin ---
[INFO]
[INFO] --- maven-enforcer-plugin:1.4.1:enforce (enforce-bytecode-version) @ maven-scripting-plugin ---
[INFO]
[INFO] --- maven-enforcer-plugin:1.4.1:enforce (ban-known-bad-maven-versions) @ maven-scripting-plugin ---
[INFO]
[INFO] --- maven-enforcer-plugin:1.4.1:enforce (ensure-no-container-api) @ maven-scripting-plugin ---
[INFO]
[INFO] --- apache-rat-plugin:0.12:check (rat-check) @ maven-scripting-plugin ---
[INFO] Enabled default license matchers.
[INFO] Will parse SCM ignores for exclusions...
[INFO] Parsing exclusions from f:\jenkins\jenkins-slave\workspace\ven-scripting-plugin_master-F7DFWWXZD7KAQGDPAQML3SYNOE2CUDOJDQGTJN7NKKPXY3SWUHCQ@2@2\windows-jdk7-m3.5.x_build\.gitignore
[INFO] Finished adding exclusions from SCM ignore files.
[INFO] 71 implicit excludes (use -debug for more details).
[INFO] Exclude: .repository/**
[INFO] Exclude: .maven/spy.log
[INFO] Exclude: dependency-reduced-pom.xml
[INFO] Exclude: .java-version
[INFO] 7 resources included (use -debug for more details)
[INFO] Rat check: Summary over all files. Unapproved: 0, unknown: 0, generated: 0, approved: 7 licenses.
[INFO]
[INFO] --- maven-plugin-plugin:3.5.1:helpmojo (generate-helpmojo) @ maven-scripting-plugin ---
[INFO] Using 'UTF-8' encoding to read mojo source files.
[INFO] java-annotations mojo extractor found 0 mojo descriptor.
[INFO] java-javadoc mojo extractor found 0 mojo descriptor.
[INFO]
[INFO] --- maven-remote-resources-plugin:1.5:process (process-resource-bundles) @ maven-scripting-plugin ---
[INFO]
[INFO] --- maven-resources-plugin:3.0.2:resources (default-resources) @ maven-scripting-plugin ---
[INFO] Using 'UTF-8' encoding to copy filtered resources.
[INFO] skip non existing resourceDirectory f:\jenkins\jenkins-slave\workspace\ven-scripting-plugin_master-F7DFWWXZD7KAQGDPAQML3SYNOE2CUDOJDQGTJN7NKKPXY3SWUHCQ@2@2\windows-jdk7-m3.5.x_build\src\main\resources
[INFO] Copying 3 resources
[INFO]
[INFO] --- maven-compiler-plugin:3.7.0:compile (default-compile) @ maven-scripting-plugin ---
[INFO] Changes detected - recompiling the module!
[INFO] Compiling 2 source files to f:\jenkins\jenkins-slave\workspace\ven-scripting-plugin_master-F7DFWWXZD7KAQGDPAQML3SYNOE2CUDOJDQGTJN7NKKPXY3SWUHCQ@2@2\windows-jdk7-m3.5.x_build\target\classes
[INFO]
[INFO] --- maven-plugin-plugin:3.5.1:descriptor (default-descriptor) @ maven-scripting-plugin ---
[INFO] Using 'UTF-8' encoding to read mojo source files.
[INFO] java-annotations mojo extractor found 2 mojo descriptors.
[INFO] java-javadoc mojo extractor found 0 mojo descriptor.
[INFO]
[INFO] --- maven-resources-plugin:3.0.2:testResources (default-testResources) @ maven-scripting-plugin ---
[INFO] Using 'UTF-8' encoding to copy filtered resources.
[INFO] skip non existing resourceDirectory f:\jenkins\jenkins-slave\workspace\ven-scripting-plugin_master-F7DFWWXZD7KAQGDPAQML3SYNOE2CUDOJDQGTJN7NKKPXY3SWUHCQ@2@2\windows-jdk7-m3.5.x_build\src\test\resources
[INFO] Copying 3 resources
[INFO]
[INFO] --- maven-compiler-plugin:3.7.0:testCompile (default-testCompile) @ maven-scripting-plugin ---
[INFO] No sources to compile
[INFO]
[INFO] --- maven-surefire-plugin:2.20.1:test (default-test) @ maven-scripting-plugin ---
[INFO]
[INFO] --- maven-jar-plugin:3.0.2:jar (default-jar) @ maven-scripting-plugin ---
[INFO] Building jar: f:\jenkins\jenkins-slave\workspace\ven-scripting-plugin_master-F7DFWWXZD7KAQGDPAQML3SYNOE2CUDOJDQGTJN7NKKPXY3SWUHCQ@2@2\windows-jdk7-m3.5.x_build\target\maven-scripting-plugin-3.0.0-SNAPSHOT.jar
[INFO]
[INFO] --- maven-plugin-plugin:3.5.1:addPluginArtifactMetadata (default-addPluginArtifactMetadata) @ maven-scripting-plugin ---
[INFO]
[INFO] --- maven-site-plugin:3.7:attach-descriptor (attach-descriptor) @ maven-scripting-plugin ---
[INFO] Skipping because packaging 'maven-plugin' is not pom.
[INFO]
[INFO] --- maven-invoker-plugin:3.0.1:install (integration-test) @ maven-scripting-plugin ---
[INFO] Installing f:\jenkins\jenkins-slave\workspace\ven-scripting-plugin_master-F7DFWWXZD7KAQGDPAQML3SYNOE2CUDOJDQGTJN7NKKPXY3SWUHCQ@2@2\windows-jdk7-m3.5.x_build\pom.xml to f:\jenkins\jenkins-slave\workspace\ven-scripting-plugin_master-F7DFWWXZD7KAQGDPAQML3SYNOE2CUDOJDQGTJN7NKKPXY3SWUHCQ@2@2\windows-jdk7-m3.5.x_build\target\local-repo\org\apache\maven\plugins\maven-scripting-plugin\3.0.0-SNAPSHOT\maven-scripting-plugin-3.0.0-SNAPSHOT.pom
[INFO] Installing f:\jenkins\jenkins-slave\workspace\ven-scripting-plugin_master-F7DFWWXZD7KAQGDPAQML3SYNOE2CUDOJDQGTJN7NKKPXY3SWUHCQ@2@2\windows-jdk7-m3.5.x_build\target\maven-scripting-plugin-3.0.0-SNAPSHOT.jar to f:\jenkins\jenkins-slave\workspace\ven-scripting-plugin_master-F7DFWWXZD7KAQGDPAQML3SYNOE2CUDOJDQGTJN7NKKPXY3SWUHCQ@2@2\windows-jdk7-m3.5.x_build\target\local-repo\org\apache\maven\plugins\maven-scripting-plugin\3.0.0-SNAPSHOT\maven-scripting-plugin-3.0.0-SNAPSHOT.jar
[INFO]
[INFO] --- maven-invoker-plugin:3.0.1:integration-test (integration-test) @ maven-scripting-plugin ---
[INFO] Running Setup Jobs
[INFO] Building: groovy-script\pom.xml
[INFO]           groovy-script\pom.xml ............................ SUCCESS (6.7 s)
[INFO]
[INFO] --- maven-checkstyle-plugin:3.0.0:check (checkstyle-check) @ maven-scripting-plugin ---
[INFO]
[INFO] --- maven-invoker-plugin:3.0.1:verify (integration-test) @ maven-scripting-plugin ---
[INFO] -------------------------------------------------
[INFO] Build Summary:
[INFO]   Passed: 1, Failed: 0, Errors: 0, Skipped: 0
[INFO] -------------------------------------------------
[INFO] ------------------------------------------------------------------------
[INFO] BUILD SUCCESS
[INFO] ------------------------------------------------------------------------
[INFO] Total time: 15:23 min
[INFO] Finished at: 2019-02-11T22:30:14Z
[INFO] Final Memory: 68M/1116M
[INFO] ------------------------------------------------------------------------
[INFO] [jenkins-event-spy] Generated F:\jenkins\jenkins-slave\workspace\ven-scripting-plugin_master-F7DFWWXZD7KAQGDPAQML3SYNOE2CUDOJDQGTJN7NKKPXY3SWUHCQ@2@2@tmp\withMaven5deb6762\maven-spy-20190211-221450-3483278338440676107350.log
Picked up JAVA_TOOL_OPTIONS: -Dmaven.ext.class.path="f:\jenkins\jenkins-slave\workspace\ven-scripting-plugin_master-F7DFWWXZD7KAQGDPAQML3SYNOE2CUDOJDQGTJN7NKKPXY3SWUHCQ@2@2@tmp\withMaven5deb6762\pipeline-maven-spy.jar" -Dorg.jenkinsci.plugins.pipeline.maven.reportsFolder="f:\jenkins\jenkins-slave\workspace\ven-scripting-plugin_master-F7DFWWXZD7KAQGDPAQML3SYNOE2CUDOJDQGTJN7NKKPXY3SWUHCQ@2@2@tmp\withMaven5deb6762"
[Pipeline] }
[Pipeline] // dir
[Pipeline] }
[withMaven] artifactsPublisher - Archive artifact windows-jdk7-m3.5.x_build\pom.xml under org\apache\maven\plugins\maven-scripting-plugin\3.0.0-SNAPSHOT\maven-scripting-plugin-3.0.0-SNAPSHOT.pom
[withMaven] artifactsPublisher - Archive artifact windows-jdk7-m3.5.x_build\target\maven-scripting-plugin-3.0.0-SNAPSHOT.jar under org\apache\maven\plugins\maven-scripting-plugin\3.0.0-SNAPSHOT\maven-scripting-plugin-3.0.0-SNAPSHOT.jar
[withMaven] junitPublisher - Archive test results for Maven artifact org.apache.maven.plugins:maven-scripting-plugin:maven-plugin:3.0.0-SNAPSHOT generated by maven-surefire-plugin:test (default-test): windows-jdk7-m3.5.x_build\target\surefire-reports\*.xml
Recording test results
None of the test reports contained any result
[withMaven] openTasksPublisher - Scan Tasks for Maven artifact org.apache.maven.plugins:maven-scripting-plugin:maven-plugin:3.0.0-SNAPSHOT in source directory windows-jdk7-m3.5.x_build\src\main\java
[TASKS] Scanning folder 'f:\jenkins\jenkins-slave\workspace\ven-scripting-plugin_master-F7DFWWXZD7KAQGDPAQML3SYNOE2CUDOJDQGTJN7NKKPXY3SWUHCQ@2@2' for files matching the pattern 'windows-jdk7-m3.5.x_build\src\main\java\**\*' - excludes: null
[TASKS] Found 1 files to scan for tasks
[TASKS] Found 0 open tasks.
Skipping warnings blame since pipelines do not have an SCM link.%n
[TASKS] Computing warning deltas based on reference build #26
[withMaven] invokerPublisher - Archive invoker results for Maven artifact MavenArtifact{org.apache.maven.plugins:maven-scripting-plugin:maven-plugin:3.0.0-SNAPSHOT(version: 3.0.0-SNAPSHOT, snapshot:false) } generated by PluginInvocation{org.apache.maven.plugins:maven-invoker-plugin:3.0.1@integration-test  integration-test}: windows-jdk7-m3.5.x_build\target\invoker-reports\*.xml
[withMaven] Publishers: Generated Artifacts Publisher: 119 ms, Junit Publisher: 24 ms, Open Task Scanner Publisher: 54 ms, Invoker Publisher: 125 ms, Pipeline Graph Publisher: 16 ms
[Pipeline] // withMaven
[Pipeline] cleanWs
[WS-CLEANUP] Deleting project workspace...
[WS-CLEANUP] Deferred wipeout is used...
[WS-CLEANUP] done
[Pipeline] }
[Pipeline] // stage
[Pipeline] }
[Pipeline] // ws
[Pipeline] }
[Pipeline] // node
[Pipeline] }
[Pipeline] // parallel
[Pipeline] stage
[Pipeline] { (Notifications)
[Pipeline] echo
Build result: FAILURE
[Pipeline] jiraIssueSelector
[Pipeline] emailext