Build failed in Jenkins: Maven TLP » maven-scm-publish-plugin » master #15

classic Classic list List threaded Threaded
2 messages Options
Reply | Threaded
Open this post in threaded view
|

Build failed in Jenkins: Maven TLP » maven-scm-publish-plugin » master #15

Apache Jenkins Server-2
See https://builds.apache.org/job/maven-box/job/maven-scm-publish-plugin/job/master/15/

No changes.

No tests ran.

Build log:
[...truncated 2723 lines...]
[INFO] --- maven-checkstyle-plugin:3.0.0:check (checkstyle-check) @ maven-scm-publish-plugin ---
[INFO]
[INFO] --- maven-invoker-plugin:3.1.0:verify (integration-test) @ maven-scm-publish-plugin ---
[INFO] -------------------------------------------------
[INFO] Build Summary:
[INFO]   Passed: 3, Failed: 0, Errors: 0, Skipped: 1
[INFO] -------------------------------------------------
[INFO] ------------------------------------------------------------------------
[INFO] BUILD SUCCESS
[INFO] ------------------------------------------------------------------------
[INFO] Total time:  01:18 min
[INFO] Finished at: 2019-06-22T15:43:22Z
[INFO] ------------------------------------------------------------------------
[INFO] [jenkins-event-spy] Generated F:\jenkins\jenkins-slave\workspace\_maven-scm-publish-plugin_master@2@tmp\withMavene0083792\maven-spy-20190622-154202-9526489884716176345831.log
[Pipeline] }
[Pipeline] // dir
[Pipeline] }
[withMaven] artifactsPublisher - Archive artifact windows-jdk12-m3.6.x_build\pom.xml under org\apache\maven\plugins\maven-scm-publish-plugin\3.1.0-SNAPSHOT\maven-scm-publish-plugin-3.1.0-SNAPSHOT.pom
[withMaven] artifactsPublisher - Archive artifact windows-jdk12-m3.6.x_build\target\maven-scm-publish-plugin-3.1.0-SNAPSHOT.jar under org\apache\maven\plugins\maven-scm-publish-plugin\3.1.0-SNAPSHOT\maven-scm-publish-plugin-3.1.0-SNAPSHOT.jar
[INFO]
[INFO] --- maven-plugin-plugin:3.5.2:descriptor (default-descriptor) @ maven-scm-publish-plugin ---
[INFO] Using 'UTF-8' encoding to read mojo source files.
[INFO] java-javadoc mojo extractor found 1 mojo descriptor.
[withMaven] junitPublisher - Archive test results for Maven artifact org.apache.maven.plugins:maven-scm-publish-plugin:maven-plugin:3.1.0-SNAPSHOT generated by maven-surefire-plugin:test (default-test): windows-jdk12-m3.6.x_build\target\surefire-reports\*.xml
Recording test results
None of the test reports contained any result
[withMaven] openTasksPublisher - Scan Tasks for Maven artifact org.apache.maven.plugins:maven-scm-publish-plugin:maven-plugin:3.1.0-SNAPSHOT in source directory windows-jdk12-m3.6.x_build\src\main\java
[TASKS] Scanning folder 'f:\jenkins\jenkins-slave\workspace\_maven-scm-publish-plugin_master@2' for files matching the pattern 'windows-jdk12-m3.6.x_build\src\main\java\**\*' - excludes: null
[TASKS] Found 3 files to scan for tasks
[TASKS] Found 4 open tasks.
Skipping warnings blame since pipelines do not have an SCM link.%n
[TASKS] Computing warning deltas based on reference build #14
[INFO]           job_@2\pom.xml ................................... SUCCESS (29.9 s)
[INFO] Building: publish-scm\pom.xml
[INFO]           publish-scm\pom.xml .............................. SKIPPED due to OS
[INFO] Building: publish-scm-staged\pom.xml
[INFO] run pre-build script setup.bsh
[withMaven] invokerPublisher - Archive invoker results for Maven artifact MavenArtifact{org.apache.maven.plugins:maven-scm-publish-plugin:maven-plugin:3.1.0-SNAPSHOT(version: 3.1.0-SNAPSHOT, snapshot:false) } generated by PluginInvocation{org.apache.maven.plugins:maven-invoker-plugin:3.1.0@integration-test  integration-test}: windows-jdk12-m3.6.x_build\target\invoker-reports\*.xml
[withMaven] Publishers: Generated Artifacts Publisher: 121 ms, Junit Publisher: 21 ms, Open Task Scanner Publisher: 83 ms, Invoker Publisher: 967 ms
[Pipeline] // withMaven
[Pipeline] cleanWs
[WS-CLEANUP] Deleting project workspace...
[WS-CLEANUP] Deferred wipeout is used...
[WS-CLEANUP] done
[Pipeline] }
[Pipeline] // stage
[Pipeline] }
[Pipeline] // ws
[Pipeline] }
[Pipeline] // node
[Pipeline] }
[INFO] java-annotations mojo extractor found 2 mojo descriptors.
[INFO]
[INFO] --- maven-resources-plugin:3.1.0:testResources (default-testResources) @ maven-scm-publish-plugin ---
[INFO] Using 'UTF-8' encoding to copy filtered resources.
[INFO] skip non existing resourceDirectory f:\jenkins\jenkins-slave\workspace\_maven-scm-publish-plugin_master@2\windows-jdk8-m3.6.x_build\src\test\resources
[INFO] Copying 3 resources
[INFO]
[INFO] --- maven-compiler-plugin:3.7.0:testCompile (default-testCompile) @ maven-scm-publish-plugin ---
[INFO] No sources to compile
[INFO]
[INFO] --- maven-surefire-plugin:2.22.0:test (default-test) @ maven-scm-publish-plugin ---
[INFO]
[INFO] --- maven-jar-plugin:3.1.0:jar (default-jar) @ maven-scm-publish-plugin ---
[INFO] Building jar: f:\jenkins\jenkins-slave\workspace\_maven-scm-publish-plugin_master@2\windows-jdk8-m3.6.x_build\target\maven-scm-publish-plugin-3.1.0-SNAPSHOT.jar
[INFO]
[INFO] --- maven-plugin-plugin:3.5.2:addPluginArtifactMetadata (default-addPluginArtifactMetadata) @ maven-scm-publish-plugin ---
[INFO]
[INFO] --- maven-site-plugin:3.7:attach-descriptor (attach-descriptor) @ maven-scm-publish-plugin ---
[INFO]           publish-scm-staged\pom.xml ....................... SUCCESS (21.0 s)
[INFO] Building: site-deploy\pom.xml
[INFO] run pre-build script setup.bsh
[INFO] Skipping because packaging 'maven-plugin' is not pom.
[INFO]
[INFO] --- maven-invoker-plugin:3.1.0:install (integration-test) @ maven-scm-publish-plugin ---
[INFO] Installing f:\jenkins\jenkins-slave\workspace\_maven-scm-publish-plugin_master@2\windows-jdk8-m3.6.x_build\pom.xml to f:\jenkins\jenkins-slave\workspace\_maven-scm-publish-plugin_master@2\windows-jdk8-m3.6.x_build\target\local-repo\org\apache\maven\plugins\maven-scm-publish-plugin\3.1.0-SNAPSHOT\maven-scm-publish-plugin-3.1.0-SNAPSHOT.pom
[INFO] Installing f:\jenkins\jenkins-slave\workspace\_maven-scm-publish-plugin_master@2\windows-jdk8-m3.6.x_build\target\maven-scm-publish-plugin-3.1.0-SNAPSHOT.jar to f:\jenkins\jenkins-slave\workspace\_maven-scm-publish-plugin_master@2\windows-jdk8-m3.6.x_build\target\local-repo\org\apache\maven\plugins\maven-scm-publish-plugin\3.1.0-SNAPSHOT\maven-scm-publish-plugin-3.1.0-SNAPSHOT.jar
[INFO]
[INFO] --- maven-invoker-plugin:3.1.0:integration-test (integration-test) @ maven-scm-publish-plugin ---
[INFO] Building: job_@2\pom.xml
[INFO] run pre-build script setup.bsh
[INFO]           site-deploy\pom.xml .............................. SUCCESS (21.1 s)
[INFO]
[INFO] --- maven-checkstyle-plugin:3.0.0:check (checkstyle-check) @ maven-scm-publish-plugin ---
[INFO]
[INFO] --- maven-invoker-plugin:3.1.0:verify (integration-test) @ maven-scm-publish-plugin ---
[INFO] -------------------------------------------------
[INFO] Build Summary:
[INFO]   Passed: 3, Failed: 0, Errors: 0, Skipped: 1
[INFO] -------------------------------------------------
[INFO] ------------------------------------------------------------------------
[INFO] BUILD SUCCESS
[INFO] ------------------------------------------------------------------------
[INFO] Total time:  01:31 min
[INFO] Finished at: 2019-06-22T15:44:04Z
[INFO] ------------------------------------------------------------------------
[INFO] [jenkins-event-spy] Generated F:\jenkins\jenkins-slave\workspace\_maven-scm-publish-plugin_master@3@2@tmp\withMavenef26f14a\maven-spy-20190622-154233-3238958825270672500007.log
[Pipeline] }
[Pipeline] // dir
[Pipeline] }
[withMaven] artifactsPublisher - Archive artifact windows-jdk13-m3.6.x_build\pom.xml under org\apache\maven\plugins\maven-scm-publish-plugin\3.1.0-SNAPSHOT\maven-scm-publish-plugin-3.1.0-SNAPSHOT.pom
[withMaven] artifactsPublisher - Archive artifact windows-jdk13-m3.6.x_build\target\maven-scm-publish-plugin-3.1.0-SNAPSHOT.jar under org\apache\maven\plugins\maven-scm-publish-plugin\3.1.0-SNAPSHOT\maven-scm-publish-plugin-3.1.0-SNAPSHOT.jar
[withMaven] junitPublisher - Archive test results for Maven artifact org.apache.maven.plugins:maven-scm-publish-plugin:maven-plugin:3.1.0-SNAPSHOT generated by maven-surefire-plugin:test (default-test): windows-jdk13-m3.6.x_build\target\surefire-reports\*.xml
Recording test results
None of the test reports contained any result
[withMaven] openTasksPublisher - Scan Tasks for Maven artifact org.apache.maven.plugins:maven-scm-publish-plugin:maven-plugin:3.1.0-SNAPSHOT in source directory windows-jdk13-m3.6.x_build\src\main\java
[TASKS] Scanning folder 'f:\jenkins\jenkins-slave\workspace\_maven-scm-publish-plugin_master@3@2' for files matching the pattern 'windows-jdk13-m3.6.x_build\src\main\java\**\*' - excludes: null
[TASKS] Found 3 files to scan for tasks
[TASKS] Found 4 open tasks.
Skipping warnings blame since pipelines do not have an SCM link.%n
[TASKS] Computing warning deltas based on reference build #14
[withMaven] invokerPublisher - Archive invoker results for Maven artifact MavenArtifact{org.apache.maven.plugins:maven-scm-publish-plugin:maven-plugin:3.1.0-SNAPSHOT(version: 3.1.0-SNAPSHOT, snapshot:false) } generated by PluginInvocation{org.apache.maven.plugins:maven-invoker-plugin:3.1.0@integration-test  integration-test}: windows-jdk13-m3.6.x_build\target\invoker-reports\*.xml
[withMaven] Publishers: Generated Artifacts Publisher: 168 ms, Junit Publisher: 20 ms, Open Task Scanner Publisher: 85 ms, Invoker Publisher: 1277 ms, Pipeline Graph Publisher: 1 ms
[Pipeline] // withMaven
[Pipeline] cleanWs
[WS-CLEANUP] Deleting project workspace...
[WS-CLEANUP] Deferred wipeout is used...
[WS-CLEANUP] done
[Pipeline] }
[Pipeline] // stage
[Pipeline] }
[Pipeline] // ws
[Pipeline] }
[Pipeline] // node
[Pipeline] }
[INFO]           job_@2\pom.xml ................................... FAILED (89.1 s)
[INFO]   The build exited with code 1. See f:\jenkins\jenkins-slave\workspace\_maven-scm-publish-plugin_master@2\windows-jdk8-m3.6.x_build\target\it\job_@2\build.log for details.
[INFO] Building: publish-scm\pom.xml
[INFO]           publish-scm\pom.xml .............................. SKIPPED due to OS
[INFO] Building: publish-scm-staged\pom.xml
[INFO] run pre-build script setup.bsh
[INFO]           publish-scm-staged\pom.xml ....................... FAILED (12.6 s)
[INFO]   The build exited with code 1. See f:\jenkins\jenkins-slave\workspace\_maven-scm-publish-plugin_master@2\windows-jdk8-m3.6.x_build\target\it\publish-scm-staged\build.log for details.
[INFO] Building: site-deploy\pom.xml
[INFO] run pre-build script setup.bsh
[INFO]           site-deploy\pom.xml .............................. FAILED (13.6 s)
[INFO]   The build exited with code 1. See f:\jenkins\jenkins-slave\workspace\_maven-scm-publish-plugin_master@2\windows-jdk8-m3.6.x_build\target\it\site-deploy\build.log for details.
[INFO]
[INFO] --- maven-checkstyle-plugin:3.0.0:check (checkstyle-check) @ maven-scm-publish-plugin ---
[INFO]
[INFO] --- maven-invoker-plugin:3.1.0:verify (integration-test) @ maven-scm-publish-plugin ---
[INFO] -------------------------------------------------
[INFO] Build Summary:
[INFO]   Passed: 0, Failed: 3, Errors: 0, Skipped: 1
[INFO] -------------------------------------------------
[ERROR] The following builds failed:
[ERROR] *  job_@2\pom.xml
[ERROR] *  publish-scm-staged\pom.xml
[ERROR] *  site-deploy\pom.xml
[INFO] -------------------------------------------------
[INFO] ------------------------------------------------------------------------
[INFO] BUILD FAILURE
[INFO] ------------------------------------------------------------------------
[INFO] Total time:  04:10 min
[INFO] Finished at: 2019-06-22T15:45:49Z
[INFO] ------------------------------------------------------------------------
[INFO] [jenkins-event-spy] Generated F:\jenkins\jenkins-slave\workspace\_maven-scm-publish-plugin_master@2@tmp\withMaven2563db04\maven-spy-20190622-154137-97429835755597646516.log
[ERROR] Failed to execute goal org.apache.maven.plugins:maven-invoker-plugin:3.1.0:verify (integration-test) on project maven-scm-publish-plugin: 3 builds failed. See console output above for details. -> [Help 1]
org.apache.maven.lifecycle.LifecycleExecutionException: Failed to execute goal org.apache.maven.plugins:maven-invoker-plugin:3.1.0:verify (integration-test) on project maven-scm-publish-plugin: 3 builds failed. See console output above for details.
    at org.apache.maven.lifecycle.internal.MojoExecutor.execute (MojoExecutor.java:215)
    at org.apache.maven.lifecycle.internal.MojoExecutor.execute (MojoExecutor.java:156)
    at org.apache.maven.lifecycle.internal.MojoExecutor.execute (MojoExecutor.java:148)
    at org.apache.maven.lifecycle.internal.LifecycleModuleBuilder.buildProject (LifecycleModuleBuilder.java:117)
    at org.apache.maven.lifecycle.internal.LifecycleModuleBuilder.buildProject (LifecycleModuleBuilder.java:81)
    at org.apache.maven.lifecycle.internal.builder.singlethreaded.SingleThreadedBuilder.build (SingleThreadedBuilder.java:56)
    at org.apache.maven.lifecycle.internal.LifecycleStarter.execute (LifecycleStarter.java:128)
    at org.apache.maven.DefaultMaven.doExecute (DefaultMaven.java:305)
    at org.apache.maven.DefaultMaven.doExecute (DefaultMaven.java:192)
    at org.apache.maven.DefaultMaven.execute (DefaultMaven.java:105)
    at org.apache.maven.cli.MavenCli.execute (MavenCli.java:956)
    at org.apache.maven.cli.MavenCli.doMain (MavenCli.java:288)
    at org.apache.maven.cli.MavenCli.main (MavenCli.java:192)
    at sun.reflect.NativeMethodAccessorImpl.invoke0 (Native Method)
    at sun.reflect.NativeMethodAccessorImpl.invoke (NativeMethodAccessorImpl.java:62)
    at sun.reflect.DelegatingMethodAccessorImpl.invoke (DelegatingMethodAccessorImpl.java:43)
    at java.lang.reflect.Method.invoke (Method.java:498)
    at org.codehaus.plexus.classworlds.launcher.Launcher.launchEnhanced (Launcher.java:289)
    at org.codehaus.plexus.classworlds.launcher.Launcher.launch (Launcher.java:229)
    at org.codehaus.plexus.classworlds.launcher.Launcher.mainWithExitCode (Launcher.java:415)
    at org.codehaus.plexus.classworlds.launcher.Launcher.main (Launcher.java:356)
Caused by: org.apache.maven.plugin.MojoFailureException: 3 builds failed. See console output above for details.
    at org.apache.maven.plugins.invoker.InvokerSession.handleFailures (InvokerSession.java:260)
    at org.apache.maven.plugins.invoker.VerifyMojo.execute (VerifyMojo.java:137)
    at org.apache.maven.plugin.DefaultBuildPluginManager.executeMojo (DefaultBuildPluginManager.java:137)
    at org.apache.maven.lifecycle.internal.MojoExecutor.execute (MojoExecutor.java:210)
    at org.apache.maven.lifecycle.internal.MojoExecutor.execute (MojoExecutor.java:156)
    at org.apache.maven.lifecycle.internal.MojoExecutor.execute (MojoExecutor.java:148)
    at org.apache.maven.lifecycle.internal.LifecycleModuleBuilder.buildProject (LifecycleModuleBuilder.java:117)
    at org.apache.maven.lifecycle.internal.LifecycleModuleBuilder.buildProject (LifecycleModuleBuilder.java:81)
    at org.apache.maven.lifecycle.internal.builder.singlethreaded.SingleThreadedBuilder.build (SingleThreadedBuilder.java:56)
    at org.apache.maven.lifecycle.internal.LifecycleStarter.execute (LifecycleStarter.java:128)
    at org.apache.maven.DefaultMaven.doExecute (DefaultMaven.java:305)
    at org.apache.maven.DefaultMaven.doExecute (DefaultMaven.java:192)
    at org.apache.maven.DefaultMaven.execute (DefaultMaven.java:105)
    at org.apache.maven.cli.MavenCli.execute (MavenCli.java:956)
    at org.apache.maven.cli.MavenCli.doMain (MavenCli.java:288)
    at org.apache.maven.cli.MavenCli.main (MavenCli.java:192)
    at sun.reflect.NativeMethodAccessorImpl.invoke0 (Native Method)
    at sun.reflect.NativeMethodAccessorImpl.invoke (NativeMethodAccessorImpl.java:62)
    at sun.reflect.DelegatingMethodAccessorImpl.invoke (DelegatingMethodAccessorImpl.java:43)
    at java.lang.reflect.Method.invoke (Method.java:498)
    at org.codehaus.plexus.classworlds.launcher.Launcher.launchEnhanced (Launcher.java:289)
    at org.codehaus.plexus.classworlds.launcher.Launcher.launch (Launcher.java:229)
    at org.codehaus.plexus.classworlds.launcher.Launcher.mainWithExitCode (Launcher.java:415)
    at org.codehaus.plexus.classworlds.launcher.Launcher.main (Launcher.java:356)
[ERROR]
[ERROR] Re-run Maven using the -X switch to enable full debug logging.
[ERROR]
[ERROR] For more information about the errors and possible solutions, please read the following articles:
[ERROR] [Help 1] http://cwiki.apache.org/confluence/display/MAVEN/MojoFailureException
Picked up JAVA_TOOL_OPTIONS: -Dmaven.ext.class.path="f:\jenkins\jenkins-slave\workspace\_maven-scm-publish-plugin_master@2@tmp\withMaven2563db04\pipeline-maven-spy.jar" -Dorg.jenkinsci.plugins.pipeline.maven.reportsFolder="f:\jenkins\jenkins-slave\workspace\_maven-scm-publish-plugin_master@2@tmp\withMaven2563db04"
[Pipeline] }
[Pipeline] // dir
[Pipeline] }
[withMaven] junitPublisher - Archive test results for Maven artifact org.apache.maven.plugins:maven-scm-publish-plugin:maven-plugin:3.1.0-SNAPSHOT generated by maven-surefire-plugin:test (default-test): windows-jdk8-m3.6.x_build\target\surefire-reports\*.xml
Recording test results
None of the test reports contained any result
[withMaven] openTasksPublisher - Scan Tasks for Maven artifact org.apache.maven.plugins:maven-scm-publish-plugin:maven-plugin:3.1.0-SNAPSHOT in source directory windows-jdk8-m3.6.x_build\src\main\java
[TASKS] Scanning folder 'f:\jenkins\jenkins-slave\workspace\_maven-scm-publish-plugin_master@2' for files matching the pattern 'windows-jdk8-m3.6.x_build\src\main\java\**\*' - excludes: null
[TASKS] Found 3 files to scan for tasks
[TASKS] Found 4 open tasks.
Skipping warnings blame since pipelines do not have an SCM link.%n
[TASKS] Computing warning deltas based on reference build #14
[withMaven] invokerPublisher - Archive invoker results for Maven artifact MavenArtifact{org.apache.maven.plugins:maven-scm-publish-plugin:maven-plugin:3.1.0-SNAPSHOT(version: 3.1.0-SNAPSHOT, snapshot:false) } generated by PluginInvocation{org.apache.maven.plugins:maven-invoker-plugin:3.1.0@integration-test  integration-test}: windows-jdk8-m3.6.x_build\target\invoker-reports\*.xml
[withMaven] Publishers: Generated Artifacts Publisher: 234 ms, Junit Publisher: 114 ms, Open Task Scanner Publisher: 381 ms, Invoker Publisher: 4109 ms
[Pipeline] // withMaven
[Pipeline] cleanWs
[WS-CLEANUP] Deleting project workspace...
[WS-CLEANUP] Deferred wipeout is used...
[WS-CLEANUP] done
[Pipeline] cleanWs
[WS-CLEANUP] Deleting project workspace...
[WS-CLEANUP] Deferred wipeout is used...
[WS-CLEANUP] done
[Pipeline] }
[Pipeline] // stage
[Pipeline] }
[Pipeline] // ws
[Pipeline] }
[Pipeline] // node
[Pipeline] }
Failed in branch windows-jdk8-m3.6.x_build
[Pipeline] // parallel
[Pipeline] stage
[Pipeline] { (Notifications)
[Pipeline] echo
Build result: FAILURE
[Pipeline] jiraIssueSelector
[Pipeline] emailext
Reply | Threaded
Open this post in threaded view
|

Build succeeded in Jenkins: Maven TLP » maven-scm-publish-plugin » master #16

Apache Jenkins Server-2
See https://builds.apache.org/job/maven-box/job/maven-scm-publish-plugin/job/master/16/

Changes:

* Add JDK 14 (latest)
* deploy SNAPSHOT only if  (env.BRANCH_NAME == 'master' && jdk == '8' &&
* deploy only os == linux
* deploy only with 3.6.x
* no need to execute tests twice..
* this one can deploy as well
* Update asfMavenTlpStdBuild.groovy
* no need to filter on maven version only one is used here
* [MSCMPUB-41] Add the ability to deploy into SCM sub-directory (#5)
* [MSCMPUB-41] Add the ability to deploy into SCM sub-directory (#5)
* [MSCMPUB-41] Add the ability to deploy into SCM sub-directory (#5)
* [MSCMPUB-41] Add the ability to deploy into SCM sub-directory (#5)
* [MSCMPUB-41] Add the ability to deploy into SCM sub-directory (#5)
* [MSCMPUB-41] Add the ability to deploy into SCM sub-directory (#5)

No tests ran.