Build failed in Jenkins: Maven TLP » maven-scm » SCM-917 #8

classic Classic list List threaded Threaded
2 messages Options
Reply | Threaded
Open this post in threaded view
|

Build failed in Jenkins: Maven TLP » maven-scm » SCM-917 #8

Apache Jenkins Server-2
See https://builds.apache.org/job/maven-box/job/maven-scm/job/SCM-917/8/

No changes.

All tests passed

Build log:
[...truncated 65736 lines...]
[INFO] Executing: cmd.exe /X /C "git clone --branch mytag file:///F:/jenkins/jenkins-slave/workspace/maven-box_maven-scm_SCM-917/m/maven-scm-plugin/target/repository mytag"
[INFO] Executing: cmd.exe /X /C "git clone --branch mytag file:///F:/jenkins/jenkins-slave/workspace/maven-box_maven-scm_SCM-917/m/maven-scm-plugin/target/repository mytag"
[INFO] Executing: cmd.exe /X /C "git clone --branch mytag file:///F:/jenkins/jenkins-slave/workspace/maven-box_maven-scm_SCM-917/m/maven-scm-plugin/target/repository mytag"
[INFO] Working directory: F:\jenkins\jenkins-slave\workspace\maven-box_maven-scm_SCM-917\m\maven-scm-plugin\target\tags
[INFO] Working directory: F:\jenkins\jenkins-slave\workspace\maven-box_maven-scm_SCM-917\m\maven-scm-plugin\target\tags
[INFO] Working directory: F:\jenkins\jenkins-slave\workspace\maven-box_maven-scm_SCM-917\m\maven-scm-plugin\target\tags
[INFO] Working directory: F:\jenkins\jenkins-slave\workspace\maven-box_maven-scm_SCM-917\m\maven-scm-plugin\target\tags
[ERROR] Provider message:
[ERROR] The git-clone command failed.
[ERROR] Command output:
[ERROR] Cloning into 'mytag'...
fatal: Remote branch mytag not found in upstream origin
fatal: The remote end hung up unexpectedly

[INFO] Tests run: 1, Failures: 0, Errors: 0, Skipped: 0, Time elapsed: 3.107 s - in org.apache.maven.scm.plugin.UntagMojoTest
[INFO] Running org.apache.maven.scm.plugin.UpdateMojoTest
Test command line: cmd.exe /X /C "svnadmin create repository"
[INFO] Removing target\checkout
[INFO] Executing: cmd.exe /X /C "svn --non-interactive checkout file:///F:/jenkins/jenkins-slave/workspace/maven-box_maven-scm_SCM-917/m/maven-scm-plugin/target/repository/trunk@ F:\jenkins\jenkins-slave\workspace\maven-box_maven-scm_SCM-917\m\maven-scm-plugin\target\checkout"
[INFO] Working directory: F:\jenkins\jenkins-slave\workspace\maven-box_maven-scm_SCM-917\m\maven-scm-plugin\target
[INFO] Executing: cmd.exe /X /C "svn --non-interactive update F:\jenkins\jenkins-slave\workspace\maven-box_maven-scm_SCM-917\m\maven-scm-plugin\target\checkout@"
[INFO] Executing: cmd.exe /X /C "svn --non-interactive update F:\jenkins\jenkins-slave\workspace\maven-box_maven-scm_SCM-917\m\maven-scm-plugin\target\checkout@"
[INFO] Working directory: F:\jenkins\jenkins-slave\workspace\maven-box_maven-scm_SCM-917\m\maven-scm-plugin\target\checkout
[INFO] Working directory: F:\jenkins\jenkins-slave\workspace\maven-box_maven-scm_SCM-917\m\maven-scm-plugin\target\checkout
[INFO] Storing revision in 'scm.revision' project property.
[INFO] Project at revision 8
[INFO] Tests run: 1, Failures: 0, Errors: 0, Skipped: 0, Time elapsed: 1.98 s - in org.apache.maven.scm.plugin.UpdateMojoTest
[INFO] Running org.apache.maven.scm.plugin.ValidateMojoTest
[ERROR] Validation of scm url connection (project.scm.connection) failed :
[ERROR] No such provider installed 'unknwonProvider'.
[ERROR] The invalid scm url connection: 'scm:unknwonProvider:http://svn.apache.org/repos/asf/maven/scm/trunk'.
[INFO] project.scm.connection scm connection string is valid.
[INFO] project.scm.developerConnection scm connection string is valid.
[INFO] Tests run: 3, Failures: 0, Errors: 0, Skipped: 0, Time elapsed: 0.124 s - in org.apache.maven.scm.plugin.ValidateMojoTest
[INFO]
[INFO] Results:
[INFO]
[INFO] Tests run: 23, Failures: 0, Errors: 0, Skipped: 0
[INFO]
[INFO]
[INFO] --- maven-jar-plugin:3.1.0:jar (default-jar) @ maven-scm-plugin ---
[INFO] Building jar: F:\jenkins\jenkins-slave\workspace\maven-box_maven-scm_SCM-917\m\maven-scm-plugin\target\maven-scm-plugin-1.11.2-SNAPSHOT.jar
[INFO]
[INFO] --- maven-plugin-plugin:3.2:addPluginArtifactMetadata (default-addPluginArtifactMetadata) @ maven-scm-plugin ---
[INFO]
[INFO] --- maven-site-plugin:3.7.1:attach-descriptor (attach-descriptor) @ maven-scm-plugin ---
[INFO] Skipping because packaging 'maven-plugin' is not pom.
[INFO]
[INFO] --- maven-invoker-plugin:3.1.0:install (integration-test) @ maven-scm-plugin ---
[INFO] Downloading from central: https://repo.maven.apache.org/maven2/org/apache/maven/shared/maven-invoker/3.0.1/maven-invoker-3.0.1.pom
[INFO] Downloaded from central: https://repo.maven.apache.org/maven2/org/apache/maven/shared/maven-invoker/3.0.1/maven-invoker-3.0.1.pom (4.9 kB at 39 kB/s)
[INFO] Downloading from central: https://repo.maven.apache.org/maven2/org/apache/maven/shared/maven-shared-components/31/maven-shared-components-31.pom
[INFO] Downloaded from central: https://repo.maven.apache.org/maven2/org/apache/maven/shared/maven-shared-components/31/maven-shared-components-31.pom (5.1 kB at 256 kB/s)
[INFO] Downloading from central: https://repo.maven.apache.org/maven2/org/apache/maven/reporting/maven-reporting-impl/2.4/maven-reporting-impl-2.4.pom
[INFO] Downloaded from central: https://repo.maven.apache.org/maven2/org/apache/maven/reporting/maven-reporting-impl/2.4/maven-reporting-impl-2.4.pom (6.1 kB at 303 kB/s)
[INFO] Downloading from central: https://repo.maven.apache.org/maven2/commons-validator/commons-validator/1.4.1/commons-validator-1.4.1.pom
[INFO] Downloaded from central: https://repo.maven.apache.org/maven2/commons-validator/commons-validator/1.4.1/commons-validator-1.4.1.pom (13 kB at 603 kB/s)
[INFO] Downloading from central: https://repo.maven.apache.org/maven2/org/apache/commons/commons-parent/36/commons-parent-36.pom
[INFO] Downloaded from central: https://repo.maven.apache.org/maven2/org/apache/commons/commons-parent/36/commons-parent-36.pom (58 kB at 2.1 MB/s)
[INFO] Downloading from central: https://repo.maven.apache.org/maven2/commons-beanutils/commons-beanutils/1.8.3/commons-beanutils-1.8.3.pom
[INFO] Downloaded from central: https://repo.maven.apache.org/maven2/commons-beanutils/commons-beanutils/1.8.3/commons-beanutils-1.8.3.pom (11 kB at 589 kB/s)
[INFO] Downloading from central: https://repo.maven.apache.org/maven2/org/apache/commons/commons-parent/14/commons-parent-14.pom
[INFO] Downloaded from central: https://repo.maven.apache.org/maven2/org/apache/commons/commons-parent/14/commons-parent-14.pom (31 kB at 1.4 MB/s)
[INFO] Downloading from central: https://repo.maven.apache.org/maven2/commons-digester/commons-digester/1.8.1/commons-digester-1.8.1.pom
[INFO] Downloaded from central: https://repo.maven.apache.org/maven2/commons-digester/commons-digester/1.8.1/commons-digester-1.8.1.pom (10 kB at 590 kB/s)
[INFO] Downloading from central: https://repo.maven.apache.org/maven2/org/apache/maven/shared/maven-script-interpreter/1.2/maven-script-interpreter-1.2.pom
[INFO] Downloaded from central: https://repo.maven.apache.org/maven2/org/apache/maven/shared/maven-script-interpreter/1.2/maven-script-interpreter-1.2.pom (4.0 kB at 200 kB/s)
[INFO] Downloading from central: https://repo.maven.apache.org/maven2/org/apache/ant/ant/1.8.1/ant-1.8.1.pom
[INFO] Downloaded from central: https://repo.maven.apache.org/maven2/org/apache/ant/ant/1.8.1/ant-1.8.1.pom (8.8 kB at 338 kB/s)
[INFO] Downloading from central: https://repo.maven.apache.org/maven2/org/apache/ant/ant-parent/1.8.1/ant-parent-1.8.1.pom
[INFO] Downloaded from central: https://repo.maven.apache.org/maven2/org/apache/ant/ant-parent/1.8.1/ant-parent-1.8.1.pom (4.3 kB at 225 kB/s)
[INFO] Downloading from central: https://repo.maven.apache.org/maven2/org/apache/maven/shared/maven-artifact-transfer/0.9.1/maven-artifact-transfer-0.9.1.pom
[INFO] Downloaded from central: https://repo.maven.apache.org/maven2/org/apache/maven/shared/maven-artifact-transfer/0.9.1/maven-artifact-transfer-0.9.1.pom (7.6 kB at 448 kB/s)
[INFO] Downloading from central: https://repo.maven.apache.org/maven2/org/apache/maven/doxia/doxia-sink-api/1.7/doxia-sink-api-1.7.pom
[INFO] Downloaded from central: https://repo.maven.apache.org/maven2/org/apache/maven/doxia/doxia-sink-api/1.7/doxia-sink-api-1.7.pom (1.5 kB at 90 kB/s)
[INFO] Downloading from central: https://repo.maven.apache.org/maven2/org/apache/maven/doxia/doxia/1.7/doxia-1.7.pom
[INFO] Downloaded from central: https://repo.maven.apache.org/maven2/org/apache/maven/doxia/doxia/1.7/doxia-1.7.pom (15 kB at 1.1 MB/s)
[INFO] Downloading from central: https://repo.maven.apache.org/maven2/org/apache/maven/doxia/doxia-logging-api/1.7/doxia-logging-api-1.7.pom
[INFO] Downloaded from central: https://repo.maven.apache.org/maven2/org/apache/maven/doxia/doxia-logging-api/1.7/doxia-logging-api-1.7.pom (1.5 kB at 90 kB/s)
[INFO] Downloading from central: https://repo.maven.apache.org/maven2/org/apache/maven/doxia/doxia-site-renderer/1.7.4/doxia-site-renderer-1.7.4.pom
[INFO] Downloaded from central: https://repo.maven.apache.org/maven2/org/apache/maven/doxia/doxia-site-renderer/1.7.4/doxia-site-renderer-1.7.4.pom (6.7 kB at 418 kB/s)
[INFO] Downloading from central: https://repo.maven.apache.org/maven2/org/apache/maven/doxia/doxia-sitetools/1.7.4/doxia-sitetools-1.7.4.pom
[INFO] Downloaded from central: https://repo.maven.apache.org/maven2/org/apache/maven/doxia/doxia-sitetools/1.7.4/doxia-sitetools-1.7.4.pom (14 kB at 852 kB/s)
[INFO] Downloading from central: https://repo.maven.apache.org/maven2/org/apache/maven/doxia/doxia-core/1.7/doxia-core-1.7.pom
[INFO] Downloaded from central: https://repo.maven.apache.org/maven2/org/apache/maven/doxia/doxia-core/1.7/doxia-core-1.7.pom (4.1 kB at 226 kB/s)
[INFO] Downloading from central: https://repo.maven.apache.org/maven2/org/apache/maven/doxia/doxia-decoration-model/1.7.4/doxia-decoration-model-1.7.4.pom
[INFO] Downloaded from central: https://repo.maven.apache.org/maven2/org/apache/maven/doxia/doxia-decoration-model/1.7.4/doxia-decoration-model-1.7.4.pom (3.4 kB at 212 kB/s)
[INFO] Downloading from central: https://repo.maven.apache.org/maven2/org/apache/maven/doxia/doxia-skin-model/1.7.4/doxia-skin-model-1.7.4.pom
[INFO] Downloaded from central: https://repo.maven.apache.org/maven2/org/apache/maven/doxia/doxia-skin-model/1.7.4/doxia-skin-model-1.7.4.pom (3.0 kB at 144 kB/s)
[INFO] Downloading from central: https://repo.maven.apache.org/maven2/org/apache/maven/doxia/doxia-module-xhtml/1.7/doxia-module-xhtml-1.7.pom
[INFO] Downloaded from central: https://repo.maven.apache.org/maven2/org/apache/maven/doxia/doxia-module-xhtml/1.7/doxia-module-xhtml-1.7.pom (1.6 kB at 91 kB/s)
[INFO] Downloading from central: https://repo.maven.apache.org/maven2/org/apache/maven/doxia/doxia-modules/1.7/doxia-modules-1.7.pom
[INFO] Downloaded from central: https://repo.maven.apache.org/maven2/org/apache/maven/doxia/doxia-modules/1.7/doxia-modules-1.7.pom (2.6 kB at 164 kB/s)
[INFO] Downloading from central: https://repo.maven.apache.org/maven2/org/codehaus/groovy/groovy-all/2.4.8/groovy-all-2.4.8.pom
[INFO] Downloaded from central: https://repo.maven.apache.org/maven2/org/codehaus/groovy/groovy-all/2.4.8/groovy-all-2.4.8.pom (21 kB at 1.3 MB/s)
[INFO] Downloading from central: https://repo.maven.apache.org/maven2/commons-validator/commons-validator/1.4.1/commons-validator-1.4.1.jar
[INFO] Downloading from central: https://repo.maven.apache.org/maven2/org/apache/maven/reporting/maven-reporting-impl/2.4/maven-reporting-impl-2.4.jar
[INFO] Downloading from central: https://repo.maven.apache.org/maven2/commons-digester/commons-digester/1.8.1/commons-digester-1.8.1.jar
[INFO] Downloading from central: https://repo.maven.apache.org/maven2/org/apache/maven/shared/maven-invoker/3.0.1/maven-invoker-3.0.1.jar
[INFO] Downloading from central: https://repo.maven.apache.org/maven2/commons-beanutils/commons-beanutils/1.8.3/commons-beanutils-1.8.3.jar
[INFO] Downloaded from central: https://repo.maven.apache.org/maven2/org/apache/maven/reporting/maven-reporting-impl/2.4/maven-reporting-impl-2.4.jar (20 kB at 415 kB/s)
[INFO] Downloading from central: https://repo.maven.apache.org/maven2/commons-logging/commons-logging/1.2/commons-logging-1.2.jar
[INFO] Downloaded from central: https://repo.maven.apache.org/maven2/org/apache/maven/shared/maven-invoker/3.0.1/maven-invoker-3.0.1.jar (33 kB at 524 kB/s)
[INFO] Downloading from central: https://repo.maven.apache.org/maven2/org/apache/maven/shared/maven-script-interpreter/1.2/maven-script-interpreter-1.2.jar
[INFO] Downloaded from central: https://repo.maven.apache.org/maven2/commons-beanutils/commons-beanutils/1.8.3/commons-beanutils-1.8.3.jar (232 kB at 3.5 MB/s)
[INFO] Downloading from central: https://repo.maven.apache.org/maven2/org/apache/ant/ant/1.8.1/ant-1.8.1.jar
[INFO] Downloaded from central: https://repo.maven.apache.org/maven2/commons-logging/commons-logging/1.2/commons-logging-1.2.jar (62 kB at 322 kB/s)
[INFO] Downloading from central: https://repo.maven.apache.org/maven2/org/apache/maven/shared/maven-artifact-transfer/0.9.1/maven-artifact-transfer-0.9.1.jar
[INFO] Downloaded from central: https://repo.maven.apache.org/maven2/org/apache/ant/ant/1.8.1/ant-1.8.1.jar (1.5 MB at 4.6 MB/s)
[INFO] Downloading from central: https://repo.maven.apache.org/maven2/org/apache/maven/doxia/doxia-sink-api/1.7/doxia-sink-api-1.7.jar
[INFO] Downloaded from central: https://repo.maven.apache.org/maven2/org/apache/maven/shared/maven-script-interpreter/1.2/maven-script-interpreter-1.2.jar (22 kB at 64 kB/s)
[INFO] Downloading from central: https://repo.maven.apache.org/maven2/org/apache/maven/doxia/doxia-logging-api/1.7/doxia-logging-api-1.7.jar
[INFO] Downloaded from central: https://repo.maven.apache.org/maven2/commons-digester/commons-digester/1.8.1/commons-digester-1.8.1.jar (146 kB at 412 kB/s)
[INFO] Downloading from central: https://repo.maven.apache.org/maven2/org/apache/maven/doxia/doxia-site-renderer/1.7.4/doxia-site-renderer-1.7.4.jar
[INFO] Downloaded from central: https://repo.maven.apache.org/maven2/org/apache/maven/doxia/doxia-sink-api/1.7/doxia-sink-api-1.7.jar (11 kB at 28 kB/s)
[INFO] Downloading from central: https://repo.maven.apache.org/maven2/org/apache/maven/doxia/doxia-decoration-model/1.7.4/doxia-decoration-model-1.7.4.jar
[INFO] Downloaded from central: https://repo.maven.apache.org/maven2/org/apache/maven/doxia/doxia-logging-api/1.7/doxia-logging-api-1.7.jar (12 kB at 26 kB/s)
[INFO] Downloading from central: https://repo.maven.apache.org/maven2/org/apache/maven/doxia/doxia-skin-model/1.7.4/doxia-skin-model-1.7.4.jar
[INFO] Downloaded from central: https://repo.maven.apache.org/maven2/org/apache/maven/doxia/doxia-decoration-model/1.7.4/doxia-decoration-model-1.7.4.jar (61 kB at 137 kB/s)
[INFO] Downloading from central: https://repo.maven.apache.org/maven2/org/apache/maven/doxia/doxia-module-xhtml/1.7/doxia-module-xhtml-1.7.jar
[INFO] Downloaded from central: https://repo.maven.apache.org/maven2/org/apache/maven/doxia/doxia-skin-model/1.7.4/doxia-skin-model-1.7.4.jar (16 kB at 35 kB/s)
[INFO] Downloading from central: https://repo.maven.apache.org/maven2/org/codehaus/groovy/groovy-all/2.4.8/groovy-all-2.4.8.jar
[INFO] Downloaded from central: https://repo.maven.apache.org/maven2/org/apache/maven/doxia/doxia-site-renderer/1.7.4/doxia-site-renderer-1.7.4.jar (64 kB at 135 kB/s)
[INFO] Downloaded from central: https://repo.maven.apache.org/maven2/commons-validator/commons-validator/1.4.1/commons-validator-1.4.1.jar (190 kB at 371 kB/s)
[INFO] Downloaded from central: https://repo.maven.apache.org/maven2/org/apache/maven/doxia/doxia-module-xhtml/1.7/doxia-module-xhtml-1.7.jar (17 kB at 32 kB/s)
[INFO] Downloaded from central: https://repo.maven.apache.org/maven2/org/apache/maven/shared/maven-artifact-transfer/0.9.1/maven-artifact-transfer-0.9.1.jar (123 kB at 199 kB/s)
[INFO] Downloaded from central: https://repo.maven.apache.org/maven2/org/codehaus/groovy/groovy-all/2.4.8/groovy-all-2.4.8.jar (7.0 MB at 11 MB/s)
[INFO] Installing F:\jenkins\jenkins-slave\workspace\maven-box_maven-scm_SCM-917\m\maven-scm-managers\maven-scm-manager-plexus\pom.xml to F:\jenkins\jenkins-slave\workspace\maven-box_maven-scm_SCM-917\m\maven-scm-plugin\target\local-repo\org\apache\maven\scm\maven-scm-manager-plexus\1.11.2-SNAPSHOT\maven-scm-manager-plexus-1.11.2-SNAPSHOT.pom
[INFO] Installing F:\jenkins\jenkins-slave\workspace\maven-box_maven-scm_SCM-917\m\maven-scm-managers\maven-scm-manager-plexus\target\maven-scm-manager-plexus-1.11.2-SNAPSHOT.jar to F:\jenkins\jenkins-slave\workspace\maven-box_maven-scm_SCM-917\m\maven-scm-plugin\target\local-repo\org\apache\maven\scm\maven-scm-manager-plexus\1.11.2-SNAPSHOT\maven-scm-manager-plexus-1.11.2-SNAPSHOT.jar
[INFO] Installing F:\jenkins\jenkins-slave\workspace\maven-box_maven-scm_SCM-917\m\maven-scm-managers\pom.xml to F:\jenkins\jenkins-slave\workspace\maven-box_maven-scm_SCM-917\m\maven-scm-plugin\target\local-repo\org\apache\maven\scm\maven-scm-managers\1.11.2-SNAPSHOT\maven-scm-managers-1.11.2-SNAPSHOT.pom
[INFO] Installing f:\jenkins\jenkins-slave\workspace\maven-box_maven-scm_SCM-917\m\pom.xml to F:\jenkins\jenkins-slave\workspace\maven-box_maven-scm_SCM-917\m\maven-scm-plugin\target\local-repo\org\apache\maven\scm\maven-scm\1.11.2-SNAPSHOT\maven-scm-1.11.2-SNAPSHOT.pom
[INFO] Installing F:\jenkins\jenkins-slave\workspace\maven-box_maven-scm_SCM-917\m\maven-scm-providers\maven-scm-providers-git\maven-scm-provider-gittest\pom.xml to F:\jenkins\jenkins-slave\workspace\maven-box_maven-scm_SCM-917\m\maven-scm-plugin\target\local-repo\org\apache\maven\scm\maven-scm-provider-gittest\1.11.2-SNAPSHOT\maven-scm-provider-gittest-1.11.2-SNAPSHOT.pom
[INFO] Installing F:\jenkins\jenkins-slave\workspace\maven-box_maven-scm_SCM-917\m\maven-scm-providers\maven-scm-providers-git\maven-scm-provider-gittest\target\maven-scm-provider-gittest-1.11.2-SNAPSHOT.jar to F:\jenkins\jenkins-slave\workspace\maven-box_maven-scm_SCM-917\m\maven-scm-plugin\target\local-repo\org\apache\maven\scm\maven-scm-provider-gittest\1.11.2-SNAPSHOT\maven-scm-provider-gittest-1.11.2-SNAPSHOT.jar
[INFO] Installing F:\jenkins\jenkins-slave\workspace\maven-box_maven-scm_SCM-917\m\maven-scm-providers\maven-scm-providers-git\pom.xml to F:\jenkins\jenkins-slave\workspace\maven-box_maven-scm_SCM-917\m\maven-scm-plugin\target\local-repo\org\apache\maven\scm\maven-scm-providers-git\1.11.2-SNAPSHOT\maven-scm-providers-git-1.11.2-SNAPSHOT.pom
[INFO] Installing F:\jenkins\jenkins-slave\workspace\maven-box_maven-scm_SCM-917\m\maven-scm-providers\pom.xml to F:\jenkins\jenkins-slave\workspace\maven-box_maven-scm_SCM-917\m\maven-scm-plugin\target\local-repo\org\apache\maven\scm\maven-scm-providers\1.11.2-SNAPSHOT\maven-scm-providers-1.11.2-SNAPSHOT.pom
[INFO] Installing F:\jenkins\jenkins-slave\workspace\maven-box_maven-scm_SCM-917\m\maven-scm-providers\maven-scm-provider-local\pom.xml to F:\jenkins\jenkins-slave\workspace\maven-box_maven-scm_SCM-917\m\maven-scm-plugin\target\local-repo\org\apache\maven\scm\maven-scm-provider-local\1.11.2-SNAPSHOT\maven-scm-provider-local-1.11.2-SNAPSHOT.pom
[INFO] Installing F:\jenkins\jenkins-slave\workspace\maven-box_maven-scm_SCM-917\m\maven-scm-providers\maven-scm-provider-local\target\maven-scm-provider-local-1.11.2-SNAPSHOT.jar to F:\jenkins\jenkins-slave\workspace\maven-box_maven-scm_SCM-917\m\maven-scm-plugin\target\local-repo\org\apache\maven\scm\maven-scm-provider-local\1.11.2-SNAPSHOT\maven-scm-provider-local-1.11.2-SNAPSHOT.jar
[INFO] Installing F:\jenkins\jenkins-slave\workspace\maven-box_maven-scm_SCM-917\m\maven-scm-providers\maven-scm-providers-svn\maven-scm-provider-svn-commons\pom.xml to F:\jenkins\jenkins-slave\workspace\maven-box_maven-scm_SCM-917\m\maven-scm-plugin\target\local-repo\org\apache\maven\scm\maven-scm-provider-svn-commons\1.11.2-SNAPSHOT\maven-scm-provider-svn-commons-1.11.2-SNAPSHOT.pom
[INFO] Installing F:\jenkins\jenkins-slave\workspace\maven-box_maven-scm_SCM-917\m\maven-scm-providers\maven-scm-providers-svn\maven-scm-provider-svn-commons\target\maven-scm-provider-svn-commons-1.11.2-SNAPSHOT.jar to F:\jenkins\jenkins-slave\workspace\maven-box_maven-scm_SCM-917\m\maven-scm-plugin\target\local-repo\org\apache\maven\scm\maven-scm-provider-svn-commons\1.11.2-SNAPSHOT\maven-scm-provider-svn-commons-1.11.2-SNAPSHOT.jar
[INFO] Installing F:\jenkins\jenkins-slave\workspace\maven-box_maven-scm_SCM-917\m\maven-scm-providers\maven-scm-providers-svn\pom.xml to F:\jenkins\jenkins-slave\workspace\maven-box_maven-scm_SCM-917\m\maven-scm-plugin\target\local-repo\org\apache\maven\scm\maven-scm-providers-svn\1.11.2-SNAPSHOT\maven-scm-providers-svn-1.11.2-SNAPSHOT.pom
[INFO] Installing F:\jenkins\jenkins-slave\workspace\maven-box_maven-scm_SCM-917\m\maven-scm-providers\maven-scm-providers-svn\maven-scm-provider-svntest\pom.xml to F:\jenkins\jenkins-slave\workspace\maven-box_maven-scm_SCM-917\m\maven-scm-plugin\target\local-repo\org\apache\maven\scm\maven-scm-provider-svntest\1.11.2-SNAPSHOT\maven-scm-provider-svntest-1.11.2-SNAPSHOT.pom
[INFO] Installing F:\jenkins\jenkins-slave\workspace\maven-box_maven-scm_SCM-917\m\maven-scm-providers\maven-scm-providers-svn\maven-scm-provider-svntest\target\maven-scm-provider-svntest-1.11.2-SNAPSHOT.jar to F:\jenkins\jenkins-slave\workspace\maven-box_maven-scm_SCM-917\m\maven-scm-plugin\target\local-repo\org\apache\maven\scm\maven-scm-provider-svntest\1.11.2-SNAPSHOT\maven-scm-provider-svntest-1.11.2-SNAPSHOT.jar
[INFO] Installing F:\jenkins\jenkins-slave\workspace\maven-box_maven-scm_SCM-917\m\maven-scm-providers\maven-scm-providers-standard\pom.xml to F:\jenkins\jenkins-slave\workspace\maven-box_maven-scm_SCM-917\m\maven-scm-plugin\target\local-repo\org\apache\maven\scm\maven-scm-providers-standard\1.11.2-SNAPSHOT\maven-scm-providers-standard-1.11.2-SNAPSHOT.pom
[INFO] Installing F:\jenkins\jenkins-slave\workspace\maven-box_maven-scm_SCM-917\m\maven-scm-plugin\pom.xml to F:\jenkins\jenkins-slave\workspace\maven-box_maven-scm_SCM-917\m\maven-scm-plugin\target\local-repo\org\apache\maven\plugins\maven-scm-plugin\1.11.2-SNAPSHOT\maven-scm-plugin-1.11.2-SNAPSHOT.pom
[INFO] Installing F:\jenkins\jenkins-slave\workspace\maven-box_maven-scm_SCM-917\m\maven-scm-plugin\target\maven-scm-plugin-1.11.2-SNAPSHOT.jar to F:\jenkins\jenkins-slave\workspace\maven-box_maven-scm_SCM-917\m\maven-scm-plugin\target\local-repo\org\apache\maven\plugins\maven-scm-plugin\1.11.2-SNAPSHOT\maven-scm-plugin-1.11.2-SNAPSHOT.jar
[INFO]
[INFO] --- maven-invoker-plugin:3.1.0:run (integration-test) @ maven-scm-plugin ---
[INFO] No projects were selected for execution.
[INFO]
[INFO] --- maven-checkstyle-plugin:3.0.0:check (checkstyle-check) @ maven-scm-plugin ---
[INFO] ------------------------------------------------------------------------
[INFO] Reactor Summary for Maven SCM 1.11.2-SNAPSHOT:
[INFO]
[INFO] Maven SCM .......................................... SUCCESS [ 47.879 s]
[INFO] Maven SCM API ...................................... SUCCESS [ 18.937 s]
[INFO] Maven SCM Managers ................................. SUCCESS [  1.047 s]
[INFO] Maven SCM Manager for Plexus ....................... SUCCESS [  6.073 s]
[INFO] Maven SCM Test ..................................... SUCCESS [  7.476 s]
[INFO] Maven SCM Providers ................................ SUCCESS [  1.724 s]
[INFO] Maven SCM AccuRev Provider ......................... SUCCESS [ 13.211 s]
[INFO] Maven SCM Bazaar Provider .......................... SUCCESS [  6.099 s]
[INFO] Maven SCM Clearcase Provider ....................... SUCCESS [ 11.725 s]
[INFO] Maven SCM CVS Provider - Parent .................... SUCCESS [  1.371 s]
[INFO] Maven SCM CVS Provider TCK tests ................... SUCCESS [  3.632 s]
[INFO] Maven SCM CVS Provider - Common library ............ SUCCESS [  6.413 s]
[INFO] Maven SCM CVS Provider - CVS Executable Impl. ...... SUCCESS [  4.466 s]
[INFO] Maven SCM CVS Provider - CVS Java Impl. ............ SUCCESS [  5.586 s]
[INFO] Maven SCM Mercurial (Hg) Provider .................. SUCCESS [  5.049 s]
[INFO] Maven SCM Git Provider - Parent .................... SUCCESS [  1.106 s]
[INFO] Maven SCM Git Provider - Common library ............ SUCCESS [  4.563 s]
[INFO] Maven SCM Git Provider TCK Tests ................... SUCCESS [  2.111 s]
[INFO] Maven SCM Git Provider - Git Executable Impl. ...... SUCCESS [ 19.049 s]
[INFO] Maven SCM Git Provider - JGit Impl. ................ SUCCESS [ 58.602 s]
[INFO] Maven SCM Local Provider ........................... SUCCESS [  4.500 s]
[INFO] Maven SCM Perforce Provider ........................ SUCCESS [  6.992 s]
[INFO] Maven SCM Starteam Provider ........................ SUCCESS [  8.588 s]
[INFO] Maven SCM Subversion Provider - Parent ............. SUCCESS [  1.209 s]
[INFO] Maven SCM Subversion Provider - Common library ..... SUCCESS [  4.724 s]
[INFO] Maven SCM Subversion Provider TCK Tests ............ SUCCESS [  2.040 s]
[INFO] Maven SCM Subversion Provider - SVN Executable Impl. SUCCESS [  9.419 s]
[INFO] Maven SCM Synergy Provider ......................... SUCCESS [  5.296 s]
[INFO] Maven SCM Visual Source Safe Provider .............. SUCCESS [  5.036 s]
[INFO] Maven SCM TFS Provider ............................. SUCCESS [  4.304 s]
[INFO] Maven SCM MKS Integrity Provider ................... SUCCESS [  5.730 s]
[INFO] Maven SCM Jazz/Rational Team Concert Provider ...... SUCCESS [  6.450 s]
[INFO] Maven SCM Standard Providers ....................... SUCCESS [  2.684 s]
[INFO] Maven SCM Client ................................... SUCCESS [  7.175 s]
[INFO] Maven SCM Plugin ................................... SUCCESS [ 52.873 s]
[INFO] ------------------------------------------------------------------------
[INFO] BUILD SUCCESS
[INFO] ------------------------------------------------------------------------
[INFO] Total time:  05:55 min
[INFO] Finished at: 2019-06-17T18:14:53-07:00
[INFO] ------------------------------------------------------------------------
[WARNING] The requested profile "run-its" could not be activated because it does not exist.
[INFO] [jenkins-event-spy] Generated F:\jenkins\jenkins-slave\workspace\maven-box_maven-scm_SCM-917@tmp\withMaven23fdce4e\maven-spy-20190617-180858-7513276185204235039509.log
[Pipeline] }
[Pipeline] // dir
[Pipeline] }
[withMaven] invokerPublisher - Archive invoker results for Maven artifact MavenArtifact{org.apache.maven.plugins:maven-scm-plugin:maven-plugin:1.11.2-SNAPSHOT(version: 1.11.2-SNAPSHOT, snapshot:false) } generated by PluginInvocation{org.apache.maven.plugins:maven-invoker-plugin:3.1.0@run  integration-test}: m\maven-scm-plugin\target\invoker-reports\*.xml
[withMaven] junitPublisher - Archive test results for Maven artifact org.apache.maven.scm:maven-scm-api:jar:1.11.2-SNAPSHOT generated by maven-surefire-plugin:test (default-test): m\maven-scm-api\target\surefire-reports\*.xml
[withMaven] junitPublisher - Archive test results for Maven artifact org.apache.maven.scm:maven-scm-manager-plexus:jar:1.11.2-SNAPSHOT generated by maven-surefire-plugin:test (default-test): m\maven-scm-managers\maven-scm-manager-plexus\target\surefire-reports\*.xml
[withMaven] junitPublisher - Archive test results for Maven artifact org.apache.maven.scm:maven-scm-test:jar:1.11.2-SNAPSHOT generated by maven-surefire-plugin:test (default-test): m\maven-scm-test\target\surefire-reports\*.xml
[withMaven] junitPublisher - Archive test results for Maven artifact org.apache.maven.scm:maven-scm-provider-accurev:jar:1.11.2-SNAPSHOT generated by maven-surefire-plugin:test (default-test): m\maven-scm-providers\maven-scm-provider-accurev\target\surefire-reports\*.xml
[withMaven] junitPublisher - Archive test results for Maven artifact org.apache.maven.scm:maven-scm-provider-bazaar:jar:1.11.2-SNAPSHOT generated by maven-surefire-plugin:test (default-test): m\maven-scm-providers\maven-scm-provider-bazaar\target\surefire-reports\*.xml
[withMaven] junitPublisher - Archive test results for Maven artifact org.apache.maven.scm:maven-scm-provider-clearcase:jar:1.11.2-SNAPSHOT generated by maven-surefire-plugin:test (default-test): m\maven-scm-providers\maven-scm-provider-clearcase\target\surefire-reports\*.xml
[withMaven] junitPublisher - Archive test results for Maven artifact org.apache.maven.scm:maven-scm-provider-cvstest:jar:1.11.2-SNAPSHOT generated by maven-surefire-plugin:test (default-test): m\maven-scm-providers\maven-scm-providers-cvs\maven-scm-provider-cvstest\target\surefire-reports\*.xml
[withMaven] junitPublisher - Archive test results for Maven artifact org.apache.maven.scm:maven-scm-provider-cvs-commons:jar:1.11.2-SNAPSHOT generated by maven-surefire-plugin:test (default-test): m\maven-scm-providers\maven-scm-providers-cvs\maven-scm-provider-cvs-commons\target\surefire-reports\*.xml
[withMaven] junitPublisher - Archive test results for Maven artifact org.apache.maven.scm:maven-scm-provider-cvsexe:jar:1.11.2-SNAPSHOT generated by maven-surefire-plugin:test (default-test): m\maven-scm-providers\maven-scm-providers-cvs\maven-scm-provider-cvsexe\target\surefire-reports\*.xml
[withMaven] junitPublisher - Archive test results for Maven artifact org.apache.maven.scm:maven-scm-provider-cvsjava:jar:1.11.2-SNAPSHOT generated by maven-surefire-plugin:test (default-test): m\maven-scm-providers\maven-scm-providers-cvs\maven-scm-provider-cvsjava\target\surefire-reports\*.xml
[withMaven] junitPublisher - Archive test results for Maven artifact org.apache.maven.scm:maven-scm-provider-hg:jar:1.11.2-SNAPSHOT generated by maven-surefire-plugin:test (default-test): m\maven-scm-providers\maven-scm-provider-hg\target\surefire-reports\*.xml
[withMaven] junitPublisher - Archive test results for Maven artifact org.apache.maven.scm:maven-scm-provider-git-commons:jar:1.11.2-SNAPSHOT generated by maven-surefire-plugin:test (default-test): m\maven-scm-providers\maven-scm-providers-git\maven-scm-provider-git-commons\target\surefire-reports\*.xml
[withMaven] junitPublisher - Archive test results for Maven artifact org.apache.maven.scm:maven-scm-provider-gittest:jar:1.11.2-SNAPSHOT generated by maven-surefire-plugin:test (default-test): m\maven-scm-providers\maven-scm-providers-git\maven-scm-provider-gittest\target\surefire-reports\*.xml
[withMaven] junitPublisher - Archive test results for Maven artifact org.apache.maven.scm:maven-scm-provider-gitexe:jar:1.11.2-SNAPSHOT generated by maven-surefire-plugin:test (default-test): m\maven-scm-providers\maven-scm-providers-git\maven-scm-provider-gitexe\target\surefire-reports\*.xml
[withMaven] junitPublisher - Archive test results for Maven artifact org.apache.maven.scm:maven-scm-provider-jgit:jar:1.11.2-SNAPSHOT generated by maven-surefire-plugin:test (default-test): m\maven-scm-providers\maven-scm-providers-git\maven-scm-provider-jgit\target\surefire-reports\*.xml
[withMaven] junitPublisher - Archive test results for Maven artifact org.apache.maven.scm:maven-scm-provider-local:jar:1.11.2-SNAPSHOT generated by maven-surefire-plugin:test (default-test): m\maven-scm-providers\maven-scm-provider-local\target\surefire-reports\*.xml
[withMaven] junitPublisher - Archive test results for Maven artifact org.apache.maven.scm:maven-scm-provider-perforce:jar:1.11.2-SNAPSHOT generated by maven-surefire-plugin:test (default-test): m\maven-scm-providers\maven-scm-provider-perforce\target\surefire-reports\*.xml
[withMaven] junitPublisher - Archive test results for Maven artifact org.apache.maven.scm:maven-scm-provider-starteam:jar:1.11.2-SNAPSHOT generated by maven-surefire-plugin:test (default-test): m\maven-scm-providers\maven-scm-provider-starteam\target\surefire-reports\*.xml
[withMaven] junitPublisher - Archive test results for Maven artifact org.apache.maven.scm:maven-scm-provider-svn-commons:jar:1.11.2-SNAPSHOT generated by maven-surefire-plugin:test (default-test): m\maven-scm-providers\maven-scm-providers-svn\maven-scm-provider-svn-commons\target\surefire-reports\*.xml
[withMaven] junitPublisher - Archive test results for Maven artifact org.apache.maven.scm:maven-scm-provider-svntest:jar:1.11.2-SNAPSHOT generated by maven-surefire-plugin:test (default-test): m\maven-scm-providers\maven-scm-providers-svn\maven-scm-provider-svntest\target\surefire-reports\*.xml
[withMaven] junitPublisher - Archive test results for Maven artifact org.apache.maven.scm:maven-scm-provider-svnexe:jar:1.11.2-SNAPSHOT generated by maven-surefire-plugin:test (default-test): m\maven-scm-providers\maven-scm-providers-svn\maven-scm-provider-svnexe\target\surefire-reports\*.xml
[withMaven] junitPublisher - Archive test results for Maven artifact org.apache.maven.scm:maven-scm-provider-synergy:jar:1.11.2-SNAPSHOT generated by maven-surefire-plugin:test (default-test): m\maven-scm-providers\maven-scm-provider-synergy\target\surefire-reports\*.xml
[withMaven] junitPublisher - Archive test results for Maven artifact org.apache.maven.scm:maven-scm-provider-vss:jar:1.11.2-SNAPSHOT generated by maven-surefire-plugin:test (default-test): m\maven-scm-providers\maven-scm-provider-vss\target\surefire-reports\*.xml
[withMaven] junitPublisher - Archive test results for Maven artifact org.apache.maven.scm:maven-scm-provider-tfs:jar:1.11.2-SNAPSHOT generated by maven-surefire-plugin:test (default-test): m\maven-scm-providers\maven-scm-provider-tfs\target\surefire-reports\*.xml
[withMaven] junitPublisher - Archive test results for Maven artifact org.apache.maven.scm:maven-scm-provider-integrity:jar:1.11.2-SNAPSHOT generated by maven-surefire-plugin:test (default-test): m\maven-scm-providers\maven-scm-provider-integrity\target\surefire-reports\*.xml
[withMaven] junitPublisher - Archive test results for Maven artifact org.apache.maven.scm:maven-scm-provider-jazz:jar:1.11.2-SNAPSHOT generated by maven-surefire-plugin:test (default-test): m\maven-scm-providers\maven-scm-provider-jazz\target\surefire-reports\*.xml
[withMaven] junitPublisher - Archive test results for Maven artifact org.apache.maven.scm:maven-scm-client:jar:1.11.2-SNAPSHOT generated by maven-surefire-plugin:test (default-test): m\maven-scm-client\target\surefire-reports\*.xml
[withMaven] junitPublisher - Archive test results for Maven artifact org.apache.maven.plugins:maven-scm-plugin:maven-plugin:1.11.2-SNAPSHOT generated by maven-surefire-plugin:test (default-test): m\maven-scm-plugin\target\surefire-reports\*.xml
Recording test results
[withMaven] Publishers: Pipeline Graph Publisher: 27 ms, Invoker Publisher: 619 ms, Junit Publisher: 48597 ms, Concordion Publisher: 25 ms, Dependencies Fingerprint Publisher: 9403 ms, JGiven Publisher: 1 ms, Jacoco Publisher: 1 ms, SpotBugs Publisher: 1 ms
[Pipeline] // withMaven
[Pipeline] cleanWs
[WS-CLEANUP] Deleting project workspace...
[WS-CLEANUP] Deferred wipeout is used...
[WS-CLEANUP] done
[Pipeline] }
[Pipeline] // stage
[Pipeline] }
[Pipeline] // node
[Pipeline] }
[Pipeline] // parallel
[Pipeline] echo
[FAILURE-003] AbortException hudson.AbortException: script returned exit code 1
[Pipeline] stage
[Pipeline] { (Notifications)
[Pipeline] echo
Build result: FAILURE
[Pipeline] jiraIssueSelector
[Pipeline] emailext
Reply | Threaded
Open this post in threaded view
|

Build succeeded in Jenkins: Maven TLP » maven-scm » SCM-917 #9

Apache Jenkins Server-2